{"text_format":"1","workbook":"xlsx","n_sheets":6,"sheets":["Standard Equipment Workbook","Equipment Options","Measure Totals","EquipOpt Lookups","Active Measures","Changelog"],"not_rendered":{"charts":0,"images":1,"macros":1,"external_links":0,"defined_names":49,"comments":1,"pivot_tables":0},"unopened":[],"bounds":{"document_bytes":16777216,"sheet_cells":100000,"rows_first":2000,"rows_last":500,"rows_between":2000,"halvings":0,"cell_chars":16384,"cell_head_chars":4096},"cells_cut":0,"cells_raw":0,"read":"whole","date_system":"1900"}

{"sheet":"Standard Equipment Workbook","index":0,"n_rows":43,"n_cols":30,"rows_kept":43,"cut":false,"hidden":false,"merged":[[32,6,32,14],[32,1,32,5],[32,27,32,33],[34,27,34,33],[34,18,34,26],[33,18,33,26],[32,18,32,26],[21,2,21,33],[16,3,16,33],[17,2,17,33],[22,2,22,33],[18,2,18,33],[19,2,19,33],[20,3,20,33],[23,1,23,33],[30,21,30,28],[30,29,30,33],[25,1,25,33],[27,1,27,33],[28,1,28,6],[29,1,29,6],[29,7,29,19],[24,1,24,24],[24,26,24,33],[28,7,28,19],[28,24,28,33],[29,27,29,33],[30,5,30,14],[13,2,13,33],[6,10,6,11],[15,2,15,33],[7,1,7,33],[9,1,9,33],[11,1,11,33],[10,1,10,33],[6,8,6,9],[14,3,14,33],[6,16,6,18],[6,22,6,27],[42,28,42,29],[36,1,36,33],[39,1,39,14],[33,6,33,14],[41,20,41,26],[41,27,41,33],[41,1,41,19],[39,27,39,33],[37,1,38,33],[39,15,39,26],[33,1,33,5],[34,1,34,5],[33,27,33,33],[34,6,34,14]]}
[]
[null,"Standard Equipment"]
[null,"New Buildings l Incentive Application l Form 520S"]
[]
[]
[]
[null,"For Program Use Only",null,null,null,null,null,null,"OM:",null,null,null,"Project ID:",null,null,null,null,null,null,"PT ID:",null,null,null,null,null,null,null,null,null,"v2025.1"]
[null,"CLEAResult is a Program Management Contractor (PMC) for Energy Trust of Oregon, Inc."]
[]
[null,"OVERVIEW AND ELIGIBILITY"]
{"$rows_left_out":34}
{"sheet":"Equipment Options","index":1,"n_rows":226,"n_cols":13,"rows_kept":226,"cut":false,"hidden":false,"merged":[[60,3,61,3],[51,1,57,1],[51,2,57,2],[58,1,59,1],[192,3,193,3],[156,3,158,3],[159,3,161,3],[162,3,164,3],[151,1,153,1],[151,2,153,2],[151,3,153,3],[154,3,155,3],[144,2,146,2],[118,1,125,1],[118,2,125,2],[126,1,132,1],[221,1,223,1],[221,2,223,2],[156,1,164,1],[156,2,164,2],[169,1,173,1],[169,2,173,2],[175,1,190,1],[175,2,190,2],[165,1,166,1],[167,1,168,1],[196,1,199,1],[196,2,199,2],[191,1,195,1],[191,2,195,2],[202,1,214,1],[202,2,214,2],[126,2,132,2],[136,1,141,1],[136,2,141,2],[144,1,146,1],[15,1,23,1],[15,2,23,2],[37,1,38,1],[37,2,38,2],[30,1,32,1],[30,2,32,2],[33,1,35,1],[33,2,35,2],[26,1,29,1],[26,2,29,2],[12,1,14,1],[12,2,14,2],[2,1,2,11],[6,2,8,2],[6,1,8,1],[9,1,11,1],[9,2,11,2],[225,1,225,8],[39,2,40,2],[39,1,40,1],[48,3,50,3],[45,1,50,1],[45,2,50,2],[41,1,42,1],[41,2,42,2],[43,1,44,1],[43,2,44,2],[45,3,47,3],[71,2,72,2],[62,2,70,2],[62,1,70,1],[71,1,72,1],[89,2,90,2],[26,3,27,3],[28,3,29,3],[30,3,31,3],[133,1,134,1],[133,2,134,2],[73,2,87,2],[73,1,87,1],[89,1,90,1],[91,1,99,1],[91,2,99,2],[100,1,108,1],[100,2,108,2],[109,1,117,1],[109,2,117,2],[58,2,61,2],[58,3,59,3],[198,3,199,3],[147,1,149,1],[147,2,149,2],[215,1,220,1],[215,2,220,2],[154,1,155,1],[154,2,155,2]]}
[null,{"$f":"_xlfn.CONCAT(\"Project ID: \",ProjectID)","v":"Project ID: "},null,{"$f":"IFERROR(\n_xlfn.IFS(\nAND(OR(SelectedElectric=\"Pacific Power\",SelectedElectric=\"Portland General Electric\"),NOT(SelectedGas=\"None\"),NOT(SelectedGas=\"Select Gas Utility\")),\"Full Territory\",\nAND(OR(SelectedElectric=\"Pacific Power\",SelectedElectric=\"Portland General Electric\"),OR(SelectedGas=\"None\",SelectedGas=\"Select Gas Utility\")),\"Electric Only\",\nAND(OR(SelectedElectric=\"Other\",SelectedElectric=\"Select Electric Utility\"),NOT(SelectedGas=\"None\"),NOT(SelectedGas=\"Select Gas Utility\")),\"Gas Only\"\n),\"No Utilities Selected\")","v":"No Utilities Selected"},null,{"$f":"_xlfn.CONCAT(\"Electric Utility: \", SelectedElectric)","v":"Electric Utility: Select Electric Utility"},null,null,{"$f":"_xlfn.CONCAT(\"Heating: \", SelectedHeat)","v":"Heating: Select Type"}]
[null,{"$f":"_xlfn.CONCAT(\"Building Type: \", SelectedBldgType)","v":"Building Type: Select Building Type"},null,null,null,{"$f":"_xlfn.CONCAT(\"Gas Utility: \", SelectedGas)","v":"Gas Utility: Select Gas Utility"},null,null,{"$f":"_xlfn.CONCAT(\"DHW: \", SelectedDHW)","v":"DHW: Select Type"}]
[]
[null,"Equipment","Requirements","Specification","Participating Utility","Installation Setting","Incentive Basis","Incentive","Quantity","Total Incentive","Model Number","MAD ID","Product Code"]
[]
[null,"Multifamily Only Options"]
[null,"Bath Fan - Continuous single speed","• ENERGY STAR® Continuous Operating Bath Fans\n• Single speed fans ≤50 cfm exhaust rate","<10 cfm/W","Electric","Multifamily","each",15,0,{"$f":"SUM(H7*I7)","v":0},null,269,"BFSS5"]
[null,null,null,">=10 cfm/W, <15 cfm/W","Electric","Multifamily","each",25,0,{"$f":"SUM(H8*I8)","v":0},null,269,"BFSS10"]
[null,null,null,">=15 cfm/W","Electric","Multifamily","each",30,0,0,null,269,"BFSS15"]
[null,"Bath Fan - Continuous two-speed, less than 90 cfm","• ENERGY STAR® Continuous Operating Bath Fans\n• Two-speed fans: ≤50 cfm unoccupied exhaust rate, AND ≤200 cfm occupied exhaust rate","<90 cfm, >=5 cfm/W, <10 cfm/W","Electric","Multifamily","each",15,0,0,null,269,"BFTSSM5"]
{"$rows_left_out":217}
{"sheet":"Measure Totals","index":2,"n_rows":278,"n_cols":16,"rows_kept":278,"cut":false,"hidden":true,"merged":[]}
[null,"Measure Totals"]
[]
[]
[null,"Description","Product Code","Product Version ID","Incentive / unit","kWh / unit","Therms / unit","Ele allocation","Gas allocation","Quantity","Elec Savings","Elec Incentive","Gas Savings","Gas Incentive","Total Incentive","Incremental Cost"]
[null,"Commercial Pump VSD_Heating_New Pump_5 HP (4.51 to 6.00 HP)","CPUMPVSDHEAT5HP",15287,{"$f":"IFERROR(_xlfn.XLOOKUP($C5,ProductCode,DefaultIncentive,0,0),0)","v":500},{"$f":"IFERROR(_xlfn.XLOOKUP($C5,ProductCode,DefaultKwh,0,0),0)","v":1826.51},{"$f":"IFERROR(_xlfn.XLOOKUP($C5,ProductCode,DefaultTherms,0,0),0)","v":0},{"$f":"IFERROR((_xlfn.XLOOKUP($C5,ProductCode,AllocationElectric,0,0))/100,0)","v":1},{"$f":"IFERROR((_xlfn.XLOOKUP($C5,ProductCode,AllocationGas,0,0))/100,0)","v":0},{"$f":"IFERROR(SUMIFS('Equipment Options'!I:I,'Equipment Options'!M:M,$C5),\"\")","v":0},{"$f":"J5*F5","v":0},{"$f":"O5*H5","v":0},{"$f":"J5*G5","v":0},{"$f":"O5*I5","v":0},{"$f":"J5*E5","v":0},{"$f":"(_xlfn.XLOOKUP($C5,ProductCode,IncrementalCost,\"\",0))*J5","v":0}]
[null,"Comm Pump VSD_Cooling_New Pump_4 HP (3.51 to 4.50 HP)","CPUMPVSDCOOL4HP",15288,450,1438.37,0,1,0,{"$f":"IFERROR(SUMIFS('Equipment Options'!I:I,'Equipment Options'!M:M,$C6),\"\")","v":0},{"$f":"J6*F6","v":0},{"$f":"O6*H6","v":0},{"$f":"J6*G6","v":0},{"$f":"O6*I6","v":0},{"$f":"J6*E6","v":0},{"$f":"(_xlfn.XLOOKUP($C6,ProductCode,IncrementalCost,\"\",0))*J6","v":0}]
[null,"Comm Pump VSD_Cooling_New Pump_3 HP (2.51 to 3.50 HP)","CPUMPVSDCOOL3HP",15289,350,1078.78,0,1,0,{"$f":"IFERROR(SUMIFS('Equipment Options'!I:I,'Equipment Options'!M:M,$C7),\"\")","v":0},0,0,0,0,0,0]
[null,"Comm Pump VSD_Pressure Boost_New Pump_7.5 HP (6.01 to 8.00 HP)","CPUMPVSDPB7P5HP",15290,600,2088.5500000000002,0,1,0,{"$f":"IFERROR(SUMIFS('Equipment Options'!I:I,'Equipment Options'!M:M,$C8),\"\")","v":0},0,0,0,0,0,0]
[null,"Comm Pump VSD_Pressure Boost_New Pump_4 HP (3.51 to 4.50 HP)","CPUMPVSDPB4HP",15291,450,1113.8900000000001,0,1,0,{"$f":"IFERROR(SUMIFS('Equipment Options'!I:I,'Equipment Options'!M:M,$C9),\"\")","v":0},0,0,0,0,0,0]
[null,"Commercial Pump VSD_Heating_New Pump_0.75 HP (0.50 to 0.75 HP)","CPUMPVSDHEAT0P75",15292,150,273.98,0,1,0,{"$f":"IFERROR(SUMIFS('Equipment Options'!I:I,'Equipment Options'!M:M,$C10),\"\")","v":0},0,0,0,0,0,0]
{"$rows_left_out":269}
{"sheet":"EquipOpt Lookups","index":3,"n_rows":1063,"n_cols":15,"rows_kept":1063,"cut":false,"hidden":true,"merged":[]}
[null,"Zipcode","CoolingZone","HeatingZone","Combined",null,"Electric",null,"Gas",null,"Fuel/DHW Type",null,"Code Year",null,"Building Type"]
[null,97001,2,2,{"$f":"\"CZ\"&C2&\" \"&\"HZ\"&D2","v":"CZ2 HZ2"},null,"Select Electric Utility",null,"Select Gas Utility",null,"Select Type",null,"Select Code Year",null,"Select Building Type"]
[null,97002,2,1,{"$f":"\"CZ\"&C3&\" \"&\"HZ\"&D3","v":"CZ2 HZ1"},null,"Pacific Power",null,"Cascade Natural Gas",null,"Electric",null,"2019 Code Year",null,"Lodging (Hotel/Motel/Dormitory)"]
[null,97003,2,1,"CZ2 HZ1",null,"Portland General Electric",null,"NW Natural",null,"Gas",null,"2021 Code Year",null,"Multifamily"]
[null,97004,2,1,"CZ2 HZ1",null,"Other",null,"Avista",null,"Both",null,null,null,"Commercial and Other"]
[null,97005,2,1,"CZ2 HZ1",null,null,null,"None"]
[null,97006,2,1,"CZ2 HZ1"]
[null,97007,2,1,"CZ2 HZ1"]
[null,97008,2,1,"CZ2 HZ1"]
[null,97009,2,1,"CZ2 HZ1"]
{"$rows_left_out":1054}
{"sheet":"Active Measures","index":4,"n_rows":275,"n_cols":160,"rows_kept":275,"cut":false,"hidden":true,"merged":[]}
["ProductVersionId","IsActive","ProductPath","ProductCode","ProductDescription","EvaluationDescription","BusinessCustomerReportsDescription","SavingsPotential","SystemType","MADHeaderId","MADId","MADVersion","CECRowId","MADState","ProgramCode","ProgramDescription","StartDate","EndDate","QtyUnitType","PilotFlag","OPUCExceptionFlag","DefaultKwh","DefaultTherms","NEBAnnual","DefaultOverrideSavingsAndNEBs","DefaultLoadProfileEle","DefaultLoadProfileGas","DefaultOverrideProfiles","DefaultIncentive","DefaultOverrideIncentive","DefaultLifeYears","DefaultOverrideLife","UnitIncrementalCost","AddInteractiveKwh","AddInteractiveTherms","UnitCost","UnitSave","UnitIncentive","CustomAllocation","AVI","PGE","PAC","CNG","NWN","NWNF","NWNI","NWNWA","NWNTLM","PGELMI","PGEFF","PACLMI","OCOOL","AVIINT","AVITRP","AttributeCategory","Attribute1","Attribute1Description","Attribute1Required","Attribute1Type","Attribute1Length","Attribute1Entry","Attribute2","Attribute2Description","Attribute2Required","Attribute2Type","Attribute2Length","Attribute2Entry","Attribute3","Attribute3Description","Attribute3Required","Attribute3Type","Attribute3Length","Attribute3Entry","Attribute4","Attribute4Description","Attribute4Required","Attribute4Type","Attribute4Length","Attribute4Entry","Attribute5","Attribute5Description","Attribute5Required","Attribute5Type","Attribute5Length","Attribute5Entry","Attribute6","Attribute6Description","Attribute6Required","Attribute6Type","Attribute6Length","Attribute6Entry","Attribute7","Attribute7Description","Attribute7Required","Attribute7Type","Attribute7Length","Attribute7Entry","Attribute8","Attribute8Description","Attribute8Required","Attribute8Type","Attribute8Length","Attribute8Entry","Attribute9","Attribute9Description","Attribute9Required","Attribute9Type","Attribute9Length","Attribute9Entry","Attribute10","Attribute10Description","Attribute10Required","Attribute10Type","Attribute10Length","Attribute10Entry","Attribute11","Attribute11Description","Attribute11Required","Attribute11Type","Attribute11Length","Attribute11Entry","Attribute12","Attribute12Description","Attribute12Required","Attribute12Type","Attribute12Length","Attribute12Entry","Attribute13","Attribute13Description","Attribute13Required","Attribute13Type","Attribute13Length","Attribute13Entry","Attribute14","Attribute14Description","Attribute14Required","Attribute14Type","Attribute14Length","Attribute14Entry","Attribute15","Attribute15Description","Attribute15Required","Attribute15Type","Attribute15Length","Attribute15Entry","Attribute16","Attribute16Description","Attribute16Required","Attribute16Type","Attribute16Length","Attribute16Entry","Attribute17","Attribute17Description","Attribute17Required","Attribute17Type","Attribute17Length","Attribute17Entry","CreatedDatetime","RevisedDatetime","Column1"]
[15287,"Yes","Prescriptive","CPUMPVSDHEAT5HP","Commercial Pump VSD_Heating_New Pump_5 HP (4.51 to 6.00 HP)","Pump","Pumps","ELE","N/A",864,284,2,5105,"OR","NBE","New Buildings","2023-01-01","2025-12-31","Units",0,0,1826.51,0,0,0,"Other Heating","None - gas",0,500,0,15,0,592.58000000000004,0,0,0,1,1,0,"NULL",100,100,"NULL","NULL","NULL","NULL","NULL","NULL","NULL","NULL","NULL","NULL","NULL","NULL","NULL","No Attributes ","NULL","NULL","F","NULL","NULL","NULL","NULL","NULL","F","NULL","NULL","NULL","NULL","NULL","F","NULL","NULL","NULL","NULL","NULL","F","NULL","NULL","NULL","NULL","NULL","F","NULL","NULL","NULL","NULL","NULL","F","NULL","NULL","NULL","NULL","NULL","F","NULL","NULL","NULL","NULL","NULL","F","NULL","NULL","NULL","NULL","NULL","F","NULL","NULL","NULL","NULL","NULL","F","NULL","NULL","NULL","NULL","NULL","F","NULL","NULL","NULL","NULL","NULL","F","NULL","NULL","NULL","NULL","NULL","F","NULL","NULL","NULL","NULL","NULL","F","NULL","NULL","NULL","NULL","NULL","F","NULL","NULL","NULL","NULL","NULL","F","NULL","NULL","NULL","NULL","NULL","F","NULL","NULL","NULL",44952.607310150466,44952.607310150466]
[15288,"Yes","Prescriptive","CPUMPVSDCOOL4HP","Comm Pump VSD_Cooling_New Pump_4 HP (3.51 to 4.50 HP)","Pump","Pumps","ELE","N/A",864,284,2,5121,"OR","NBE","New Buildings","2023-01-01","2025-12-31","Units",0,0,1438.37,0,0,0,"Other Cooling","None - gas",0,450,0,15,0,532.9,0,0,0,1,1,0,"NULL",100,100,"NULL","NULL","NULL","NULL","NULL","NULL","NULL","NULL","NULL","NULL","NULL","NULL","NULL","No Attributes ","NULL","NULL","F","NULL","NULL","NULL","NULL","NULL","F","NULL","NULL","NULL","NULL","NULL","F","NULL","NULL","NULL","NULL","NULL","F","NULL","NULL","NULL","NULL","NULL","F","NULL","NULL","NULL","NULL","NULL","F","NULL","NULL","NULL","NULL","NULL","F","NULL","NULL","NULL","NULL","NULL","F","NULL","NULL","NULL","NULL","NULL","F","NULL","NULL","NULL","NULL","NULL","F","NULL","NULL","NULL","NULL","NULL","F","NULL","NULL","NULL","NULL","NULL","F","NULL","NULL","NULL","NULL","NULL","F","NULL","NULL","NULL","NULL","NULL","F","NULL","NULL","NULL","NULL","NULL","F","NULL","NULL","NULL","NULL","NULL","F","NULL","NULL","NULL","NULL","NULL","F","NULL","NULL","NULL",44952.607310150466,44952.607310150466]
[15289,"Yes","Prescriptive","CPUMPVSDCOOL3HP","Comm Pump VSD_Cooling_New Pump_3 HP (2.51 to 3.50 HP)","Pump","Pumps","ELE","N/A",864,284,2,5120,"OR","NBE","New Buildings","2023-01-01","2025-12-31","Units",0,0,1078.78,0,0,0,"Other Cooling","None - gas",0,350,0,15,0,464.75,0,0,0,1,1,0,"NULL",100,100,"NULL","NULL","NULL","NULL","NULL","NULL","NULL","NULL","NULL","NULL","NULL","NULL","NULL","No Attributes ","NULL","NULL","F","NULL","NULL","NULL","NULL","NULL","F","NULL","NULL","NULL","NULL","NULL","F","NULL","NULL","NULL","NULL","NULL","F","NULL","NULL","NULL","NULL","NULL","F","NULL","NULL","NULL","NULL","NULL","F","NULL","NULL","NULL","NULL","NULL","F","NULL","NULL","NULL","NULL","NULL","F","NULL","NULL","NULL","NULL","NULL","F","NULL","NULL","NULL","NULL","NULL","F","NULL","NULL","NULL","NULL","NULL","F","NULL","NULL","NULL","NULL","NULL","F","NULL","NULL","NULL","NULL","NULL","F","NULL","NULL","NULL","NULL","NULL","F","NULL","NULL","NULL","NULL","NULL","F","NULL","NULL","NULL","NULL","NULL","F","NULL","NULL","NULL","NULL","NULL","F","NULL","NULL","NULL",44952.607310150466,44952.607310150466]
[15290,"Yes","Prescriptive","CPUMPVSDPB7P5HP","Comm Pump VSD_Pressure Boost_New Pump_7.5 HP (6.01 to 8.00 HP)","Pump","Pumps","ELE","N/A",864,284,2,5112,"OR","NBE","New Buildings","2023-01-01","2025-12-31","Units",0,0,2088.5500000000002,0,0,0,"3-Shift Industrial","None - gas",0,600,0,15,0,718.63,0,0,0,1,1,0,"NULL",100,100,"NULL","NULL","NULL","NULL","NULL","NULL","NULL","NULL","NULL","NULL","NULL","NULL","NULL","No Attributes ","NULL","NULL","F","NULL","NULL","NULL","NULL","NULL","F","NULL","NULL","NULL","NULL","NULL","F","NULL","NULL","NULL","NULL","NULL","F","NULL","NULL","NULL","NULL","NULL","F","NULL","NULL","NULL","NULL","NULL","F","NULL","NULL","NULL","NULL","NULL","F","NULL","NULL","NULL","NULL","NULL","F","NULL","NULL","NULL","NULL","NULL","F","NULL","NULL","NULL","NULL","NULL","F","NULL","NULL","NULL","NULL","NULL","F","NULL","NULL","NULL","NULL","NULL","F","NULL","NULL","NULL","NULL","NULL","F","NULL","NULL","NULL","NULL","NULL","F","NULL","NULL","NULL","NULL","NULL","F","NULL","NULL","NULL","NULL","NULL","F","NULL","NULL","NULL","NULL","NULL","F","NULL","NULL","NULL",44952.607310150466,44952.607310150466]
[15291,"Yes","Prescriptive","CPUMPVSDPB4HP","Comm Pump VSD_Pressure Boost_New Pump_4 HP (3.51 to 4.50 HP)","Pump","Pumps","ELE","N/A",864,284,2,5110,"OR","NBE","New Buildings",44927,"2025-12-31","Units",0,0,1113.8900000000001,0,0,0,"3-Shift Industrial","None - gas",0,450,0,15,0,532.9,0,0,0,1,1,0,"NULL",100,100,"NULL","NULL","NULL","NULL","NULL","NULL","NULL","NULL","NULL","NULL","NULL","NULL","NULL","No Attributes ","NULL","NULL","F","NULL","NULL","NULL","NULL","NULL","F","NULL","NULL","NULL","NULL","NULL","F","NULL","NULL","NULL","NULL","NULL","F","NULL","NULL","NULL","NULL","NULL","F","NULL","NULL","NULL","NULL","NULL","F","NULL","NULL","NULL","NULL","NULL","F","NULL","NULL","NULL","NULL","NULL","F","NULL","NULL","NULL","NULL","NULL","F","NULL","NULL","NULL","NULL","NULL","F","NULL","NULL","NULL","NULL","NULL","F","NULL","NULL","NULL","NULL","NULL","F","NULL","NULL","NULL","NULL","NULL","F","NULL","NULL","NULL","NULL","NULL","F","NULL","NULL","NULL","NULL","NULL","F","NULL","NULL","NULL","NULL","NULL","F","NULL","NULL","NULL","NULL","NULL","F","NULL","NULL","NULL",44952.607310150466,44952.607310150466]
[15292,"Yes","Prescriptive","CPUMPVSDHEAT0P75","Commercial Pump VSD_Heating_New Pump_0.75 HP (0.50 to 0.75 HP)","Pump","Pumps","ELE","N/A",864,284,2,5099,"OR","NBE","New Buildings",44927,"2025-12-31","Units",0,0,273.98,0,0,0,"Other Heating","None - gas",0,150,0,15,0,240.34,0,0,0,1,1,0,"NULL",100,100,"NULL","NULL","NULL","NULL","NULL","NULL","NULL","NULL","NULL","NULL","NULL","NULL","NULL","No Attributes ","NULL","NULL","F","NULL","NULL","NULL","NULL","NULL","F","NULL","NULL","NULL","NULL","NULL","F","NULL","NULL","NULL","NULL","NULL","F","NULL","NULL","NULL","NULL","NULL","F","NULL","NULL","NULL","NULL","NULL","F","NULL","NULL","NULL","NULL","NULL","F","NULL","NULL","NULL","NULL","NULL","F","NULL","NULL","NULL","NULL","NULL","F","NULL","NULL","NULL","NULL","NULL","F","NULL","NULL","NULL","NULL","NULL","F","NULL","NULL","NULL","NULL","NULL","F","NULL","NULL","NULL","NULL","NULL","F","NULL","NULL","NULL","NULL","NULL","F","NULL","NULL","NULL","NULL","NULL","F","NULL","NULL","NULL","NULL","NULL","F","NULL","NULL","NULL","NULL","NULL","F","NULL","NULL","NULL",44952.607310150466,44952.607310150466]
[15293,"Yes","Prescriptive","CPUMPVSDHEAT4HP","Commercial Pump VSD_Heating_New Pump_4 HP (3.51 to 4.50 HP)","Pump","Pumps","ELE","N/A",864,284,2,5104,"OR","NBE","New Buildings","2023-01-01","2025-12-31","Units",0,0,1461.2,0,0,0,"Other Heating","None - gas",0,450,0,15,0,532.9,0,0,0,1,1,0,"NULL",100,100,"NULL","NULL","NULL","NULL","NULL","NULL","NULL","NULL","NULL","NULL","NULL","NULL","NULL","No Attributes ","NULL","NULL","F","NULL","NULL","NULL","NULL","NULL","F","NULL","NULL","NULL","NULL","NULL","F","NULL","NULL","NULL","NULL","NULL","F","NULL","NULL","NULL","NULL","NULL","F","NULL","NULL","NULL","NULL","NULL","F","NULL","NULL","NULL","NULL","NULL","F","NULL","NULL","NULL","NULL","NULL","F","NULL","NULL","NULL","NULL","NULL","F","NULL","NULL","NULL","NULL","NULL","F","NULL","NULL","NULL","NULL","NULL","F","NULL","NULL","NULL","NULL","NULL","F","NULL","NULL","NULL","NULL","NULL","F","NULL","NULL","NULL","NULL","NULL","F","NULL","NULL","NULL","NULL","NULL","F","NULL","NULL","NULL","NULL","NULL","F","NULL","NULL","NULL","NULL","NULL","F","NULL","NULL","NULL",44952.607310150466,44952.607310150466]
[15294,"Yes","Prescriptive","CPUMPVSDCOOLT5HP","Comm Pump VSD_Cooling Tower_New Pump_5 HP (4.51 to 6.00 HP)","Pump","Pumps","ELE","N/A",864,284,2,5094,"OR","NBE","New Buildings","2023-01-01","2025-12-31","Units",0,0,898.41,0,0,0,"Other Cooling","None - gas",0,500,0,15,0,592.58000000000004,0,0,0,1,1,0,"NULL",100,100,"NULL","NULL","NULL","NULL","NULL","NULL","NULL","NULL","NULL","NULL","NULL","NULL","NULL","No Attributes ","NULL","NULL","F","NULL","NULL","NULL","NULL","NULL","F","NULL","NULL","NULL","NULL","NULL","F","NULL","NULL","NULL","NULL","NULL","F","NULL","NULL","NULL","NULL","NULL","F","NULL","NULL","NULL","NULL","NULL","F","NULL","NULL","NULL","NULL","NULL","F","NULL","NULL","NULL","NULL","NULL","F","NULL","NULL","NULL","NULL","NULL","F","NULL","NULL","NULL","NULL","NULL","F","NULL","NULL","NULL","NULL","NULL","F","NULL","NULL","NULL","NULL","NULL","F","NULL","NULL","NULL","NULL","NULL","F","NULL","NULL","NULL","NULL","NULL","F","NULL","NULL","NULL","NULL","NULL","F","NULL","NULL","NULL","NULL","NULL","F","NULL","NULL","NULL","NULL","NULL","F","NULL","NULL","NULL",44952.607310150466,44952.607310150466]
[15295,"Yes","Prescriptive","CPUMPVSDPB15HP","Comm Pump VSD_Pressure Boost_New Pump_15 HP (12.51 to 17.50 HP)","Pump","Pumps","ELE","N/A",864,284,2,5114,"OR","NBE","New Buildings","2023-01-01","2025-12-31","Units",0,0,4177.09,0,0,0,"3-Shift Industrial","None - gas",0,850,0,15,0,999.31,0,0,0,1,1,0,"NULL",100,100,"NULL","NULL","NULL","NULL","NULL","NULL","NULL","NULL","NULL","NULL","NULL","NULL","NULL","No Attributes ","NULL","NULL","F","NULL","NULL","NULL","NULL","NULL","F","NULL","NULL","NULL","NULL","NULL","F","NULL","NULL","NULL","NULL","NULL","F","NULL","NULL","NULL","NULL","NULL","F","NULL","NULL","NULL","NULL","NULL","F","NULL","NULL","NULL","NULL","NULL","F","NULL","NULL","NULL","NULL","NULL","F","NULL","NULL","NULL","NULL","NULL","F","NULL","NULL","NULL","NULL","NULL","F","NULL","NULL","NULL","NULL","NULL","F","NULL","NULL","NULL","NULL","NULL","F","NULL","NULL","NULL","NULL","NULL","F","NULL","NULL","NULL","NULL","NULL","F","NULL","NULL","NULL","NULL","NULL","F","NULL","NULL","NULL","NULL","NULL","F","NULL","NULL","NULL","NULL","NULL","F","NULL","NULL","NULL",44952.607310150466,44952.607310150466]
{"$rows_left_out":266}
{"sheet":"Changelog","index":5,"n_rows":55,"n_cols":6,"rows_kept":55,"cut":false,"hidden":true,"merged":[[0,2,0,4],[1,2,1,4],[2,2,2,4],[3,2,3,4]]}
["Macro Name","Shortcut or button","Function"]
["FilterMeasures","Button located on Measure Totals tab","Filters the measure totals by column N (Quantity)."]
["Hide","Ctrl+h","Hides unused columns(only use on user facing application tabs)."]
["Unhide","Ctrl+o","Unhides columns."]
[]
["Date","Revision","Category","Fixed in Version","Notes","Initials"]
["2022-01-01","v.2022.1","New Version",null,"New 520S Released for 2022","JV"]
["2022-03-01","v2","Updates","v.2022.2","Climate Zones Updated on CZ HZ Tab","JV"]
["2022-03-01","v2","Updates","v.2022.2","Condensing Furnaces, updates to allow multiples","JV"]
["2022-03-01","v2","Updates","v.2022.2","Gas Steam Cooker Incentive cell updated to $2,000","JV"]
{"$rows_left_out":45}