{"text_format":"1","workbook":"xlsx","n_sheets":8,"sheets":["Standard Equipment Workbook","Equipment Options","Changelog","Measure Totals","Import Pivot","MeasureTotals Lookups","Active Measures","EquipOpt Lookups"],"not_rendered":{"charts":0,"images":1,"macros":1,"external_links":0,"defined_names":46,"comments":1,"pivot_tables":2},"unopened":[],"bounds":{"document_bytes":16777216,"sheet_cells":100000,"rows_first":2000,"rows_last":500,"rows_between":2000,"halvings":0,"cell_chars":16384,"cell_head_chars":4096},"cells_cut":0,"cells_raw":0,"read":"whole","date_system":"1900"}

{"sheet":"Standard Equipment Workbook","index":0,"n_rows":43,"n_cols":30,"rows_kept":43,"cut":false,"hidden":false,"merged":[[42,28,42,29],[36,1,36,33],[39,1,39,14],[33,6,33,14],[41,20,41,26],[41,27,41,33],[41,1,41,19],[39,27,39,33],[37,1,38,33],[39,15,39,26],[33,1,33,5],[34,1,34,5],[33,27,33,33],[34,6,34,14],[13,2,13,33],[6,10,6,11],[15,2,15,33],[7,1,7,33],[9,1,9,33],[11,1,11,33],[10,1,10,33],[6,8,6,9],[14,3,14,33],[6,16,6,18],[6,22,6,27],[23,1,23,33],[30,21,30,28],[29,28,29,33],[30,5,30,11],[28,25,28,33],[30,29,30,33],[25,1,25,33],[27,1,27,33],[28,1,28,6],[29,1,29,6],[29,7,29,19],[24,1,24,24],[24,26,24,33],[28,7,28,19],[21,2,21,33],[16,3,16,33],[17,2,17,33],[22,2,22,33],[18,2,18,33],[19,2,19,33],[20,3,20,33],[32,6,32,14],[32,1,32,5],[32,27,32,33],[34,27,34,33],[34,18,34,26],[33,18,33,26],[32,18,32,26]]}
[]
[null,"Standard Equipment"]
[null,"New Buildings l Incentive Application l Form 520S"]
[]
[]
[]
[null,"For Program Use Only",null,null,null,null,null,null,"OM:",null,null,null,"Project ID:",null,null,null,null,null,null,"PT ID:",null,null,null,null,null,null,null,null,null,"v2024.1"]
[null,"CLEAResult is a Program Management Contractor (PMC) for Energy Trust of Oregon, Inc."]
{"$rows_left_out":36}
{"sheet":"Equipment Options","index":1,"n_rows":304,"n_cols":30,"rows_kept":304,"cut":false,"hidden":false,"merged":[[20,24,22,24],[15,24,17,24],[84,24,87,24],[90,24,93,24],[173,3,174,3],[170,3,171,3],[5,24,5,29],[47,22,49,22],[47,24,49,24],[10,24,12,24],[10,22,12,22],[8,22,8,23],[8,24,8,29],[30,24,32,24],[34,24,37,24],[34,22,37,22],[41,22,43,22],[41,24,43,24],[30,22,32,22],[5,1,5,9],[5,15,5,21],[8,1,8,10],[6,1,6,2],[134,2,135,2],[119,3,120,3],[124,3,125,3],[126,3,127,3],[128,3,129,3],[130,3,131,3],[97,22,98,22],[91,22,92,22],[71,1,71,10],[107,3,108,3],[290,22,293,22],[8,15,8,21],[15,22,17,22],[20,22,22,22],[25,22,28,22],[84,22,87,22],[54,22,56,22],[100,22,102,22],[5,22,5,23],[160,22,161,22],[167,24,170,24],[180,22,186,22],[180,24,186,24],[167,22,170,22],[189,22,194,22],[176,3,177,3],[301,1,302,10],[299,9,299,10],[300,1,300,10],[299,1,299,8],[278,22,281,22],[237,1,237,10],[239,22,240,22],[296,22,297,22],[228,22,234,22],[296,24,297,24],[239,24,240,24],[243,22,244,22],[243,24,244,24],[247,22,248,22],[251,22,252,22],[251,24,252,24],[259,22,260,22],[259,24,260,24],[160,24,162,24],[100,24,102,24],[142,24,145,24],[105,24,106,24],[107,24,108,24],[111,22,113,22],[107,22,108,22],[111,24,113,24],[116,22,118,22],[116,24,118,24],[124,22,128,22],[124,24,128,24],[133,22,135,22],[133,24,135,24],[139,22,140,22],[154,22,155,22],[154,24,156,24],[148,22,150,22],[148,24,150,24],[54,24,56,24],[58,22,61,22],[25,24,28,24],[58,24,61,24],[64,24,67,24],[64,22,67,22],[73,24,75,24],[79,22,80,22],[78,24,81,24],[73,22,75,22],[97,24,98,24],[255,22,256,22],[255,24,256,24],[263,22,265,22],[290,24,293,24],[138,24,140,24],[142,22,145,22],[247,24,248,24],[283,24,285,24],[283,22,285,22],[263,24,265,24],[268,22,272,22],[268,24,272,24],[275,22,276,22],[275,24,276,24],[278,24,281,24],[189,24,194,24],[197,22,205,22],[197,24,205,24],[208,22,215,22],[208,24,215,24],[218,24,225,24],[218,22,225,22],[228,24,234,24]]}
[null,null,{"$f":"_xlfn.CONCAT(\"Project Name: \", ProjectName)","v":"Project Name: "},{"$f":"IFERROR(\n_xlfn.IFS(\nAND(OR(SelectedElectric=\"Pacific Power\",SelectedElectric=\"Portland General Electric\"),NOT(SelectedGas=\"None\"),NOT(SelectedGas=\"Select Gas Utility\")),\"Full Territory\",\nAND(OR(SelectedElectric=\"Pacific Power\",SelectedElectric=\"Portland General Electric\"),OR(SelectedGas=\"None\",SelectedGas=\"Select Gas Utility\")),\"Electric Only\",\nAND(OR(SelectedElectric=\"Other\",SelectedElectric=\"Select Electric Utility\"),NOT(SelectedGas=\"None\"),NOT(SelectedGas=\"Select Gas Utility\")),\"Gas Only\"\n),\"None Selected\")","v":"None Selected"}]
[null,null,{"$f":"_xlfn.CONCAT(\"Building Type: \", SelectedBldgType)","v":"Building Type: Select Building Type"},{"$f":"_xlfn.CONCAT(\"Heating: \", SelectedHeat)","v":"Heating: Select Type"}]
[null,null,{"$f":"_xlfn.CONCAT(\"Electric Utility: \", SelectedElectric)","v":"Electric Utility: Select Electric Utility"},{"$f":"_xlfn.CONCAT(\"DHW: \", SelectedDHW)","v":"DHW: Select Type"}]
[null,null,{"$f":"_xlfn.CONCAT(\"Gas Utility: \", SelectedGas)","v":"Gas Utility: Select Gas Utility"}]
[]
[null,null,null,null,null,null,null,null,null,null,null,null,null,null,null,null,null,null,null,null,null,null,"Review Instructions & Required Documentation",null,"Site Visit Checklist"]
[null,"Equipment Option",null,"Requirements","Installation Setting","Incentive Basis","Incentive",null,"Quantity","Total Incentive","Model numbers",null,"MAD ID","Product Code","Quantity","Unit kWh","Unit therms","Savings (kWh)","Savings (therms)","Elec Inc","Gas Inc","Total Inc","Review Instructions & Required Documentation","Notes","SV Instructions","# of units installed","# of units verified","Location(s)","Photo(s)","Notes"]
[]
{"$rows_left_out":297}
{"sheet":"Changelog","index":2,"n_rows":49,"n_cols":6,"rows_kept":49,"cut":false,"hidden":true,"merged":[[0,2,0,4],[1,2,1,4],[2,2,2,4],[3,2,3,4]]}
["Macro Name","Shortcut or button","Function"]
["FilterMeasures","Button located on Measure Totals tab","Filters the measure totals by column N (Quantity)."]
["Hide","Ctrl+h","Hides unused columns(only use on user facing application tabs)."]
["Unhide","Ctrl+o","Unhides columns."]
[]
["Date","Revision","Category","Fixed in Version","Notes","Initials"]
["2022-01-01","v.2022.1","New Version",null,"New 520S Released for 2022","JV"]
["2022-03-01","v2","Updates","v.2022.2","Climate Zones Updated on CZ HZ Tab","JV"]
{"$rows_left_out":42}
{"sheet":"Measure Totals","index":3,"n_rows":10,"n_cols":12,"rows_kept":10,"cut":false,"hidden":true,"merged":[]}
[]
[null,null,"Installation Measures:"]
[null,null,"Measure Code","Measure","Incremental Cost","Quantity","Elec Savings","Elec Incentive","Gas Savings","Gas Incentive","Total Incentive"]
[null,null,"Quantity","(Multiple Items)"]
[]
[null,null,"Measure","Measure Name","Sum of Incremental Cost","Sum of Quantity","Sum of kWh","Sum of Incentive Ele","Sum of Therms","Sum of Incenitve Gas","Sum of Incentive","Min of Product Version ID"]
[null,null,"BFSS5","Bath Fan - Continuous single speed, <10 cfm/W",77.260000000000005,2,137.66,30,0,0,30,13853]
[null,null,"BFSS10","Bath Fan - Continuous single speed, >=10 cfm/W, <15 cfm/W",46,1,112.63,25,0,0,25,13854]
{"$rows_left_out":3}
{"sheet":"Import Pivot","index":4,"n_rows":7,"n_cols":15,"rows_kept":7,"cut":false,"hidden":true,"merged":[]}
[null,null,"Quantity","(Multiple Items)"]
[]
[null,null,"Measure","Sum of Quantity","Sum of ProjectCost","Sum of Incentive","Sum of kWh","Sum of Therms","Min of Installer","Max of ReservationDate","Max of InstalledDate","Max of LifeYears","Max of LP_ELE","Max of LP_GAS","Sum of Product Version ID"]
[null,null,"BFSS5",2,null,30,137.66,0,null,null,null,null,null,null,13853]
[null,null,"BFSS10",1,null,25,112.63,0,null,null,null,null,null,null,13854]
[null,null,"BFSS15",3,null,90,381.69,0,null,null,null,null,null,null,13855]
[null,null,"Grand Total",6,null,145,631.98,0,null,null,null,null,null,null,41562]

{"sheet":"MeasureTotals Lookups","index":5,"n_rows":207,"n_cols":18,"rows_kept":207,"cut":false,"hidden":true,"merged":[[1,1,1,12]]}
[]
[null,"Import Data"]
[null,"Measure","Quantity","ProjectCost","Incentive","kWh","Therms","Installer","ReservationDate","InstalledDate","LifeYears","LP_ELE","LP_GAS","Product Version ID","Incentive Ele","Incenitve Gas","Measure Name","Incremental Cost"]
[null,"MINISPLITAC",{"$f":"SUMIF('Equipment Options'!N:N,'MeasureTotals Lookups'!$B4,'Equipment Options'!O:O)","v":0},null,{"$f":"SUMIF('Equipment Options'!N:N,'MeasureTotals Lookups'!$B4,'Equipment Options'!V:V)","v":0},{"$f":"SUMIF('Equipment Options'!N:N,'MeasureTotals Lookups'!$B4,'Equipment Options'!R:R)","v":0},{"$f":"SUMIF('Equipment Options'!N:N,'MeasureTotals Lookups'!$B4,'Equipment Options'!S:S)","v":0},null,null,null,null,null,null,{"$f":"_xlfn.XLOOKUP($B4,ProductCode,ProductVersionId,\"\",0)","v":17692},{"$f":"SUMIF('Equipment Options'!N:N,'MeasureTotals Lookups'!$B4,'Equipment Options'!T:T)","v":0},{"$f":"SUMIF('Equipment Options'!N:N,'MeasureTotals Lookups'!$B4,'Equipment Options'!U:U)","v":0},{"$f":"_xlfn.XLOOKUP($B4,ProductCode,ProductDescription,\"\",0)","v":"Server Closet/Telecom Room Mini-Split Air Conditioner"},{"$f":"(_xlfn.XLOOKUP($B4,ProductCode,IncrementalCost,\"\",0))*C4","v":0}]
[null,"MINISPLITHP",{"$f":"SUMIF('Equipment Options'!N:N,'MeasureTotals Lookups'!$B5,'Equipment Options'!O:O)","v":0},null,{"$f":"SUMIF('Equipment Options'!N:N,'MeasureTotals Lookups'!$B5,'Equipment Options'!V:V)","v":0},{"$f":"SUMIF('Equipment Options'!N:N,'MeasureTotals Lookups'!$B5,'Equipment Options'!R:R)","v":0},{"$f":"SUMIF('Equipment Options'!N:N,'MeasureTotals Lookups'!$B5,'Equipment Options'!S:S)","v":0},null,null,null,null,null,null,17693,{"$f":"SUMIF('Equipment Options'!N:N,'MeasureTotals Lookups'!$B5,'Equipment Options'!T:T)","v":0},{"$f":"SUMIF('Equipment Options'!N:N,'MeasureTotals Lookups'!$B5,'Equipment Options'!U:U)","v":0},"Server Closet/Telecom Room Mini-Split Heat Pumps",0]
[null,"DHWCONDTANKMF",{"$f":"SUMIF('Equipment Options'!N:N,'MeasureTotals Lookups'!$B6,'Equipment Options'!O:O)","v":0},null,{"$f":"SUMIF('Equipment Options'!N:N,'MeasureTotals Lookups'!$B6,'Equipment Options'!V:V)","v":0},{"$f":"SUMIF('Equipment Options'!N:N,'MeasureTotals Lookups'!$B6,'Equipment Options'!R:R)","v":0},{"$f":"SUMIF('Equipment Options'!N:N,'MeasureTotals Lookups'!$B6,'Equipment Options'!S:S)","v":0},null,null,null,null,null,null,18351,{"$f":"SUMIF('Equipment Options'!N:N,'MeasureTotals Lookups'!$B6,'Equipment Options'!T:T)","v":0},{"$f":"SUMIF('Equipment Options'!N:N,'MeasureTotals Lookups'!$B6,'Equipment Options'!U:U)","v":0},"Condensing Tank Water Heater, Multifamily",0]
[null,"DHWCONDNMF",{"$f":"SUMIF('Equipment Options'!N:N,'MeasureTotals Lookups'!$B7,'Equipment Options'!O:O)","v":0},null,{"$f":"SUMIF('Equipment Options'!N:N,'MeasureTotals Lookups'!$B7,'Equipment Options'!V:V)","v":0},{"$f":"SUMIF('Equipment Options'!N:N,'MeasureTotals Lookups'!$B7,'Equipment Options'!R:R)","v":0},{"$f":"SUMIF('Equipment Options'!N:N,'MeasureTotals Lookups'!$B7,'Equipment Options'!S:S)","v":0},null,null,null,null,null,null,18353,{"$f":"SUMIF('Equipment Options'!N:N,'MeasureTotals Lookups'!$B7,'Equipment Options'!T:T)","v":0},{"$f":"SUMIF('Equipment Options'!N:N,'MeasureTotals Lookups'!$B7,'Equipment Options'!U:U)","v":0},"Condensing Tank Water Heater, All Except MF",0]
[null,"DWSTCONHTEMPE",{"$f":"SUMIF('Equipment Options'!N:N,'MeasureTotals Lookups'!$B8,'Equipment Options'!O:O)","v":0},null,{"$f":"SUMIF('Equipment Options'!N:N,'MeasureTotals Lookups'!$B8,'Equipment Options'!V:V)","v":0},{"$f":"SUMIF('Equipment Options'!N:N,'MeasureTotals Lookups'!$B8,'Equipment Options'!R:R)","v":0},{"$f":"SUMIF('Equipment Options'!N:N,'MeasureTotals Lookups'!$B8,'Equipment Options'!S:S)","v":0},null,null,null,null,null,null,13323,{"$f":"SUMIF('Equipment Options'!N:N,'MeasureTotals Lookups'!$B8,'Equipment Options'!T:T)","v":0},{"$f":"SUMIF('Equipment Options'!N:N,'MeasureTotals Lookups'!$B8,'Equipment Options'!U:U)","v":0},"Dishwasher - Single Tank Conveyor- High Temp - Ele WH",0]
{"$rows_left_out":200}
{"sheet":"Active Measures","index":6,"n_rows":205,"n_cols":159,"rows_kept":205,"cut":false,"hidden":true,"merged":[]}
["ProductVersionId","IsActive","ProductPath","ProductCode","ProductDescription","EvaluationDescription","BusinessCustomerReportsDescription","SavingsPotential","SystemType","MADHeaderId","MADId","MADVersion","CECRowId","MADState","ProgramCode","ProgramDescription","StartDate","EndDate","QtyUnitType","PilotFlag","OPUCExceptionFlag","DefaultKwh","DefaultTherms","NEBAnnual","DefaultOverrideSavingsAndNEBs","DefaultLoadProfileEle","DefaultLoadProfileGas","DefaultOverrideProfiles","DefaultIncentive","DefaultOverrideIncentive","DefaultLifeYears","DefaultOverrideLife","UnitIncrementalCost","AddInteractiveKwh","AddInteractiveTherms","UnitCost","UnitSave","UnitIncentive","CustomAllocation","AVI","PGE","PAC","CNG","NWN","NWNF","NWNI","NWNWA","NWNTLM","PGELMI","PGEFF","PACLMI","OCOOL","AVIINT","AVITRP","AttributeCategory","Attribute1","Attribute1Description","Attribute1Required","Attribute1Type","Attribute1Length","Attribute1Entry","Attribute2","Attribute2Description","Attribute2Required","Attribute2Type","Attribute2Length","Attribute2Entry","Attribute3","Attribute3Description","Attribute3Required","Attribute3Type","Attribute3Length","Attribute3Entry","Attribute4","Attribute4Description","Attribute4Required","Attribute4Type","Attribute4Length","Attribute4Entry","Attribute5","Attribute5Description","Attribute5Required","Attribute5Type","Attribute5Length","Attribute5Entry","Attribute6","Attribute6Description","Attribute6Required","Attribute6Type","Attribute6Length","Attribute6Entry","Attribute7","Attribute7Description","Attribute7Required","Attribute7Type","Attribute7Length","Attribute7Entry","Attribute8","Attribute8Description","Attribute8Required","Attribute8Type","Attribute8Length","Attribute8Entry","Attribute9","Attribute9Description","Attribute9Required","Attribute9Type","Attribute9Length","Attribute9Entry","Attribute10","Attribute10Description","Attribute10Required","Attribute10Type","Attribute10Length","Attribute10Entry","Attribute11","Attribute11Description","Attribute11Required","Attribute11Type","Attribute11Length","Attribute11Entry","Attribute12","Attribute12Description","Attribute12Required","Attribute12Type","Attribute12Length","Attribute12Entry","Attribute13","Attribute13Description","Attribute13Required","Attribute13Type","Attribute13Length","Attribute13Entry","Attribute14","Attribute14Description","Attribute14Required","Attribute14Type","Attribute14Length","Attribute14Entry","Attribute15","Attribute15Description","Attribute15Required","Attribute15Type","Attribute15Length","Attribute15Entry","Attribute16","Attribute16Description","Attribute16Required","Attribute16Type","Attribute16Length","Attribute16Entry","Attribute17","Attribute17Description","Attribute17Required","Attribute17Type","Attribute17Length","Attribute17Entry","CreatedDatetime","RevisedDatetime"]
[17692,"Yes","Prescriptive","MINISPLITAC","Server Closet/Telecom Room Mini-Split Air Conditioner","Server Closet Mini-split AC units","HVAC","ELE","N/A",804,3,3,4326,"OR","NBE","New Buildings","2024-01-01","2025-12-31","Tons",0,0,417.14,0,0,0,"Large Office Ventilation","None - gas",0,250,0,15,0,264.14999999999998,0,0,0,1,1,0,"NULL",100,100,"NULL","NULL","NULL","NULL","NULL","NULL","NULL","NULL","NULL","NULL","NULL","NULL","Server Closet Mini-split AC units","DESIGNLOAD","Design Load (in kW)","F","Alphanumeric",64,"ED","SEER","SEER","F","Decimal",20,"ED","SEER2","SEER 2","F","ALPHANUMERIC",20,"ED","NULL","NULL","F","NULL","NULL","NULL","NULL","NULL","F","NULL","NULL","NULL","NULL","NULL","F","NULL","NULL","NULL","NULL","NULL","F","NULL","NULL","NULL","NULL","NULL","F","NULL","NULL","NULL","NULL","NULL","F","NULL","NULL","NULL","NULL","NULL","F","NULL","NULL","NULL","NULL","NULL","F","NULL","NULL","NULL","NULL","NULL","F","NULL","NULL","NULL","NULL","NULL","F","NULL","NULL","NULL","NULL","NULL","F","NULL","NULL","NULL","NULL","NULL","F","NULL","NULL","NULL","NULL","NULL","F","NULL","NULL","NULL","NULL","NULL","F","NULL","NULL","NULL",45244.118961805558,45244.118961805558]
[17693,"Yes","Prescriptive","MINISPLITHP","Server Closet/Telecom Room Mini-Split Heat Pumps","Server Closet Mini-split AC units","HVAC","ELE","N/A",804,3,3,4327,"OR","NBE","New Buildings","2024-01-01","2025-12-31","Tons",0,0,417.14,0,0,0,"Large Office Ventilation","None - gas",0,250,0,15,0,272.89999999999998,0,0,0,1,1,0,"NULL",100,100,"NULL","NULL","NULL","NULL","NULL","NULL","NULL","NULL","NULL","NULL","NULL","NULL","Server Closet Mini-split AC units","DESIGNLOAD","Design Load (in kW)","F","Alphanumeric",64,"ED","SEER","SEER","F","Decimal",20,"ED","SEER2","SEER 2","F","ALPHANUMERIC",20,"ED","NULL","NULL","F","NULL","NULL","NULL","NULL","NULL","F","NULL","NULL","NULL","NULL","NULL","F","NULL","NULL","NULL","NULL","NULL","F","NULL","NULL","NULL","NULL","NULL","F","NULL","NULL","NULL","NULL","NULL","F","NULL","NULL","NULL","NULL","NULL","F","NULL","NULL","NULL","NULL","NULL","F","NULL","NULL","NULL","NULL","NULL","F","NULL","NULL","NULL","NULL","NULL","F","NULL","NULL","NULL","NULL","NULL","F","NULL","NULL","NULL","NULL","NULL","F","NULL","NULL","NULL","NULL","NULL","F","NULL","NULL","NULL","NULL","NULL","F","NULL","NULL","NULL",45244.118961805558,45244.118961805558]
[18351,"Yes","Prescriptive","DHWCONDTANKMF","Condensing Tank Water Heater, Multifamily","Tanked water heater","Water Heating","GAS","DHW",939,21,6,5794,"OR","NBE","New Buildings","2024-01-01","2025-12-31","kBtu/hr",0,0,0,1.44,0,0,"None - ele","DHW",0,3.5,0,15,0,3.79,0,0,0,1,1,0,100,"NULL","NULL",100,100,100,100,"NULL","NULL","NULL","NULL","NULL","NULL",100,"NULL","Tanked water heater","KBTUHINPUT","kBtuh input per unit","T","Decimal",10,"ED","MANUFACTURER","Manufacturer Name","T","Alphanumeric",64,"ED","MODEL","Model","T","Alphanumeric",64,"ED","UNITS","Number of units","T","Integer",20,"ED","NULL","NULL","F","NULL","NULL","NULL","NULL","NULL","F","NULL","NULL","NULL","NULL","NULL","F","NULL","NULL","NULL","NULL","NULL","F","NULL","NULL","NULL","NULL","NULL","F","NULL","NULL","NULL","NULL","NULL","F","NULL","NULL","NULL","NULL","NULL","F","NULL","NULL","NULL","NULL","NULL","F","NULL","NULL","NULL","NULL","NULL","F","NULL","NULL","NULL","NULL","NULL","F","NULL","NULL","NULL","NULL","NULL","F","NULL","NULL","NULL","NULL","NULL","F","NULL","NULL","NULL","NULL","NULL","F","NULL","NULL","NULL",45282.122242824073,45282.122242824073]
[18353,"Yes","Prescriptive","DHWCONDNMF","Condensing Tank Water Heater, All Except MF","Tanked water heater","Water Heating","GAS","DHW",939,21,6,5797,"OR","NBE","New Buildings","2024-01-01","2025-12-31","kBtu/hr",0,0,0,1.1100000000000001,0,0,"None - ele","DHW",0,3.5,0,15,0,3.76,0,0,0,1,1,0,100,"NULL","NULL",100,100,100,100,"NULL","NULL","NULL","NULL","NULL","NULL",100,"NULL","Tanked water heater","KBTUHINPUT","kBtuh input per unit","T","Decimal",10,"ED","MANUFACTURER","Manufacturer Name","T","Alphanumeric",64,"ED","MODEL","Model","T","Alphanumeric",64,"ED","UNITS","Number of units","T","Integer",20,"ED","NULL","NULL","F","NULL","NULL","NULL","NULL","NULL","F","NULL","NULL","NULL","NULL","NULL","F","NULL","NULL","NULL","NULL","NULL","F","NULL","NULL","NULL","NULL","NULL","F","NULL","NULL","NULL","NULL","NULL","F","NULL","NULL","NULL","NULL","NULL","F","NULL","NULL","NULL","NULL","NULL","F","NULL","NULL","NULL","NULL","NULL","F","NULL","NULL","NULL","NULL","NULL","F","NULL","NULL","NULL","NULL","NULL","F","NULL","NULL","NULL","NULL","NULL","F","NULL","NULL","NULL","NULL","NULL","F","NULL","NULL","NULL",45282.122242824073,45282.122242824073]
[13323,"Yes","Prescriptive","DWSTCONHTEMPE","Dishwasher - Single Tank Conveyor- High Temp - Ele WH","Dishwasher","Appliance","ELE","DHW",764,35,3,3938,"OR","NBE","New Buildings",44562,"2024-12-31","Units",0,0,9402.4,0,0,0,"Restaurant Hot Water","Flat - gas",0,900,0,20,0,919.52,0,0,0,1,1,0,"NULL",100,100,"NULL","NULL","NULL","NULL","NULL","NULL","NULL","NULL","NULL","NULL","NULL","NULL","No Attributes ","NULL","NULL","F","NULL","NULL","NULL","NULL","NULL","F","NULL","NULL","NULL","NULL","NULL","F","NULL","NULL","NULL","NULL","NULL","F","NULL","NULL","NULL","NULL","NULL","F","NULL","NULL","NULL","NULL","NULL","F","NULL","NULL","NULL","NULL","NULL","F","NULL","NULL","NULL","NULL","NULL","F","NULL","NULL","NULL","NULL","NULL","F","NULL","NULL","NULL","NULL","NULL","F","NULL","NULL","NULL","NULL","NULL","F","NULL","NULL","NULL","NULL","NULL","F","NULL","NULL","NULL","NULL","NULL","F","NULL","NULL","NULL","NULL","NULL","F","NULL","NULL","NULL","NULL","NULL","F","NULL","NULL","NULL","NULL","NULL","F","NULL","NULL","NULL","NULL","NULL","F","NULL","NULL","NULL",44952.607310150466,44952.607310150466]
[13324,"Yes","Prescriptive","DWSTCONLDTEMPE","Dishwasher - Single Tank Conveyor - Low or Dual temp - Ele WH","Dishwasher","Appliance","ELE","DHW",764,35,3,3937,"OR","NBE","New Buildings",44562,"2024-12-31","Units",0,0,5335.72,0,0,0,"Restaurant Hot Water","Flat - gas",0,900,0,20,0,1,0,0,0,1,1,0,"NULL",100,100,"NULL","NULL","NULL","NULL","NULL","NULL","NULL","NULL","NULL","NULL","NULL","NULL","No Attributes ","NULL","NULL","F","NULL","NULL","NULL","NULL","NULL","F","NULL","NULL","NULL","NULL","NULL","F","NULL","NULL","NULL","NULL","NULL","F","NULL","NULL","NULL","NULL","NULL","F","NULL","NULL","NULL","NULL","NULL","F","NULL","NULL","NULL","NULL","NULL","F","NULL","NULL","NULL","NULL","NULL","F","NULL","NULL","NULL","NULL","NULL","F","NULL","NULL","NULL","NULL","NULL","F","NULL","NULL","NULL","NULL","NULL","F","NULL","NULL","NULL","NULL","NULL","F","NULL","NULL","NULL","NULL","NULL","F","NULL","NULL","NULL","NULL","NULL","F","NULL","NULL","NULL","NULL","NULL","F","NULL","NULL","NULL","NULL","NULL","F","NULL","NULL","NULL","NULL","NULL","F","NULL","NULL","NULL",44952.607310150466,44952.607310150466]
[13325,"Yes","Prescriptive","DWMTCONHDTEMPE","Dishwasher - Multi Tank Conveyor - High or Dual Temp - Elec WH","Dishwasher","Appliance","ELE","DHW",764,35,3,3939,"OR","NBE","New Buildings","2022-01-01","2024-12-31","Units",0,0,4197.5,0,0,0,"Restaurant Hot Water","Flat - gas",0,900,0,20,0,1,0,0,0,1,1,0,"NULL",100,100,"NULL","NULL","NULL","NULL","NULL","NULL","NULL","NULL","NULL","NULL","NULL","NULL","No Attributes ","NULL","NULL","F","NULL","NULL","NULL","NULL","NULL","F","NULL","NULL","NULL","NULL","NULL","F","NULL","NULL","NULL","NULL","NULL","F","NULL","NULL","NULL","NULL","NULL","F","NULL","NULL","NULL","NULL","NULL","F","NULL","NULL","NULL","NULL","NULL","F","NULL","NULL","NULL","NULL","NULL","F","NULL","NULL","NULL","NULL","NULL","F","NULL","NULL","NULL","NULL","NULL","F","NULL","NULL","NULL","NULL","NULL","F","NULL","NULL","NULL","NULL","NULL","F","NULL","NULL","NULL","NULL","NULL","F","NULL","NULL","NULL","NULL","NULL","F","NULL","NULL","NULL","NULL","NULL","F","NULL","NULL","NULL","NULL","NULL","F","NULL","NULL","NULL","NULL","NULL","F","NULL","NULL","NULL",44952.607310150466,44952.607310150466]
{"$rows_left_out":198}
{"sheet":"EquipOpt Lookups","index":7,"n_rows":1063,"n_cols":15,"rows_kept":1063,"cut":false,"hidden":true,"merged":[]}
[null,"Zipcode","CoolingZone","HeatingZone","Combined",null,"Electric",null,"Gas",null,"Fuel/DHW Type",null,"Code Year",null,"Building Type"]
[null,97001,2,2,{"$f":"\"CZ\"&C2&\" \"&\"HZ\"&D2","v":"CZ2 HZ2"},null,"Select Electric Utility",null,"Select Gas Utility",null,"Select Type",null,"Select Code Year",null,"Select Building Type"]
[null,97002,2,1,{"$f":"\"CZ\"&C3&\" \"&\"HZ\"&D3","v":"CZ2 HZ1"},null,"Pacific Power",null,"Cascade Natural Gas",null,"Electric",null,"2019 Code Year",null,"Lodging (Hotel/Motel/Dormitory)"]
[null,97003,2,1,"CZ2 HZ1",null,"Portland General Electric",null,"NW Natural",null,"Gas",null,"2021 Code Year",null,"Multifamily"]
[null,97004,2,1,"CZ2 HZ1",null,"Other",null,"Avista",null,null,null,null,null,"Commercial and Other"]
[null,97005,2,1,"CZ2 HZ1",null,null,null,"None"]
[null,97006,2,1,"CZ2 HZ1"]
[null,97007,2,1,"CZ2 HZ1"]
{"$rows_left_out":1055}