{"text_format":"1","workbook":"xlsx","n_sheets":8,"sheets":["Standard Equipment Workbook","Equipment Options","Changelog","Measure Totals","Import Pivot","MeasureTotals Lookups","Active Measures","EquipOpt Lookups"],"not_rendered":{"charts":0,"images":1,"macros":1,"external_links":0,"defined_names":46,"comments":1,"pivot_tables":2},"unopened":[],"bounds":{"document_bytes":16777216,"sheet_cells":100000,"rows_first":2000,"rows_last":500,"rows_between":2000,"halvings":0,"cell_chars":16384,"cell_head_chars":4096},"cells_cut":0,"cells_raw":0,"read":"whole","date_system":"1900"}

{"sheet":"Standard Equipment Workbook","index":0,"n_rows":43,"n_cols":30,"rows_kept":43,"cut":false,"hidden":false,"merged":[[42,28,42,29],[36,1,36,33],[39,1,39,14],[33,6,33,14],[41,20,41,26],[41,27,41,33],[41,1,41,19],[39,27,39,33],[37,1,38,33],[39,15,39,26],[33,1,33,5],[34,1,34,5],[33,27,33,33],[34,6,34,14],[13,2,13,33],[6,10,6,11],[15,2,15,33],[7,1,7,33],[9,1,9,33],[11,1,11,33],[10,1,10,33],[6,8,6,9],[14,3,14,33],[6,16,6,18],[6,22,6,27],[23,1,23,33],[30,21,30,28],[29,28,29,33],[30,5,30,11],[28,25,28,33],[30,29,30,33],[25,1,25,33],[27,1,27,33],[28,1,28,6],[29,1,29,6],[29,7,29,19],[24,1,24,24],[24,26,24,33],[28,7,28,19],[21,2,21,33],[16,3,16,33],[17,2,17,33],[22,2,22,33],[18,2,18,33],[19,2,19,33],[20,3,20,33],[32,6,32,14],[32,1,32,5],[32,27,32,33],[34,27,34,33],[34,18,34,26],[33,18,33,26],[32,18,32,26]]}
[]
[null,"Standard Equipment"]
[null,"New Buildings l Incentive Application l Form 520S"]
[]
[]
[]
[null,"For Program Use Only",null,null,null,null,null,null,"OM:",null,null,null,"Project ID:",null,null,null,null,null,null,"PT ID:",null,null,null,null,null,null,null,null,null,"v2024.1"]
[null,"CLEAResult is a Program Management Contractor (PMC) for Energy Trust of Oregon, Inc."]
[]
[null,"OVERVIEW AND ELIGIBILITY"]
[null,"A signed copy of the Form 510A: Project Enrollment Application must accompany or precede this Incentive Application, and only those projects approved for enrollment by the New Buildings program (Program) can apply for incentive funding. This Incentive Application must be submitted to the Program along with all required documentation. Any equipment which, either separately or as part of a project, has or will receive an incentive from any other Energy Trust offering is ineligible."]
[null,"STEPS TO PARTICIPATE"]
[]
[null,"1. ","Successfully enroll your project as described in the Project Enrollment Application."]
[null,null,null,"» Electric customers of Portland General Electric or Pacific Power can apply for incentives for qualifying electric equipment, and natural gas customers (on qualifying rate schedules) of NW Natural, Cascade Natural Gas or Avista can apply for incentives for qualifying natural gas equipment. "]
[null,"2. ","Complete this Incentive Application and submit it to the Program, along with:"]
[null,null,null,"» Product data sheets or other documentation demonstrating equipment compliance"]
[null,"3. ","Following its review of the application, Energy Trust will notify Project Owner via email of its decision. If the application is approved for an incentive reservation, you will receive a written notice. The incentive reservation notice will inform Project Owner of the estimated incentive and incentive reservation period (i.e. the deadline to install the measures and submit all required completion documentation)."]
[null,"4. ","Install the energy efficient equipment."]
[null,"5. ","To request payment, submit the following to the Program, before the established incentive reservation deadline, for verification:"]
[null,null,null,"» Complete, signed Form 540PR: Payment Request \n» Revised version of this Incentive Application, required if installed measures differ from initial submittal\n» Product data sheets or other documentation demonstrating equipment compliance\n» Payment documentation (suppliers or contractors can send copies of the invoices directly to the Program)\n» Project Owner's current W-9 (if not previously submitted)"]
[null,null,"If Project Owner applies for additional installed  incentives using other Energy Trust tools, workbooks, or forms, the Program will combine all approved installed  incentives into one payment and only one signed Payment Request is required."]
[null,"6. ","A site verification visit may be required by the Program prior to final payment."]
[null,"INCENTIVE CALCULATION"]
[null,"Based on the equipment you have selected in this workbook, your incentive is estimated at:",null,null,null,null,null,null,null,null,null,null,null,null,null,null,null,null,null,null,null,null,null,null,null,null,{"$f":"IF(OR(SelectedElectric=\"< Select from drop down >\",SelectedHeat=\"< Select from drop down >\",G35=\"< Select from drop down >\",SelectedGas=\"< Select from drop down >\",SelectedDHW=\"< Select from drop down >\"),\"Complete Project Information\",MIN(SUM('Equipment Options'!J300),499999))","v":0}]
[null,"No incentives are reserved unless an incentive reservation is issued in response to this application. Reserved amounts are estimates only and the final amount may vary depending on upon actual qualifying equipment installed and operating as verified by the Program. Incentives are subject to Program per-project installation incentive caps."]
[]
[null,"PROJECT INFORMATION"]
[null,"Project Owner Name",null,null,null,null,null,null,null,null,null,null,null,null,null,null,null,null,null,null,null,"Company"]
[null,"Building/Project Name",null,null,null,null,null,null,null,null,null,null,null,null,null,null,null,null,null,null,null,"Project ID (if known)"]
[null,"Permit Date",null,null,null,null,null,null,null,null,null,null,null,null,null,null,null,null,null,null,null,"Construction \nCompletion Date"]
[]
[null,"Electric Utility:",null,null,null,null,"Select Electric Utility",null,null,null,null,null,null,null,null,null,null,null,"Gas Utility:",null,null,null,null,null,null,null,null,"Select Gas Utility"]
[null,"Heating Fuel:",null,null,null,null,"Select Type",null,null,null,null,null,null,null,null,null,null,null,"Domestic Hot Water (DHW) Fuel:",null,null,null,null,null,null,null,null,"Select Type"]
[null,"Building Type:",null,null,null,null,"Select Building Type",null,null,null,null,null,null,null,null,null,null,null,"Building Code Year:",null,null,null,null,null,null,null,null,"Select Code Year"]
[]
[null,"SUBMITTAL"]
[null,"By typing or printing my name below, I represent to Energy Trust that (i) I have completed this application completely, truthfully and accurately to the best of my knowledge, (ii) I have read, understand and agree that the terms and conditions contained in this Incentive Application are in addition to, and governed by, Project Owner’s Project Enrollment Application agreement with Energy Trust for the identified project; (iii) I am authorized to enter into this agreement on behalf of the named Project Owner; and (iv) all of the information in the submitted Project Enrollment Application agreement remains true and correct as of the date of this submission. \n\nSubmitted By: (Must be an authorized representative of Project Owner)\n\n"]
[]
[]
[null,"Type or Print Name Here",null,null,null,null,null,null,null,null,null,null,null,null,null,null,null,null,"Title",null,null,null,null,null,null,null,null,"Date"]
[]
[null,"Firm name",null,null,null,null,null,null,null,null,null,null,null,null,null,null,null,null,null,null,null,null,"Phone",null,null,null,null,null,"Email"]

{"sheet":"Equipment Options","index":1,"n_rows":304,"n_cols":30,"rows_kept":304,"cut":false,"hidden":false,"merged":[[20,24,22,24],[15,24,17,24],[84,24,87,24],[90,24,93,24],[173,3,174,3],[170,3,171,3],[5,24,5,29],[47,22,49,22],[47,24,49,24],[10,24,12,24],[10,22,12,22],[8,22,8,23],[8,24,8,29],[30,24,32,24],[34,24,37,24],[34,22,37,22],[41,22,43,22],[41,24,43,24],[30,22,32,22],[5,1,5,9],[5,15,5,21],[8,1,8,10],[6,1,6,2],[134,2,135,2],[119,3,120,3],[124,3,125,3],[126,3,127,3],[128,3,129,3],[130,3,131,3],[97,22,98,22],[91,22,92,22],[71,1,71,10],[107,3,108,3],[290,22,293,22],[8,15,8,21],[15,22,17,22],[20,22,22,22],[25,22,28,22],[84,22,87,22],[54,22,56,22],[100,22,102,22],[5,22,5,23],[160,22,161,22],[167,24,170,24],[180,22,186,22],[180,24,186,24],[167,22,170,22],[189,22,194,22],[176,3,177,3],[301,1,302,10],[299,9,299,10],[300,1,300,10],[299,1,299,8],[278,22,281,22],[237,1,237,10],[239,22,240,22],[296,22,297,22],[228,22,234,22],[296,24,297,24],[239,24,240,24],[243,22,244,22],[243,24,244,24],[247,22,248,22],[251,22,252,22],[251,24,252,24],[259,22,260,22],[259,24,260,24],[160,24,162,24],[100,24,102,24],[142,24,145,24],[105,24,106,24],[107,24,108,24],[111,22,113,22],[107,22,108,22],[111,24,113,24],[116,22,118,22],[116,24,118,24],[124,22,128,22],[124,24,128,24],[133,22,135,22],[133,24,135,24],[139,22,140,22],[154,22,155,22],[154,24,156,24],[148,22,150,22],[148,24,150,24],[54,24,56,24],[58,22,61,22],[25,24,28,24],[58,24,61,24],[64,24,67,24],[64,22,67,22],[73,24,75,24],[79,22,80,22],[78,24,81,24],[73,22,75,22],[97,24,98,24],[255,22,256,22],[255,24,256,24],[263,22,265,22],[290,24,293,24],[138,24,140,24],[142,22,145,22],[247,24,248,24],[283,24,285,24],[283,22,285,22],[263,24,265,24],[268,22,272,22],[268,24,272,24],[275,22,276,22],[275,24,276,24],[278,24,281,24],[189,24,194,24],[197,22,205,22],[197,24,205,24],[208,22,215,22],[208,24,215,24],[218,24,225,24],[218,22,225,22],[228,24,234,24]]}
[null,null,{"$f":"_xlfn.CONCAT(\"Project Name: \", ProjectName)","v":"Project Name: "},{"$f":"IFERROR(\n_xlfn.IFS(\nAND(OR(SelectedElectric=\"Pacific Power\",SelectedElectric=\"Portland General Electric\"),NOT(SelectedGas=\"None\"),NOT(SelectedGas=\"Select Gas Utility\")),\"Full Territory\",\nAND(OR(SelectedElectric=\"Pacific Power\",SelectedElectric=\"Portland General Electric\"),OR(SelectedGas=\"None\",SelectedGas=\"Select Gas Utility\")),\"Electric Only\",\nAND(OR(SelectedElectric=\"Other\",SelectedElectric=\"Select Electric Utility\"),NOT(SelectedGas=\"None\"),NOT(SelectedGas=\"Select Gas Utility\")),\"Gas Only\"\n),\"None Selected\")","v":"None Selected"}]
[null,null,{"$f":"_xlfn.CONCAT(\"Building Type: \", SelectedBldgType)","v":"Building Type: Select Building Type"},{"$f":"_xlfn.CONCAT(\"Heating: \", SelectedHeat)","v":"Heating: Select Type"}]
[null,null,{"$f":"_xlfn.CONCAT(\"Electric Utility: \", SelectedElectric)","v":"Electric Utility: Select Electric Utility"},{"$f":"_xlfn.CONCAT(\"DHW: \", SelectedDHW)","v":"DHW: Select Type"}]
[null,null,{"$f":"_xlfn.CONCAT(\"Gas Utility: \", SelectedGas)","v":"Gas Utility: Select Gas Utility"}]
[]
[null,null,null,null,null,null,null,null,null,null,null,null,null,null,null,null,null,null,null,null,null,null,"Review Instructions & Required Documentation",null,"Site Visit Checklist"]
[null,"Equipment Option",null,"Requirements","Installation Setting","Incentive Basis","Incentive",null,"Quantity","Total Incentive","Model numbers",null,"MAD ID","Product Code","Quantity","Unit kWh","Unit therms","Savings (kWh)","Savings (therms)","Elec Inc","Gas Inc","Total Inc","Review Instructions & Required Documentation","Notes","SV Instructions","# of units installed","# of units verified","Location(s)","Photo(s)","Notes"]
[]
[null,"Multifamily Only Options"]
[]
[null,null,"Bath Fan ","ENERGY STAR® Continuous Operating Bath Fans","Multifamily","each","≥ 5 cfm/W, < 10 cfm/W",15,0,{"$f":"IF(ISNA(V11),0,V11)","v":0},null,null,269,{"$f":"IF(\nAND(OR(SelectedElectric=\"Pacific Power\",SelectedElectric=\"Portland General Electric\"),$I11>0),\"BFSS5\",\"DNQ\")","v":"DNQ"},{"$f":"$I11","v":0},{"$f":"IFERROR(\n_xlfn.XLOOKUP($N11,ProductCode,DefaultKwh,0,0),0)","v":0},{"$f":"IFERROR(\n_xlfn.XLOOKUP($N11,ProductCode,DefaultTherms,0,0),0)","v":0},{"$f":"IFERROR($I11*$P11,0)","v":0},{"$f":"IFERROR($I11*$Q11,0)","v":0},{"$f":"IFERROR((\n(_xlfn.XLOOKUP($N11,ProductCode,AllocationElectric,0,0))*$V11)/100,0)","v":0},{"$f":"IFERROR((\n(_xlfn.XLOOKUP($N11,ProductCode,AllocationGas,0,0))*$V11)/100,0)","v":0},{"$f":"IFERROR(\n(_xlfn.XLOOKUP($N11,ProductCode,DefaultIncentive,0,0)) * $I11,0)","v":0},"-Product Cut Sheet: verify measure requirements",null,"Verify installation of the equipment, photograph any label plates/stickers that list the make and model. Confirm exhaust rate (cfm).",{"$f":"IF($I11<>\"\",$I11,\"\")","v":0}]
[null,null,{"$f":"\"- Continuous Single Speed\"","v":"- Continuous Single Speed"},"Single speed fans ≤50 cfm exhaust rate",null,null,"≥ 10 cfm/W, < 15 cfm/W",25,0,0,null,null,269,{"$f":"IF(\nAND(OR(SelectedElectric=\"Pacific Power\",SelectedElectric=\"Portland General Electric\"),$I11>0),\"BFSS10\",\"DNQ\")","v":"DNQ"},{"$f":"$I12","v":0},{"$f":"IFERROR(\n_xlfn.XLOOKUP($N12,ProductCode,DefaultKwh,0,0),0)","v":0},{"$f":"IFERROR(\n_xlfn.XLOOKUP($N12,ProductCode,DefaultTherms,0,0),0)","v":0},{"$f":"IFERROR($I12*$P12,0)","v":0},{"$f":"IFERROR($I12*$Q12,0)","v":0},{"$f":"IFERROR((\n(_xlfn.XLOOKUP($N12,ProductCode,AllocationElectric,0,0))*$V12)/100,0)","v":0},{"$f":"IFERROR((\n(_xlfn.XLOOKUP($N12,ProductCode,AllocationGas,0,0))*$V12)/100,0)","v":0},{"$f":"IFERROR(\n(_xlfn.XLOOKUP($N12,ProductCode,DefaultIncentive,0,0)) * $I12,0)","v":0},null,null,null,{"$f":"IF($I12<>\"\",$I12,\"\")","v":0}]
[null,null,null,null,null,null,"≥ 15 cfm/W",30,0,0,null,null,269,{"$f":"IF(\nAND(OR(SelectedElectric=\"Pacific Power\",SelectedElectric=\"Portland General Electric\"),$I11>0),\"BFSS15\",\"DNQ\")","v":"DNQ"},{"$f":"$I13","v":0},{"$f":"IFERROR(\n_xlfn.XLOOKUP($N13,ProductCode,DefaultKwh,0,0),0)","v":0},{"$f":"IFERROR(\n_xlfn.XLOOKUP($N13,ProductCode,DefaultTherms,0,0),0)","v":0},{"$f":"IFERROR($I13*$P13,0)","v":0},{"$f":"IFERROR($I13*$Q13,0)","v":0},{"$f":"IFERROR((\n(_xlfn.XLOOKUP($N13,ProductCode,AllocationElectric,0,0))*$V13)/100,0)","v":0},{"$f":"IFERROR((\n(_xlfn.XLOOKUP($N13,ProductCode,AllocationGas,0,0))*$V13)/100,0)","v":0},{"$f":"IFERROR(\n(_xlfn.XLOOKUP($N13,ProductCode,DefaultIncentive,0,0)) * $I13,0)","v":0},null,null,null,{"$f":"IF($I13<>\"\",$I13,\"\")","v":0}]
[]
[]
[null,null,"Bath Fan","ENERGY STAR® Continuous Operating Bath Fans","Multifamily","each","≥ 5 cfm/W, < 10 cfm/W",15,0,{"$f":"IF(ISNA(V16),0,V16)","v":0},null,null,269,{"$f":"IF(\nAND(OR(SelectedElectric=\"Pacific Power\",SelectedElectric=\"Portland General Electric\"),$I16>0),\"BFTSSM5\",\"DNQ\")","v":"DNQ"},{"$f":"$I16","v":0},{"$f":"IFERROR(\n_xlfn.XLOOKUP($N16,ProductCode,DefaultKwh,0,0),0)","v":0},{"$f":"IFERROR(\n_xlfn.XLOOKUP($N16,ProductCode,DefaultTherms,0,0),0)","v":0},{"$f":"IFERROR($I16*$P16,0)","v":0},{"$f":"IFERROR($I16*$Q16,0)","v":0},{"$f":"IFERROR((\n(_xlfn.XLOOKUP($N16,ProductCode,AllocationElectric,0,0))*$V16)/100,0)","v":0},{"$f":"IFERROR((\n(_xlfn.XLOOKUP($N16,ProductCode,AllocationGas,0,0))*$V16)/100,0)","v":0},{"$f":"IFERROR(\n(_xlfn.XLOOKUP($N16,ProductCode,DefaultIncentive,0,0)) * $I16,0)","v":0},"-Product Cut Sheet: verify measure requirements",null,"Verify installation of the equipment, photograph any label plates/stickers that list the make and model. Confirm exhaust rates (cfm).",{"$f":"IF($I16<>\"\",$I16,\"\")","v":0}]
[null,null,{"$f":"\"- Continuous Two Speed\"","v":"- Continuous Two Speed"},"Two-speed fans: ≤50 cfm unoccupied exhaust rate ",null,null,"≥ 10 cfm/W, < 15 cfm/W",25,0,0,null,null,269,{"$f":"IF(\nAND(OR(SelectedElectric=\"Pacific Power\",SelectedElectric=\"Portland General Electric\"),$I16>0),\"BFTSSM10\",\"DNQ\")","v":"DNQ"},{"$f":"$I17","v":0},{"$f":"IFERROR(\n_xlfn.XLOOKUP($N17,ProductCode,DefaultKwh,0,0),0)","v":0},{"$f":"IFERROR(\n_xlfn.XLOOKUP($N17,ProductCode,DefaultTherms,0,0),0)","v":0},{"$f":"IFERROR($I17*$P17,0)","v":0},{"$f":"IFERROR($I17*$Q17,0)","v":0},{"$f":"IFERROR((\n(_xlfn.XLOOKUP($N17,ProductCode,AllocationElectric,0,0))*$V17)/100,0)","v":0},{"$f":"IFERROR((\n(_xlfn.XLOOKUP($N17,ProductCode,AllocationGas,0,0))*$V17)/100,0)","v":0},{"$f":"IFERROR(\n(_xlfn.XLOOKUP($N17,ProductCode,DefaultIncentive,0,0)) * $I17,0)","v":0},null,null,null,{"$f":"IF($I17<>\"\",$I17,\"\")","v":0}]
[null,null,{"$f":"\"- Less than 90 cfm\"","v":"- Less than 90 cfm"},"AND ≤200 cfm occupied exhaust rate",null,null,"≥ 15 cfm/W",30,0,0,null,null,269,{"$f":"IF(\nAND(OR(SelectedElectric=\"Pacific Power\",SelectedElectric=\"Portland General Electric\"),$I16>0),\"BFTSSM15\",\"DNQ\")","v":"DNQ"},{"$f":"$I18","v":0},{"$f":"IFERROR(\n_xlfn.XLOOKUP($N18,ProductCode,DefaultKwh,0,0),0)","v":0},{"$f":"IFERROR(\n_xlfn.XLOOKUP($N18,ProductCode,DefaultTherms,0,0),0)","v":0},{"$f":"IFERROR($I18*$P18,0)","v":0},{"$f":"IFERROR($I18*$Q18,0)","v":0},{"$f":"IFERROR((\n(_xlfn.XLOOKUP($N18,ProductCode,AllocationElectric,0,0))*$V18)/100,0)","v":0},{"$f":"IFERROR((\n(_xlfn.XLOOKUP($N18,ProductCode,AllocationGas,0,0))*$V18)/100,0)","v":0},{"$f":"IFERROR(\n(_xlfn.XLOOKUP($N18,ProductCode,DefaultIncentive,0,0)) * $I18,0)","v":0},null,null,null,{"$f":"IF($I18<>\"\",$I18,\"\")","v":0}]
[]
[]
[null,null,"Bath Fan","ENERGY STAR® Continuous Operating Bath Fans","Multifamily","each","≥5 cfm/W, <10 cfm/W",15,0,{"$f":"IF(ISNA(V21),0,V21)","v":0},null,null,269,{"$f":"IF(\nAND(OR(SelectedElectric=\"Pacific Power\",SelectedElectric=\"Portland General Electric\"),$I21>0),\"BFTSLG5\",\"DNQ\")","v":"DNQ"},{"$f":"$I21","v":0},{"$f":"IFERROR(\n_xlfn.XLOOKUP($N21,ProductCode,DefaultKwh,0,0),0)","v":0},{"$f":"IFERROR(\n_xlfn.XLOOKUP($N21,ProductCode,DefaultTherms,0,0),0)","v":0},{"$f":"IFERROR($I21*$P21,0)","v":0},{"$f":"IFERROR($I21*$Q21,0)","v":0},{"$f":"IFERROR((\n(_xlfn.XLOOKUP($N21,ProductCode,AllocationElectric,0,0))*$V21)/100,0)","v":0},{"$f":"IFERROR((\n(_xlfn.XLOOKUP($N21,ProductCode,AllocationGas,0,0))*$V21)/100,0)","v":0},{"$f":"IFERROR(\n(_xlfn.XLOOKUP($N21,ProductCode,DefaultIncentive,0,0)) * $I21,0)","v":0},"-Product Cut Sheet: verify measure requirements",null,"Verify installation of the equipment, photograph any label plates/stickers that list the make and model. Confirm exhaust rates (cfm).",{"$f":"IF($I21<>\"\",$I21,\"\")","v":0}]
[null,null,{"$f":"\"- Continuous Two Speed\"","v":"- Continuous Two Speed"},"Two-speed fans: ≤50 cfm unoccupied exhaust rate ",null,null,"≥10 cfm/W, <15 cfm/W",25,0,0,null,null,269,{"$f":"IF(\nAND(OR(SelectedElectric=\"Pacific Power\",SelectedElectric=\"Portland General Electric\"),$I21>0),\"BFTSLG10\",\"DNQ\")","v":"DNQ"},{"$f":"$I22","v":0},{"$f":"IFERROR(\n_xlfn.XLOOKUP($N22,ProductCode,DefaultKwh,0,0),0)","v":0},{"$f":"IFERROR(\n_xlfn.XLOOKUP($N22,ProductCode,DefaultTherms,0,0),0)","v":0},{"$f":"IFERROR($I22*$P22,0)","v":0},{"$f":"IFERROR($I22*$Q22,0)","v":0},{"$f":"IFERROR((\n(_xlfn.XLOOKUP($N22,ProductCode,AllocationElectric,0,0))*$V22)/100,0)","v":0},{"$f":"IFERROR((\n(_xlfn.XLOOKUP($N22,ProductCode,AllocationGas,0,0))*$V22)/100,0)","v":0},{"$f":"IFERROR(\n(_xlfn.XLOOKUP($N22,ProductCode,DefaultIncentive,0,0)) * $I22,0)","v":0},null,null,null,{"$f":"IF($I22<>\"\",$I22,\"\")","v":0}]
[null,null,{"$f":"\"- Greater than 90 cfm\"","v":"- Greater than 90 cfm"},"AND ≤200 cfm occupied exhaust rate",null,null,"≥15 cfm/W",30,0,0,null,null,269,{"$f":"IF(\nAND(OR(SelectedElectric=\"Pacific Power\",SelectedElectric=\"Portland General Electric\"),$I21>0),\"BFTSLG15\",\"DNQ\")","v":"DNQ"},{"$f":"$I23","v":0},{"$f":"IFERROR(\n_xlfn.XLOOKUP($N23,ProductCode,DefaultKwh,0,0),0)","v":0},{"$f":"IFERROR(\n_xlfn.XLOOKUP($N23,ProductCode,DefaultTherms,0,0),0)","v":0},{"$f":"IFERROR($I23*$P23,0)","v":0},{"$f":"IFERROR($I23*$Q23,0)","v":0},{"$f":"IFERROR((\n(_xlfn.XLOOKUP($N23,ProductCode,AllocationElectric,0,0))*$V23)/100,0)","v":0},{"$f":"IFERROR((\n(_xlfn.XLOOKUP($N23,ProductCode,AllocationGas,0,0))*$V23)/100,0)","v":0},{"$f":"IFERROR(\n(_xlfn.XLOOKUP($N23,ProductCode,DefaultIncentive,0,0)) * $I23,0)","v":0},null,null,null,{"$f":"IF($I23<>\"\",$I23,\"\")","v":0}]
[]
[]
[null,null,"Commercial Clothes Washer w/ Dryer","ENERGY STAR®","Multifamily","each","Full service* site, electric dryer fuel",400,0,{"$f":"IF(ISNA(V26),0,V26)","v":0},null,null,89,{"$f":"IFERROR(\n_xlfn.IFS(\nAND($C$30=\"Electric Dryer\",$D$1=\"Full Territory\", SelectedDHW=\"Electric\"),\"COMWASHEDRYEMFFT\",\nAND($C$30=\"Electric Dryer\",$D$1=\"Full Territory\", SelectedDHW=\"Gas\"),\"COMWASHGDRYEMFFT\"),\"DNQ\")","v":"DNQ"},{"$f":"$I26","v":0},{"$f":"IFERROR(\n_xlfn.XLOOKUP($N26,ProductCode,DefaultKwh,0,0),0)","v":0},{"$f":"IFERROR(\n_xlfn.XLOOKUP($N26,ProductCode,DefaultTherms,0,0),0)","v":0},{"$f":"IFERROR($I26*$P26,0)","v":0},{"$f":"IFERROR($I26*$Q26,0)","v":0},{"$f":"IFERROR((\n(_xlfn.XLOOKUP($N26,ProductCode,AllocationElectric,0,0))*$V26)/100,0)","v":0},{"$f":"IFERROR((\n(_xlfn.XLOOKUP($N26,ProductCode,AllocationGas,0,0))*$V26)/100,0)","v":0},{"$f":"IFERROR(\n(_xlfn.XLOOKUP($N26,ProductCode,DefaultIncentive,0,0)) * $I26,0)","v":0},"-Product Cut Sheet, verify Energy Star. ",null,"Verify installation of the equipment, photograph any accessible label plates / stickers that list the make and model. Confirm that units are front-loading",{"$f":"IF($I26<>\"\",$I26,\"\")","v":0}]
[null,null,null,"Front-loading with hot water provided by a participating utility",null,null,"Full service* site, gas dryer fuel",350,0,{"$f":"IF(ISNA(V27),0,V27)","v":0},null,null,89,{"$f":"IFERROR(\n_xlfn.IFS(\nAND($C$30=\"Gas Dryer\",$D$1=\"Full Territory\", SelectedDHW=\"Electric\"),\"COMWASHEDRYGMFFT\",\nAND($C$30=\"Gas Dryer\",$D$1=\"Full Territory\", SelectedDHW=\"Gas\"),\"COMWASHGDRYGMFFT\"\n),\"DNQ\")","v":"DNQ"},{"$f":"$I27","v":0},{"$f":"IFERROR(\n_xlfn.XLOOKUP($N27,ProductCode,DefaultKwh,0,0),0)","v":0},{"$f":"IFERROR(\n_xlfn.XLOOKUP($N27,ProductCode,DefaultTherms,0,0),0)","v":0},{"$f":"IFERROR($I27*$P27,0)","v":0},{"$f":"IFERROR($I27*$Q27,0)","v":0},{"$f":"IFERROR((\n(_xlfn.XLOOKUP($N27,ProductCode,AllocationElectric,0,0))*$V27)/100,0)","v":0},{"$f":"IFERROR((\n(_xlfn.XLOOKUP($N27,ProductCode,AllocationGas,0,0))*$V27)/100,0)","v":0},{"$f":"IFERROR(\n(_xlfn.XLOOKUP($N27,ProductCode,DefaultIncentive,0,0)) * $I27,0)","v":0},null,null,null,0]
[null,null,null,"Electric only includes sites using propane or other fuels for water heat or dryer fuel",null,null,"Electric only",150,0,{"$f":"IF(ISNA(V28),0,V28)","v":0},null,null,89,{"$f":"IFERROR(\n_xlfn.IFS(\nAND($C$30=\"Electric Dryer\",$D$1=\"Electric Only\", SelectedDHW=\"Gas\"),\"COMWASHGDRYEMFET\",\nAND($C$30=\"Gas Dryer\",$D$1=\"Electric Only\", SelectedDHW=\"Electric\"),\"COMWASHEDRYGMFET\",\nAND($C$30=\"Electric Dryer\", SelectedDHW=\"Other\"),\"COMWASHEDRYGMFET\",\nAND($C$30=\"Gas Dryer\", SelectedDHW=\"Other\"),\"COMWASHEDRYGMFET\"),\"DNQ\")","v":"DNQ"},0,{"$f":"IFERROR(\n_xlfn.XLOOKUP($N28,ProductCode,DefaultKwh,0,0),0)","v":0},{"$f":"IFERROR(\n_xlfn.XLOOKUP($N28,ProductCode,DefaultTherms,0,0),0)","v":0},0,0,{"$f":"IFERROR((\n(_xlfn.XLOOKUP($N28,ProductCode,AllocationElectric,0,0))*$V28)/100,0)","v":0},{"$f":"IFERROR((\n(_xlfn.XLOOKUP($N28,ProductCode,AllocationGas,0,0))*$V28)/100,0)","v":0},{"$f":"IFERROR(\n(_xlfn.XLOOKUP($N28,ProductCode,DefaultIncentive,0,0)) * $I28,0)","v":0}]
[null,null,null,null,null,null,"Gas only",100,0,{"$f":"IF(ISNA(V29),0,V29)","v":0},null,null,89,{"$f":"IFERROR(\n_xlfn.IFS(\nAND($C$30=\"Electric Dryer\",$D$1=\"Gas Only\", SelectedDHW=\"Gas\"),\"COMWASHGDRYEMFGT\",\nAND($C$30=\"Gas Dryer\",$D$1=\"Gas Only\", SelectedDHW=\"Electric\"),\"COMWASHGDRYGMFGT\",\nAND($C$30=\"Gas Dryer\",$D$1=\"Gas Only\", SelectedDHW=\"Gas\"),\"COMWASHGDRYGMFGT\"\n),\"DNQ\")","v":"DNQ"},0,{"$f":"IFERROR(\n_xlfn.XLOOKUP($N29,ProductCode,DefaultKwh,0,0),0)","v":0},{"$f":"IFERROR(\n_xlfn.XLOOKUP($N29,ProductCode,DefaultTherms,0,0),0)","v":0},0,0,{"$f":"IFERROR((\n(_xlfn.XLOOKUP($N29,ProductCode,AllocationElectric,0,0))*$V29)/100,0)","v":0},{"$f":"IFERROR((\n(_xlfn.XLOOKUP($N29,ProductCode,AllocationGas,0,0))*$V29)/100,0)","v":0},{"$f":"IFERROR(\n(_xlfn.XLOOKUP($N29,ProductCode,DefaultIncentive,0,0)) * $I29,0)","v":0},null,null,null,0]
[null,null,"<Select Dryer Type>"]
[null,null,null,null,null,null,null,null,null,null,null,null,null,null,null,null,null,null,null,null,null,null,"-Product cut sheet or Energy Star certificate. Verification of purchase source (such as a receipt of purchase).",null,"Verify installation of the equipment, photograph any accessible label plates / stickers that list the make and model\nVerify that the dryer was not purchased through a retail channel",""]
[null,null,"Electric Clothes Dryer, In-Unit","ENERGY STAR®","Multifamily","each",null,25,0,{"$f":"IF(ISNA(V32),0,V32)","v":0},null,null,231,{"$f":"IF(OR(SelectedElectric=\"Pacific Power\",SelectedElectric=\"Portland General Electric\"),\"DRYERELE\",\"DNQ\")","v":"DNQ"},0,{"$f":"IFERROR(\n_xlfn.XLOOKUP($N32,ProductCode,DefaultKwh,0,0),0)","v":0},{"$f":"IFERROR(\n_xlfn.XLOOKUP($N32,ProductCode,DefaultTherms,0,0),0)","v":0},0,0,{"$f":"IFERROR((\n(_xlfn.XLOOKUP($N32,ProductCode,AllocationElectric,0,0))*$V32)/100,0)","v":0},{"$f":"IFERROR((\n(_xlfn.XLOOKUP($N32,ProductCode,AllocationGas,0,0))*$V32)/100,0)","v":0},{"$f":"IFERROR(\n(_xlfn.XLOOKUP($N32,ProductCode,DefaultIncentive,0,0)) * $I32,0)","v":0},null,null,null,{"$f":"IF($I32<>\"\",$I32,\"\")","v":0}]
[null,null,null,"Dryer may not be purchased through retail channel"]
[]
[null,null,null,null,null,null,null,null,null,null,null,null,null,null,null,null,null,null,null,null,null,null,"-Product Cut Sheet. Copy of the NEEA product list showing the equipment model number (highlight or box the model number). Verification that the equipment is in-unit (shown in as-built plans).",null,"Verify installation of the equipment, photograph any accessible label plates / stickers that list the make and model #, capacity & efficiency\nVerify heater(s) are stand-alone, in-unit (i.e., one per dwelling unit)"]
[null,null,"Heat Pump Water Heater","Stand-alone, in-unit HPHW in new multifamily buildings","Multifamily","each",null,800,0,{"$f":"IF(ISNA(V36),0,V36)","v":0},null,null,52,{"$f":"IF(OR(SelectedDHW=\"Electric\",SelectedGas=\"None\"),\"COMHPWHT3\",\"DNQ\")","v":"DNQ"},{"$f":"$I37","v":0},{"$f":"IFERROR(\n_xlfn.XLOOKUP($N36,ProductCode,DefaultKwh,0,0),0)","v":0},{"$f":"IFERROR(\n_xlfn.XLOOKUP($N36,ProductCode,DefaultTherms,0,0),0)","v":0},{"$f":"IFERROR($I36*$P36,0)","v":0},{"$f":"IFERROR($I36*$Q36,0)","v":0},{"$f":"IFERROR((\n(_xlfn.XLOOKUP($N36,ProductCode,AllocationElectric,0,0))*$V36)/100,0)","v":0},{"$f":"IFERROR((\n(_xlfn.XLOOKUP($N36,ProductCode,AllocationGas,0,0))*$V36)/100,0)","v":0},{"$f":"IFERROR(\n(_xlfn.XLOOKUP($N36,ProductCode,DefaultIncentive,0,0)) * $I36,0)","v":0},null,null,null,{"$f":"IF($I36<>\"\",$I36,\"\")","v":0},{"$f":"IF($I37<>\"\",$I37,\"\")","v":""},"","",""]
[null,null,null,"Excludes central systems, contact the Program with eligibilty questions",null,null,null,null,null,null,null,null,null,null,null,null,null,null,null,null,null,null,null,null,null,{"$f":"IF($I38<>\"\",$I38,\"\")","v":""}]
[null,null,null,"Tier 3 minimum, per Advanced Water Heater Specifications v8.0",null,null,null,null,null,null,null,null,null,null,null,null,null,null,null,null,null,null,null,null,null,{"$f":"IF($I39<>\"\",$I39,\"\")","v":""}]
[null,null,null,"Verify at link below:",null,null,null,null,null,null,null,null,null,null,null,null,null,null,null,null,null,null,null,null,null,{"$f":"IF($I40<>\"\",$I40,\"\")","v":""}]
[null,null,null,"https://neea.org/resources/residential-unitary-hpwh-qualified-products-list",null,null,null,null,null,null,null,null,null,null,null,null,null,null,null,null,null,null,null,null,null,{"$f":"IF($I41<>\"\",$I41,\"\")","v":""}]
[null,null,null,null,null,null,null,null,null,null,null,null,null,null,null,null,null,null,null,null,null,null,null,null,null,""]
[null,null,null,null,null,null,null,null,null,null,null,null,null,null,null,null,null,null,null,null,null,null,"-Product Cut Sheet, verify Energy Star and tub capacity.",null,"Verify installation of the equipment, photograph any accessible label plates / stickers that list the make and model #, capacity & efficiency. Verify that units are front-loading and in-unit."]
[null,null,"Laundry Center Washer/Dryer Combo","ENERGY STAR®","Multifamily","each",null,85,0,{"$f":"IF(ISNA(V43),0,V43)","v":0},null,null,152,{"$f":"IFERROR(\n_xlfn.IFS(\nAND($D$1=\"Electric Only\",SelectedDHW=\"Electric\"),\"LCELEEOT\",\nAND($D$1=\"Gas Only\",SelectedDHW=\"Gas\"),\"LCGASGOT\",\nAND($D$1=\"Full Territory\",SelectedDHW=\"Electric\"),\"LCELE\",\nAND($D$1=\"Full Territory\",SelectedDHW=\"Gas\"),\"LCGAS\"),\"DNQ\")","v":"DNQ"},{"$f":"$I44","v":0},{"$f":"IFERROR(\n_xlfn.XLOOKUP($N43,ProductCode,DefaultKwh,0,0),0)","v":0},{"$f":"IFERROR(\n_xlfn.XLOOKUP($N43,ProductCode,DefaultTherms,0,0),0)","v":0},{"$f":"IFERROR($I43*$P43,0)","v":0},{"$f":"IFERROR($I43*$Q43,0)","v":0},{"$f":"IFERROR((\n(_xlfn.XLOOKUP($N43,ProductCode,AllocationElectric,0,0))*$V43)/100,0)","v":0},{"$f":"IFERROR((\n(_xlfn.XLOOKUP($N43,ProductCode,AllocationGas,0,0))*$V43)/100,0)","v":0},{"$f":"IFERROR(\n(_xlfn.XLOOKUP($N43,ProductCode,DefaultIncentive,0,0)) * $I43,0)","v":0},null,null,null,{"$f":"IF($I43<>\"\",$I43,\"\")","v":0}]
[null,null,{"$f":"\"- In-Unit\"","v":"- In-Unit"},"Tub: 2.5 cubic feet or more",null,null,null,null,null,null,null,null,null,null,null,null,null,null,null,null,null,null,null,null,null,{"$f":"IF($I44<>\"\",$I44,\"\")","v":""}]
[null,null,{"$f":"\"- Front-loading\"","v":"- Front-loading"},"Water heating must be provided by participating utility",null,null,null,null,null,null,null,null,null,null,null,null,null,null,null,null,null,null,null,null,null,{"$f":"IF($I45<>\"\",$I45,\"\")","v":""}]
[null,null,null,null,null,null,null,null,null,null,null,null,null,null,null,null,null,null,null,null,null,null,null,null,null,{"$f":"IF($I46<>\"\",$I46,\"\")","v":""}]
[]
[null,null,"Residential Clothes Washer","Residential front-loading clothes washers","Multifamily","each","Full service* site ",60,0,{"$f":"IF(ISNA(V48),0,V48)","v":0},null,null,152,{"$f":"IFERROR(\n_xlfn.IFS(\nAND(SelectedDHW=\"Electric\",$D$1=\"Full Territory\"),\"WASHELEFL\",\nAND(SelectedDHW=\"Gas\",$D$1=\"Full Territory\"),\"WASHGASFL\"\n),\"DNQ\")","v":"DNQ"},0,{"$f":"IFERROR(\n_xlfn.XLOOKUP($N48,ProductCode,DefaultKwh,0,0),0)","v":0},{"$f":"IFERROR(\n_xlfn.XLOOKUP($N48,ProductCode,DefaultTherms,0,0),0)","v":0},0,0,{"$f":"IFERROR((\n(_xlfn.XLOOKUP($N48,ProductCode,AllocationElectric,0,0))*$V48)/100,0)","v":0},{"$f":"IFERROR((\n(_xlfn.XLOOKUP($N48,ProductCode,AllocationGas,0,0))*$V48)/100,0)","v":0},{"$f":"IFERROR(\n(_xlfn.XLOOKUP($N48,ProductCode,DefaultIncentive,0,0)) * $I48,0)","v":0},"-Product Cut Sheet, verify Energy Star and tub capacity. Verification of the purchasing site (such as a reciept or invoice).",null,"Verify installation of the equipment, photograph any accessible label plates / stickers that list the make and model\nVerify that the dryer was not purchased through a retail channel",0]
[null,null,{"$f":"\"- In-Unit\"","v":"- In-Unit"},"At least 2.5 cubic feet tub capacity",null,null,"Electric only",60,0,0,null,null,152,{"$f":"IFERROR(\n_xlfn.IFS(\nAND(SelectedDHW=\"Electric\",$D$1=\"Electric Only\"),\"WASHELEFLEOT\"\n),\"DNQ\")","v":"DNQ"},0,{"$f":"IFERROR(\n_xlfn.XLOOKUP($N49,ProductCode,DefaultKwh,0,0),0)","v":0},{"$f":"IFERROR(\n_xlfn.XLOOKUP($N49,ProductCode,DefaultTherms,0,0),0)","v":0},0,0,{"$f":"IFERROR((\n(_xlfn.XLOOKUP($N49,ProductCode,AllocationElectric,0,0))*$V49)/100,0)","v":0},{"$f":"IFERROR((\n(_xlfn.XLOOKUP($N49,ProductCode,AllocationGas,0,0))*$V49)/100,0)","v":0},{"$f":"IFERROR(\n(_xlfn.XLOOKUP($N49,ProductCode,DefaultIncentive,0,0)) * $I49,0)","v":0},null,null,null,0]
[null,null,{"$f":"\"- Front-loading\"","v":"- Front-loading"},"ENERGY STAR",null,null,"Gas only",60,0,{"$f":"IF(ISNA(V50),0,V50)","v":0},null,null,152,{"$f":"IFERROR(\n_xlfn.IFS(\nAND(SelectedDHW=\"Gas\",$D$1=\"Gas Only\"),\"WASHGASFLGOT\"\n),\"DNQ\")","v":"DNQ"},0,{"$f":"IFERROR(\n_xlfn.XLOOKUP($N50,ProductCode,DefaultKwh,0,0),0)","v":0},{"$f":"IFERROR(\n_xlfn.XLOOKUP($N50,ProductCode,DefaultTherms,0,0),0)","v":0},0,0,{"$f":"IFERROR((\n(_xlfn.XLOOKUP($N50,ProductCode,AllocationElectric,0,0))*$V50)/100,0)","v":0},{"$f":"IFERROR((\n(_xlfn.XLOOKUP($N50,ProductCode,AllocationGas,0,0))*$V50)/100,0)","v":0},{"$f":"IFERROR(\n(_xlfn.XLOOKUP($N50,ProductCode,DefaultIncentive,0,0)) * $I50,0)","v":0},null,null,null,0]
[null,null,null,"Water heating must be provided by participating utility"]
[null,null,null,"Washer may not be puchased through retail channel",""]
[]
[null,null,null,null,null,null,null,null,null,null,null,null,null,null,null,null,null,null,null,null,null,null,null,null,null,""]
[null,null,"Residential Refrigerator","Residential ENERGY STAR refrigerator","Multifamily","each","ENERGY STAR",70,0,{"$f":"IF(ISNA(V55),0,V55)","v":0},null,null,112,{"$f":" IF(OR(SelectedElectric=\"Pacific Power\",SelectedElectric=\"Portland General Electric\"),\"ESTARFRIDGE\",\"DNQ\")","v":"DNQ"},0,{"$f":"IFERROR(\n_xlfn.XLOOKUP($N55,ProductCode,DefaultKwh,0,0),0)","v":0},{"$f":"IFERROR(\n_xlfn.XLOOKUP($N55,ProductCode,DefaultTherms,0,0),0)","v":0},0,0,{"$f":"IFERROR((\n(_xlfn.XLOOKUP($N55,ProductCode,AllocationElectric,0,0))*$V55)/100,0)","v":0},{"$f":"IFERROR((\n(_xlfn.XLOOKUP($N55,ProductCode,AllocationGas,0,0))*$V55)/100,0)","v":0},{"$f":"IFERROR(\n(_xlfn.XLOOKUP($N55,ProductCode,DefaultIncentive,0,0)) * $I55,0)","v":0},"-Product Cut Sheet, verify capacity and Energy Star",null,"Verify installation of the equipment, photograph any label plates / stickers that list the make and model # & capacity\nVerify no through door ice. Verify top mounted freezer.",0]
[null,null,null,"14.3 to 20.5 cubic feet",null,null,"Most Efficient (ESME)",70,0,0,null,null,112,{"$f":" IF(OR(SelectedElectric=\"Pacific Power\",SelectedElectric=\"Portland General Electric\"),\"ESMEFRIDGE\",\"DNQ\")","v":"DNQ"},0,{"$f":"IFERROR(\n_xlfn.XLOOKUP($N56,ProductCode,DefaultKwh,0,0),0)","v":0},{"$f":"IFERROR(\n_xlfn.XLOOKUP($N56,ProductCode,DefaultTherms,0,0),0)","v":0},0,0,{"$f":"IFERROR((\n(_xlfn.XLOOKUP($N56,ProductCode,AllocationElectric,0,0))*$V56)/100,0)","v":0},{"$f":"IFERROR((\n(_xlfn.XLOOKUP($N56,ProductCode,AllocationGas,0,0))*$V56)/100,0)","v":0},{"$f":"IFERROR(\n(_xlfn.XLOOKUP($N56,ProductCode,DefaultIncentive,0,0)) * $I56,0)","v":0},null,null,null,0]
[null,null,null,"Top mounted freezer and no through the door ice",null,null,"Emerging Technology Award (ESETA)",70,0,{"$f":"IF(ISNA(V57),0,V57)","v":0},null,null,112,{"$f":" IF(OR(SelectedElectric=\"Pacific Power\",SelectedElectric=\"Portland General Electric\"),\"ESETAFRIDGE\",\"DNQ\")","v":"DNQ"},0,{"$f":"IFERROR(\n_xlfn.XLOOKUP($N57,ProductCode,DefaultKwh,0,0),0)","v":0},{"$f":"IFERROR(\n_xlfn.XLOOKUP($N57,ProductCode,DefaultTherms,0,0),0)","v":0},0,0,{"$f":"IFERROR((\n(_xlfn.XLOOKUP($N57,ProductCode,AllocationElectric,0,0))*$V57)/100,0)","v":0},{"$f":"IFERROR((\n(_xlfn.XLOOKUP($N57,ProductCode,AllocationGas,0,0))*$V57)/100,0)","v":0},{"$f":"IFERROR(\n(_xlfn.XLOOKUP($N57,ProductCode,DefaultIncentive,0,0)) * $I57,0)","v":0},null,null,null,0]
[]
[null,null,null,null,null,null,null,null,null,null,null,null,null,null,null,null,null,null,null,null,null,null,"-Product Cut Sheet, documentation of operating hours.",null,"Verify installation setting is a totally enclosed parking garage\nVerify installation of VFD(s) on garage exhaust fans; obtain photographs of fan nameplate(s) and VFD equipment, and contamination sensors (CO/NO2)\nVerify garage operating hours ≥140 per week"]
[null,null,"VFD Control on Parking Garage Fans","Installed in totally enclosed parking garage","Multifamily","per cfm","<8,000 cfm and unconditioned space",0.5,0,{"$f":"IF(ISNA(V60),0,V60)","v":0},null,null,271,{"$f":"IF(AND(SelectedCodeYear=\"2019 Code Year\",OR(SelectedElectric=\"Pacific Power\",SelectedElectric=\"Portland General Electric\")),\"VFDGARMFSM2019\",\"DNQ\")","v":"DNQ"},{"$f":"$I60","v":0},{"$f":"IFERROR(\n_xlfn.XLOOKUP($N60,ProductCode,DefaultKwh,0,0),0)","v":0},{"$f":"IFERROR(\n_xlfn.XLOOKUP($N60,ProductCode,DefaultTherms,0,0),0)","v":0},{"$f":"IFERROR($I60*$P60,0)","v":0},{"$f":"IFERROR($I60*$Q60,0)","v":0},{"$f":"IFERROR((\n(_xlfn.XLOOKUP($N60,ProductCode,AllocationElectric,0,0))*$V60)/100,0)","v":0},{"$f":"IFERROR((\n(_xlfn.XLOOKUP($N60,ProductCode,AllocationGas,0,0))*$V60)/100,0)","v":0},{"$f":"IFERROR(\n(_xlfn.XLOOKUP($N60,ProductCode,DefaultIncentive,0,0)) * $I60,0)","v":0},null,null,null,{"$f":"IF($I60<>\"\",$I60,\"\")","v":0}]
[null,null,{"$f":"\"- 2019 Code Year\"","v":"- 2019 Code Year"},"Variable speed control on fan(s)",null,null,"≥8,000 cfm or conditioned space",0.1,0,{"$f":"IF(ISNA(V61),0,V61)","v":0},null,null,271,{"$f":"IF(AND(SelectedCodeYear=\"2019 Code Year\",OR(SelectedElectric=\"Pacific Power\",SelectedElectric=\"Portland General Electric\")),\"VFDGARMFLG2019\",\"DNQ\")","v":"DNQ"},0,{"$f":"IFERROR(\n_xlfn.XLOOKUP($N61,ProductCode,DefaultKwh,0,0),0)","v":0},{"$f":"IFERROR(\n_xlfn.XLOOKUP($N61,ProductCode,DefaultTherms,0,0),0)","v":0},0,0,{"$f":"IFERROR((\n(_xlfn.XLOOKUP($N61,ProductCode,AllocationElectric,0,0))*$V61)/100,0)","v":0},{"$f":"IFERROR((\n(_xlfn.XLOOKUP($N61,ProductCode,AllocationGas,0,0))*$V61)/100,0)","v":0},{"$f":"IFERROR(\n(_xlfn.XLOOKUP($N61,ProductCode,DefaultIncentive,0,0)) * $I61,0)","v":0},null,null,null,{"$f":"IF($I61<>\"\",$I61,\"\")","v":0}]
[null,null,null,"Contamination-sensing device (CO and NO2) employed"]
[null,null,null,"Operating Hours ≥140 per week"]
[]
[null,null,null,null,null,null,null,null,null,null,null,null,null,null,null,null,null,null,null,null,null,null,"-Product Cut Sheet, documentation of operating hours.",null,"Verify installation setting is a totally enclosed parking garage\nVerify installation of VFD(s) on garage exhaust fans; obtain photographs of fan nameplate(s) and VFD equipment, and contamination sensors (CO/NO2)\nVerify garage operating hours ≥140 per week"]
[null,null,"VFD Control on Parking Garage Fans","Installed in totally enclosed parking garage","Multifamily","per cfm","<30,000 sq ft and unconditioned space",0.5,0,{"$f":"IF(ISNA(V66),0,V66)","v":0},null,null,271,{"$f":"IF(AND(SelectedCodeYear=\"2021 Code Year\",OR(SelectedElectric=\"Pacific Power\",SelectedElectric=\"Portland General Electric\")),\"VFDGARMFSM\",\"DNQ\")","v":"DNQ"},{"$f":"$I66","v":0},{"$f":"IFERROR(\n_xlfn.XLOOKUP($N66,ProductCode,DefaultKwh,0,0),0)","v":0},{"$f":"IFERROR(\n_xlfn.XLOOKUP($N66,ProductCode,DefaultTherms,0,0),0)","v":0},{"$f":"IFERROR($I66*$P66,0)","v":0},{"$f":"IFERROR($I66*$Q66,0)","v":0},{"$f":"IFERROR((\n(_xlfn.XLOOKUP($N66,ProductCode,AllocationElectric,0,0))*$V66)/100,0)","v":0},{"$f":"IFERROR((\n(_xlfn.XLOOKUP($N66,ProductCode,AllocationGas,0,0))*$V66)/100,0)","v":0},{"$f":"IFERROR(\n(_xlfn.XLOOKUP($N66,ProductCode,DefaultIncentive,0,0)) * $I66,0)","v":0},null,null,null,{"$f":"IF($I66<>\"\",$I66,\"\")","v":0}]
[null,null,{"$f":"\"- 2021 Code Year\"","v":"- 2021 Code Year"},"Variable speed control on fan(s)",null,null,"≥30,000 sq ft or conditioned space",0.1,0,{"$f":"IF(ISNA(V67),0,V67)","v":0},null,null,271,{"$f":"IF(AND(SelectedCodeYear=\"2021 Code Year\",OR(SelectedElectric=\"Pacific Power\",SelectedElectric=\"Portland General Electric\")),\"VFDGARMFLG\",\"DNQ\")","v":"DNQ"},0,{"$f":"IFERROR(\n_xlfn.XLOOKUP($N67,ProductCode,DefaultKwh,0,0),0)","v":0},{"$f":"IFERROR(\n_xlfn.XLOOKUP($N67,ProductCode,DefaultTherms,0,0),0)","v":0},0,0,{"$f":"IFERROR((\n(_xlfn.XLOOKUP($N67,ProductCode,AllocationElectric,0,0))*$V67)/100,0)","v":0},{"$f":"IFERROR((\n(_xlfn.XLOOKUP($N67,ProductCode,AllocationGas,0,0))*$V67)/100,0)","v":0},{"$f":"IFERROR(\n(_xlfn.XLOOKUP($N67,ProductCode,DefaultIncentive,0,0)) * $I67,0)","v":0},null,null,null,{"$f":"IF($I67<>\"\",$I67,\"\")","v":0}]
[null,null,null,"Contamination-sensing device (CO and NO2) employed"]
[null,null,null,"Operating Hours ≥140 per week"]
[]
[]
[null,"HVAC & Domestic Hot Water Equipment"]
[]
[null,null,"Condensing Furnace","95% AFUE or better","Any","kBtu/hr",null,8.25,0,{"$f":"IF(ISNA(V74),0,V74)","v":0},null,null,270,{"$f":"IFERROR(\n_xlfn.IFS(\nAND(NOT(SelectedGas=\"None\"),SelectedHeat=\"Gas\"),\"GASFURNCONN\"),\"DNQ\")","v":"DNQ"},{"$f":"$I74","v":0},{"$f":"IFERROR(\n_xlfn.XLOOKUP($N74,ProductCode,DefaultKwh,0,0),0)","v":0},{"$f":"IFERROR(\n_xlfn.XLOOKUP($N74,ProductCode,DefaultTherms,0,0),0)","v":0},{"$f":"IFERROR($I74*$P74,0)","v":0},{"$f":"IFERROR($I74*$Q74,0)","v":0},{"$f":"IFERROR((\n(_xlfn.XLOOKUP($N74,ProductCode,AllocationElectric,0,0))*$V74)/100,0)","v":0},{"$f":"IFERROR((\n(_xlfn.XLOOKUP($N74,ProductCode,AllocationGas,0,0))*$V74)/100,0)","v":0},{"$f":"IFERROR(\n(_xlfn.XLOOKUP($N74,ProductCode,DefaultIncentive,0,0)) * $I74,0)","v":0},"-Product Cut Sheet. As-built or mechanical schedule that indicates furnace is the primary heat source.",null,"Verify installation of the equipment, photograph any accessible label plates / stickers that list the make and model #, capacity & efficiency. Verify unit has ECM supply fan. Verify unit is the primary heat source for the space.",{"$f":"IF($I74<>\"\",$I74,\"\")","v":0}]
[null,null,{"$f":"\"- If multiple furnaces, use separate line for each\"","v":"- If multiple furnaces, use separate line for each"},"Must be primary heat source for the space and must have an ECM supply fan","(Except Multifamily)",null,null,8.25,0,{"$f":"IF(ISNA(V75),0,V75)","v":0},null,null,270,{"$f":"IFERROR(\n_xlfn.IFS(\nAND(NOT(SelectedGas=\"None\"),SelectedHeat=\"Gas\"),\"GASFURNCONN\"),\"DNQ\")","v":"DNQ"},{"$f":"$I75","v":0},{"$f":"IFERROR(\n_xlfn.XLOOKUP($N75,ProductCode,DefaultKwh,0,0),0)","v":0},{"$f":"IFERROR(\n_xlfn.XLOOKUP($N75,ProductCode,DefaultTherms,0,0),0)","v":0},{"$f":"IFERROR($I75*$P75,0)","v":0},{"$f":"IFERROR($I75*$Q75,0)","v":0},{"$f":"IFERROR((\n(_xlfn.XLOOKUP($N75,ProductCode,AllocationElectric,0,0))*$V75)/100,0)","v":0},{"$f":"IFERROR((\n(_xlfn.XLOOKUP($N75,ProductCode,AllocationGas,0,0))*$V75)/100,0)","v":0},{"$f":"IFERROR(\n(_xlfn.XLOOKUP($N75,ProductCode,DefaultIncentive,0,0)) * $I75,0)","v":0},null,null,null,{"$f":"IF($I75<>\"\",$I75,\"\")","v":0}]
[null,null,null,"Capacity less than 225,000 Btu/h",null,null,"Gas only",8,0,{"$f":"IF(ISNA(V76),0,V76)","v":0},null,null,270,{"$f":"IFERROR(\n_xlfn.IFS(\nAND(NOT(SelectedGas=\"None\"),SelectedElectric=\"Other\", SelectedHeat=\"Gas\"),\"GASFURNCONNGO\",\nAND(_FV(NOT(SelectedGas=\"None\"),\"SelectedHeat\")=\"Gas\"),\"GASFURNCONN\"),\"DNQ\")","v":"DNQ"},0,{"$f":"IFERROR(\n_xlfn.XLOOKUP($N76,ProductCode,DefaultKwh,0,0),0)","v":0},{"$f":"IFERROR(\n_xlfn.XLOOKUP($N76,ProductCode,DefaultTherms,0,0),0)","v":0},0,0,{"$f":"IFERROR((\n(_xlfn.XLOOKUP($N76,ProductCode,AllocationElectric,0,0))*$V76)/100,0)","v":0},{"$f":"IFERROR((\n(_xlfn.XLOOKUP($N76,ProductCode,AllocationGas,0,0))*$V76)/100,0)","v":0},{"$f":"IFERROR(\n(_xlfn.XLOOKUP($N76,ProductCode,DefaultIncentive,0,0)) * $I76,0)","v":0},null,null,null,0]
[null,null,null,null,null,null,"Gas only",8,0,{"$f":"IF(ISNA(V77),0,V77)","v":0},null,null,270,{"$f":"IFERROR(\n_xlfn.IFS(\nAND(NOT(SelectedGas=\"None\"),SelectedElectric=\"Other\", SelectedHeat=\"Gas\"),\"GASFURNCONNGO\",\nAND(_FV(NOT(SelectedGas=\"None\"),\"SelectedHeat\")=\"Gas\"),\"GASFURNCONN\"),\"DNQ\")","v":"DNQ"},0,{"$f":"IFERROR(\n_xlfn.XLOOKUP($N77,ProductCode,DefaultKwh,0,0),0)","v":0},{"$f":"IFERROR(\n_xlfn.XLOOKUP($N77,ProductCode,DefaultTherms,0,0),0)","v":0},0,0,{"$f":"IFERROR((\n(_xlfn.XLOOKUP($N77,ProductCode,AllocationElectric,0,0))*$V77)/100,0)","v":0},{"$f":"IFERROR((\n(_xlfn.XLOOKUP($N77,ProductCode,AllocationGas,0,0))*$V77)/100,0)","v":0},{"$f":"IFERROR(\n(_xlfn.XLOOKUP($N77,ProductCode,DefaultIncentive,0,0)) * $I77,0)","v":0}]
[]
[null,null,null,null,null,null,null,null,null,null,null,null,null,null,null,null,null,null,null,null,null,null,null,null,"Verify installation of the equipment, photograph label plate/stickers that list the make and model #, capacity & efficiency, and tank volume. Verify unit is not used for building space heating."]
[null,null,"Condensing Tankless Water Heater","Must not provide building space heating","Commercial","kBtu/hr","Commercial",1.4,0,{"$f":"IF(ISNA(V80),0,V80)","v":0},null,null,72,{"$f":"IF(NOT(SelectedGas=\"None\"),\"CTWH200COMNONMF\",\"DNQ\")","v":"CTWH200COMNONMF"},{"$f":"$I80","v":0},{"$f":"IFERROR(\n_xlfn.XLOOKUP($N80,ProductCode,DefaultKwh,0,0),0)","v":0},{"$f":"IFERROR(\n_xlfn.XLOOKUP($N80,ProductCode,DefaultTherms,0,0),0)","v":0.28000000000000003},{"$f":"IFERROR($I80*$P80,0)","v":0},{"$f":"IFERROR($I80*$Q80,0)","v":0},{"$f":"IFERROR((\n(_xlfn.XLOOKUP($N80,ProductCode,AllocationElectric,0,0))*$V80)/100,0)","v":0},{"$f":"IFERROR((\n(_xlfn.XLOOKUP($N80,ProductCode,AllocationGas,0,0))*$V80)/100,0)","v":0},{"$f":"IFERROR(\n(_xlfn.XLOOKUP($N80,ProductCode,DefaultIncentive,0,0)) * $I80,0)","v":0},"-Product Cut Sheet. As-built or plumbing plans that indicate unit is not used for building space heating. AHRI certificate for the unit.",null,null,{"$f":"IF($I80<>\"\",$I80,\"\")","v":0}]
[null,null,{"$f":"\" - ≥200 kBtu/h\"","v":" - ≥200 kBtu/h"},"Integral tank volume <10 gal ",null,null,"Multifamily",1.4,0,{"$f":"IF(ISNA(V81),0,V81)","v":0},null,null,72,{"$f":"IF(NOT(SelectedGas=\"None\"),\"CTWH200COMMF\",\"DNQ\")","v":"CTWH200COMMF"},{"$f":"$I81","v":0},{"$f":"IFERROR(\n_xlfn.XLOOKUP($N81,ProductCode,DefaultKwh,0,0),0)","v":0},{"$f":"IFERROR(\n_xlfn.XLOOKUP($N81,ProductCode,DefaultTherms,0,0),0)","v":0.42},{"$f":"IFERROR($I81*$P81,0)","v":0},{"$f":"IFERROR($I81*$Q81,0)","v":0},{"$f":"IFERROR((\n(_xlfn.XLOOKUP($N81,ProductCode,AllocationElectric,0,0))*$V81)/100,0)","v":0},{"$f":"IFERROR((\n(_xlfn.XLOOKUP($N81,ProductCode,AllocationGas,0,0))*$V81)/100,0)","v":0},{"$f":"IFERROR(\n(_xlfn.XLOOKUP($N81,ProductCode,DefaultIncentive,0,0)) * $I81,0)","v":0},null,null,null,{"$f":"IF($I81<>\"\",$I81,\"\")","v":0}]
[null,null,null,"Minimum 94.0% thermal efficiency ",null,null,null,null,null,null,null,null,null,null,null,null,null,null,null,null,null,null,null,null,null,{"$f":"IF($I84<>\"\",$I84,\"\")","v":""}]
[null,null,null,"Installed equipment must be on the AHRI certified product list"]
[]
[null,null,null,null,null,null,null,null,null,null,null,null,null,null,null,null,null,null,null,null,null,null,"-Product Cut Sheet, confirm thermal eff or AFUE.\n-Mechanical and/OR plumbing as-built plans that indicate the water heater is  part of a central DHW system",null,"Verify installation of the equipment, photograph label plates/stickers that list the make model #, capacity & efficiency, and tank volume. For MF, confirm unit is part of the central DHW system.\n"]
[null,null,"Condensing Tank Water Heater","Tank volume ≥ 10gal","Any","kBtu/hr","Commercial",3.5,0,{"$f":"IF(ISNA(V86),0,V86)","v":0},null,null,21,{"$f":"IF(AND(SelectedDHW=\"Gas\",NOT(SelectedGas=\"None\")),\"DHWCONDNMF\",\"DNQ\")","v":"DNQ"},{"$f":"$I86","v":0},{"$f":"IFERROR(\n_xlfn.XLOOKUP($N86,ProductCode,DefaultKwh,0,0),0)","v":0},{"$f":"IFERROR(\n_xlfn.XLOOKUP($N86,ProductCode,DefaultTherms,0,0),0)","v":0},{"$f":"IFERROR($I86*$P86,0)","v":0},{"$f":"IFERROR($I86*$Q86,0)","v":0},{"$f":"IFERROR((\n(_xlfn.XLOOKUP($N86,ProductCode,AllocationElectric,0,0))*$V86)/100,0)","v":0},{"$f":"IFERROR((\n(_xlfn.XLOOKUP($N86,ProductCode,AllocationGas,0,0))*$V86)/100,0)","v":0},{"$f":"IFERROR(\n(_xlfn.XLOOKUP($N86,ProductCode,DefaultIncentive,0,0)) * $I86,0)","v":0},null,null,null,{"$f":"IF($I86<>\"\",$I86,\"\")","v":0}]
[null,null,null,"Capacity > 75,000 Btu/h",null,null,"Multifamily",3.5,0,{"$f":"IF(ISNA(V87),0,V87)","v":0},null,null,21,{"$f":"IF(AND(SelectedDHW=\"Gas\",NOT(SelectedGas=\"None\")),\"DHWCONDTANKMF\",\"DNQ\")","v":"DNQ"},{"$f":"$I87","v":0},{"$f":"IFERROR(\n_xlfn.XLOOKUP($N87,ProductCode,DefaultKwh,0,0),0)","v":0},{"$f":"IFERROR(\n_xlfn.XLOOKUP($N87,ProductCode,DefaultTherms,0,0),0)","v":0},{"$f":"IFERROR($I87*$P87,0)","v":0},{"$f":"IFERROR($I87*$Q87,0)","v":0},{"$f":"IFERROR((\n(_xlfn.XLOOKUP($N87,ProductCode,AllocationElectric,0,0))*$V87)/100,0)","v":0},{"$f":"IFERROR((\n(_xlfn.XLOOKUP($N87,ProductCode,AllocationGas,0,0))*$V87)/100,0)","v":0},{"$f":"IFERROR(\n(_xlfn.XLOOKUP($N87,ProductCode,DefaultIncentive,0,0)) * $I87,0)","v":0},null,null,null,{"$f":"IF($I87<>\"\",$I87,\"\")","v":0}]
[null,null,null,"Minimum 94% thermal efficiency rating",null,null,null,null,null,null,null,null,null,null,null,null,null,null,null,null,null,null,null,null,null,{"$f":"IF($I88<>\"\",$I88,\"\")","v":""}]
[null,null,null,"Use in multifamily is limited to shared central DHW systems",null,null,null,null,null,null,null,null,null,null,null,null,null,null,null,null,null,null,null,null,null,{"$f":"IF($I89<>\"\",$I89,\"\")","v":""}]
[]
[null,null,null,null,null,null,null,null,null,null,null,null,null,null,null,null,null,null,null,null,null,null,null,null,"Verify installation of the equipment, photograph label plates/stickers that list the model #, capacity & efficiency.\nNo External storage tanks. For MF, confirm unit is part of the central DHW system.",{"$f":"IF($I91<>\"\",$I91,\"\")","v":""}]
[null,null,"Condensing Tankless Water Heater","Must be installed in stacked multifamily structures with central water heating","Any","each","Commercial",140,0,{"$f":"IF(ISNA(V92),0,V92)","v":0},null,null,212,{"$f":"IF(AND(SelectedDHW=\"Gas\",NOT(SelectedGas=\"None\")),\"CTWH199ALLCOM\",\"DNQ\")","v":"DNQ"},{"$f":"$I92","v":0},{"$f":"IFERROR(\n_xlfn.XLOOKUP($N92,ProductCode,DefaultKwh,0,0),0)","v":0},{"$f":"IFERROR(\n_xlfn.XLOOKUP($N92,ProductCode,DefaultTherms,0,0),0)","v":0},{"$f":"IFERROR($I92*$P92,0)","v":0},{"$f":"IFERROR($I92*$Q92,0)","v":0},{"$f":"IFERROR((\n(_xlfn.XLOOKUP($N92,ProductCode,AllocationElectric,0,0))*$V92)/100,0)","v":0},{"$f":"IFERROR((\n(_xlfn.XLOOKUP($N92,ProductCode,AllocationGas,0,0))*$V92)/100,0)","v":0},{"$f":"IFERROR(\n(_xlfn.XLOOKUP($N92,ProductCode,DefaultIncentive,0,0)) * $I92,0)","v":0},"-Product Cut Sheet. AHRI certificate. Plumbing as-built plans that verify no external storage tanks. Verify unit is central DHW system.",null,null,{"$f":"IF($I92<>\"\",$I92,\"\")","v":0}]
[null,null,{"$f":"\"- <200 kBtu/h\"","v":"- <200 kBtu/h"},"Energy Factor (EF) ≥ 0.94",null,null,"Multifamily",140,0,{"$f":"IF(ISNA(V93),0,V93)","v":0},null,null,196,{"$f":"IF(AND(SelectedDHW=\"Gas\",NOT(SelectedGas=\"None\")),\"MFTANKLESS199\",\"DNQ\")","v":"DNQ"},{"$f":"$I93","v":0},{"$f":"IFERROR(\n_xlfn.XLOOKUP($N93,ProductCode,DefaultKwh,0,0),0)","v":0},{"$f":"IFERROR(\n_xlfn.XLOOKUP($N93,ProductCode,DefaultTherms,0,0),0)","v":0},{"$f":"IFERROR($I93*$P93,0)","v":0},{"$f":"IFERROR($I93*$Q93,0)","v":0},{"$f":"IFERROR((\n(_xlfn.XLOOKUP($N93,ProductCode,AllocationElectric,0,0))*$V93)/100,0)","v":0},{"$f":"IFERROR((\n(_xlfn.XLOOKUP($N93,ProductCode,AllocationGas,0,0))*$V93)/100,0)","v":0},{"$f":"IFERROR(\n(_xlfn.XLOOKUP($N93,ProductCode,DefaultIncentive,0,0)) * $I93,0)","v":0},null,null,null,{"$f":"IF($I93<>\"\",$I93,\"\")","v":0}]
[null,null,null,"No external storage tanks",null,null,null,null,null,null,null,null,null,null,null,null,null,null,null,null,null,null,null,null,null,{"$f":"IF($I94<>\"\",$I94,\"\")","v":""}]
[null,null,null,"Installed equipment must be on the AHRI certified product list"]
[null,null,null,null,null,null,null,null,null,null,null,null,null,null,null,null,null,null,null,null,null,null,null,null,null,{"$f":"IF($I96<>\"\",$I96,\"\")","v":""}]
[]
[null,null,"Ductless Heat Pump","Minimum efficiency of 18 SEER or SEER2 and 10 HSPF or 9.5 HSPF2","Multifamily, Dorm","ton","With baseboard heating",500,0,{"$f":"IF(ISNA(V98),0,V98)","v":0},null,null,192,{"$f":"IFERROR(\n_xlfn.IFS(\n$C$100=\"Dorm\",\"DHPDORMBASE\",\n$C$100=\"Lodging\",\"DHPLODBASE\",\n$C$100=\"Multifamily\",\"DHPMFBASE\"\n),\"DNQ\")","v":"DNQ"},{"$f":"$I98","v":0},{"$f":"IFERROR(\n_xlfn.XLOOKUP($N98,ProductCode,DefaultKwh,0,0),0)","v":0},{"$f":"IFERROR(\n_xlfn.XLOOKUP($N98,ProductCode,DefaultTherms,0,0),0)","v":0},{"$f":"IFERROR($I98*$P98,0)","v":0},{"$f":"IFERROR($I98*$Q98,0)","v":0},{"$f":"IFERROR((\n(_xlfn.XLOOKUP($N98,ProductCode,AllocationElectric,0,0))*$V98)/100,0)","v":0},{"$f":"IFERROR((\n(_xlfn.XLOOKUP($N98,ProductCode,AllocationGas,0,0))*$V98)/100,0)","v":0},{"$f":"IFERROR(\n(_xlfn.XLOOKUP($N98,ProductCode,DefaultIncentive,0,0)) * $I98,0)","v":0},"-Product Cut Sheet. AHRI certificate. Mechanical as-built plans to verify number of ductless indoor heads.",null,"Verify installation of equipment, photograph label plates/stickers that list the model #, capacity & efficiency. Verify unit is ductless with 2 heads or less per compressor.",{"$f":"IF($I98<>\"\",$I98,\"\")","v":0}]
[null,null,null,"Single compressor systems with up to two heads per dwelling unit","or Lodging",null,"Without baseboard heating",500,0,{"$f":"IF(ISNA(V99),0,V99)","v":0},null,null,192,{"$f":"IFERROR(\n_xlfn.IFS(\n$C$100=\"Dorm\",\"DHPDORMNOBASE\",\n$C$100=\"Lodging\",\"DHPLODNOBASE\",\n$C$100=\"Multifamily\",\"DHPMFNOBASE\"\n),\"DNQ\")","v":"DNQ"},{"$f":"$I99","v":0},{"$f":"IFERROR(\n_xlfn.XLOOKUP($N99,ProductCode,DefaultKwh,0,0),0)","v":0},{"$f":"IFERROR(\n_xlfn.XLOOKUP($N99,ProductCode,DefaultTherms,0,0),0)","v":0},{"$f":"IFERROR($I99*$P99,0)","v":0},{"$f":"IFERROR($I99*$Q99,0)","v":0},{"$f":"IFERROR((\n(_xlfn.XLOOKUP($N99,ProductCode,AllocationElectric,0,0))*$V99)/100,0)","v":0},{"$f":"IFERROR((\n(_xlfn.XLOOKUP($N99,ProductCode,AllocationGas,0,0))*$V99)/100,0)","v":0},{"$f":"IFERROR(\n(_xlfn.XLOOKUP($N99,ProductCode,DefaultIncentive,0,0)) * $I99,0)","v":0},null,null,null,{"$f":"IF($I99<>\"\",$I99,\"\")","v":0}]
[null,null,"<Select Building Type>"]
[null,null,null,null,null,null,null,null,null,null,null,null,null,null,null,null,null,null,null,null,null,null,"-Product Cut Sheet. Copy of the NEEA product list showing the equipment model number (highlight or box the model number).",null,"-Verify installation of the equipment, photograph label plates/stickers that list the make and model #, capacity & efficiency\n"]
[null,null,"Commercial Heat Pump Water Heater","Excludes central systems, contact the Program with eligibilty questions","Any","each",null,800,0,{"$f":"IF(ISNA(V102),0,V102)","v":0},null,null,254,{"$f":"IFERROR(\n_xlfn.IFS(\nAND(NOT(SelectedElectric=\"None\"),SelectedDHW=\"Electric\",$C$106=\"Tier 1\"),\"CHPWHT1\",\nAND(NOT(SelectedElectric=\"None\"),SelectedDHW=\"Electric\",$C$106=\"Tier 2\"),\"CHPWHT2\",\nAND(NOT(SelectedElectric=\"None\"),SelectedDHW=\"Electric\",$C$106=\"Tier 2, ducted\"),\"CHPWHT2D\",\nAND(NOT(SelectedElectric=\"None\"),SelectedDHW=\"Electric\",$C$106=\"Tier 3\"),\"CHPWHT3\",\nAND(NOT(SelectedElectric=\"None\"),SelectedDHW=\"Electric\",$C$106=\"Tier 3, ducted\"),\"CHPWHT3D\",\nAND(NOT(SelectedElectric=\"None\"),SelectedDHW=\"Electric\",$C$106=\"Tier 4 & up\"),\"CHPWHT4UP\",\nAND(NOT(SelectedElectric=\"None\"),SelectedDHW=\"Electric\",$C$106=\"Tier 4 & up, ducted\"),\"CHPWHT4UPD\"),\"DNQ\")","v":"DNQ"},{"$f":"$I102","v":0},{"$f":"IFERROR(\n_xlfn.XLOOKUP($N102,ProductCode,DefaultKwh,0,0),0)","v":0},{"$f":"IFERROR(\n_xlfn.XLOOKUP($N102,ProductCode,DefaultTherms,0,0),0)","v":0},{"$f":"IFERROR($I102*$P102,0)","v":0},{"$f":"IFERROR($I102*$Q102,0)","v":0},{"$f":"IFERROR((\n(_xlfn.XLOOKUP($N102,ProductCode,AllocationElectric,0,0))*$V102)/100,0)","v":0},{"$f":"IFERROR((\n(_xlfn.XLOOKUP($N102,ProductCode,AllocationGas,0,0))*$V102)/100,0)","v":0},{"$f":"IFERROR(\n(_xlfn.XLOOKUP($N102,ProductCode,DefaultIncentive,0,0)) * $I102,0)","v":0},null,null,null,{"$f":"IF($I102<>\"\",$I102,\"\")","v":0}]
[null,null,null,"Tier 3 minimum, per Advanced Water Heater Specifications v8.0","(Except Multifamily)",null,null,null,null,null,null,null,null,null,null,null,null,null,null,null,null,null,null,null,null,""]
[null,null,null,"Verify at link below:",null,null,null,null,null,null,null,null,null,null,null,null,null,null,null,null,null,null,null,null,null,""]
[null,null,null,"https://neea.org/resources/residential-unitary-hpwh-qualified-products-list",null,null,null,null,null,null,null,null,null,null,null,null,null,null,null,null,null,null,null,null,null,""]
[null,null,"<Select type>",null,null,null,null,null,null,null,null,null,null,null,null,null,null,null,null,null,null,null,null,null,null,""]
[null,null,null,null,null,null,null,null,null,null,null,null,null,null,null,null,null,null,null,null,null,null,null,null,null,""]
[null,null,"Commercial Infrared Radiant Heaters","Low intensity discharge, natural gas-fired, non-condensing, positive pressure system","Interior spaces","kBtu/hr","Modulating",2.25,0,{"$f":"IF(ISNA(V108),0,V108)","v":0},null,null,117,{"$f":"IFERROR(\n_xlfn.IFS(\nAND(NOT(SelectedGas=\"None\"),SelectedElectric=\"Other\"),\"RADHEATMODGO\",\nNOT(SelectedGas=\"None\"),\"RADHEATMOD\"),\"DNQ\")","v":"RADHEATMOD"},{"$f":"$I108","v":0},{"$f":"IFERROR(\n_xlfn.XLOOKUP($N108,ProductCode,DefaultKwh,0,0),0)","v":2.44},{"$f":"IFERROR(\n_xlfn.XLOOKUP($N108,ProductCode,DefaultTherms,0,0),0)","v":3.8},{"$f":"IFERROR($I108*$P108,0)","v":0},{"$f":"IFERROR($I108*$Q108,0)","v":0},{"$f":"IFERROR((\n(_xlfn.XLOOKUP($N108,ProductCode,AllocationElectric,0,0))*$V108)/100,0)","v":0},{"$f":"IFERROR((\n(_xlfn.XLOOKUP($N108,ProductCode,AllocationGas,0,0))*$V108)/100,0)","v":0},{"$f":"IFERROR(\n(_xlfn.XLOOKUP($N108,ProductCode,DefaultIncentive,0,0)) * $I108,0)","v":0},"-Product Cut Sheet, confirm modulating.\n-Site Plan to confirm in space(s) <20,000 sq ft",null,"Photo equipment and tag- frequently ceiling mounted. Will likey need to get invoice or HVAC quote to confirm model ",{"$f":"IF($I108<>\"\",$I108,\"\")","v":0}]
[null,null,null,null,"<20,000 sqft",null,"Non-modulating",1.25,0,{"$f":"IF(ISNA(V109),0,V109)","v":0},null,null,117,{"$f":"IFERROR(\n_xlfn.IFS(\nAND(NOT(SelectedGas=\"None\"),SelectedElectric=\"Other\"),\"RADHEATNONMODGO\",\nNOT(SelectedGas=\"None\"),\"RADHEATNONMOD\"),\"DNQ\")","v":"RADHEATNONMOD"},{"$f":"$I109","v":0},{"$f":"IFERROR(\n_xlfn.XLOOKUP($N109,ProductCode,DefaultKwh,0,0),0)","v":2.5},{"$f":"IFERROR(\n_xlfn.XLOOKUP($N109,ProductCode,DefaultTherms,0,0),0)","v":2.93},{"$f":"IFERROR($I109*$P109,0)","v":0},{"$f":"IFERROR($I109*$Q109,0)","v":0},{"$f":"IFERROR((\n(_xlfn.XLOOKUP($N109,ProductCode,AllocationElectric,0,0))*$V109)/100,0)","v":0},{"$f":"IFERROR((\n(_xlfn.XLOOKUP($N109,ProductCode,AllocationGas,0,0))*$V109)/100,0)","v":0},{"$f":"IFERROR(\n(_xlfn.XLOOKUP($N109,ProductCode,DefaultIncentive,0,0)) * $I109,0)","v":0},null,null,null,{"$f":"IF($I109<>\"\",$I109,\"\")","v":0}]
[null,null,null,null,null,null,null,null,null,null,null,null,null,null,null,null,null,null,null,null,null,null,null,null,null,{"$f":"IF($I111<>\"\",$I111,\"\")","v":""}]
[]
[null,null,"Commercial Clothes Washer w/ Dryer","ENERGY STAR®","Any","each","Full service* site, electric dryer fuel",400,0,{"$f":"IF(ISNA(V112),0,V112)","v":0},null,null,89,{"$f":"IFERROR(\n_xlfn.IFS(\nAND($C$116=\"Electric Dryer\",$D$1=\"Full Territory\", SelectedDHW=\"Electric\"),\"COMWASHEDRYEFT\",\nAND($C$116=\"Electric Dryer\",$D$1=\"Full Territory\", SelectedDHW=\"Gas\"),\"COMWASHGDRYEFT\"),\"DNQ\")","v":"DNQ"},{"$f":"$I112","v":0},{"$f":"IFERROR(\n_xlfn.XLOOKUP($N112,ProductCode,DefaultKwh,0,0),0)","v":0},{"$f":"IFERROR(\n_xlfn.XLOOKUP($N112,ProductCode,DefaultTherms,0,0),0)","v":0},{"$f":"IFERROR($I112*$P112,0)","v":0},{"$f":"IFERROR($I112*$Q112,0)","v":0},{"$f":"IFERROR((\n(_xlfn.XLOOKUP($N112,ProductCode,AllocationElectric,0,0))*$V112)/100,0)","v":0},{"$f":"IFERROR((\n(_xlfn.XLOOKUP($N112,ProductCode,AllocationGas,0,0))*$V112)/100,0)","v":0},{"$f":"IFERROR(\n(_xlfn.XLOOKUP($N112,ProductCode,DefaultIncentive,0,0)) * $I112,0)","v":0},"-Product Cut Sheet, verify Energy Star",null,"Verify installation of the equipment, photograph label plates/stickers that list the model #, verify unit is front loading.",{"$f":"IF($I112<>\"\",$I112,\"\")","v":0}]
[null,null,null,"Front-loading with hot water provided by a participating utility","(Except Multifamily)",null,"Full service* site, gas dryer fuel",350,0,{"$f":"IF(ISNA(V113),0,V113)","v":0},null,null,89,{"$f":"IFERROR(\n_xlfn.IFS(\nAND($C$116=\"Gas Dryer\",$D$1=\"Full Territory\", SelectedDHW=\"Electric\"),\"COMWASHEDRYGFT\",\nAND($C$116=\"Gas Dryer\",$D$1=\"Full Territory\", SelectedDHW=\"Gas\"),\"COMWASHGDRYGFT\"\n),\"DNQ\")","v":"DNQ"},{"$f":"$I113","v":0},{"$f":"IFERROR(\n_xlfn.XLOOKUP($N113,ProductCode,DefaultKwh,0,0),0)","v":0},{"$f":"IFERROR(\n_xlfn.XLOOKUP($N113,ProductCode,DefaultTherms,0,0),0)","v":0},{"$f":"IFERROR($I113*$P113,0)","v":0},{"$f":"IFERROR($I113*$Q113,0)","v":0},{"$f":"IFERROR((\n(_xlfn.XLOOKUP($N113,ProductCode,AllocationElectric,0,0))*$V113)/100,0)","v":0},{"$f":"IFERROR((\n(_xlfn.XLOOKUP($N113,ProductCode,AllocationGas,0,0))*$V113)/100,0)","v":0},{"$f":"IFERROR(\n(_xlfn.XLOOKUP($N113,ProductCode,DefaultIncentive,0,0)) * $I113,0)","v":0},null,null,null,{"$f":"IF($I114<>\"\",$I114,\"\")","v":0}]
[null,null,null,"Electric only includes sites using propane or other fuels for water heat or dryer fuel",null,null,"Electric only",150,0,{"$f":"IF(ISNA(V114),0,V114)","v":0},null,null,89,{"$f":"IFERROR(\n_xlfn.IFS(\nAND($C$116=\"Electric Dryer\",$D$1=\"Electric Only\", SelectedDHW=\"Gas\"),\"COMWASHGDRYEET\",\nAND($C$116=\"Gas Dryer\",$D$1=\"Electric Only\", SelectedDHW=\"Electric\"),\"COMWASHEDRYGET\",\nAND($C$116=\"Electric Dryer\", SelectedDHW=\"Other\"),\"COMWASHEDRYGET\",\nAND($C$116=\"Gas Dryer\", SelectedDHW=\"Other\"),\"COMWASHEDRYGMFET\"),\"DNQ\")","v":"DNQ"},{"$f":"$I114","v":0},{"$f":"IFERROR(\n_xlfn.XLOOKUP($N114,ProductCode,DefaultKwh,0,0),0)","v":0},{"$f":"IFERROR(\n_xlfn.XLOOKUP($N114,ProductCode,DefaultTherms,0,0),0)","v":0},0,0,{"$f":"IFERROR((\n(_xlfn.XLOOKUP($N114,ProductCode,AllocationElectric,0,0))*$V114)/100,0)","v":0},{"$f":"IFERROR((\n(_xlfn.XLOOKUP($N114,ProductCode,AllocationGas,0,0))*$V114)/100,0)","v":0},{"$f":"IFERROR(\n(_xlfn.XLOOKUP($N114,ProductCode,DefaultIncentive,0,0)) * $I114,0)","v":0},null,null,null,{"$f":"IF($I115<>\"\",$I115,\"\")","v":0}]
[null,null,null,null,null,null,"Gas only",100,0,{"$f":"IF(ISNA(V115),0,V115)","v":0},null,null,89,{"$f":"IFERROR(\n_xlfn.IFS(\nAND($C$116=\"Electric Dryer\",$D$1=\"Gas Only\", SelectedDHW=\"Gas\"),\"COMWASHGDRYEGT\",\nAND($C$116=\"Gas Dryer\",$D$1=\"Gas Only\", SelectedDHW=\"Electric\"),\"COMWASHGDRYGGT\",\nAND($C$116=\"Gas Dryer\",$D$1=\"Gas Only\", SelectedDHW=\"Gas\"),\"COMWASHGDRYGGT\"\n),\"DNQ\")","v":"DNQ"},0,{"$f":"IFERROR(\n_xlfn.XLOOKUP($N115,ProductCode,DefaultKwh,0,0),0)","v":0},{"$f":"IFERROR(\n_xlfn.XLOOKUP($N115,ProductCode,DefaultTherms,0,0),0)","v":0},0,0,{"$f":"IFERROR((\n(_xlfn.XLOOKUP($N115,ProductCode,AllocationElectric,0,0))*$V115)/100,0)","v":0},{"$f":"IFERROR((\n(_xlfn.XLOOKUP($N115,ProductCode,AllocationGas,0,0))*$V115)/100,0)","v":0},{"$f":"IFERROR(\n(_xlfn.XLOOKUP($N115,ProductCode,DefaultIncentive,0,0)) * $I115,0)","v":0}]
[null,null,"<Select Dryer Type>"]
[null,null,null,null,null,null,null,null,null,null,null,null,null,null,null,null,null,null,null,null,null,null,"-Product Cut Sheet and AHRI certificate.\n-Site Plan to confirm in space(s) <10,000 sq ft",null,"Verify installation of the equipment, photograph label plates/stickers that list the model #, capacity & efficiency\nVerify the space served by the heat pump(s) is enclosed and not open to other conditioned spaces"]
[null,null,"Commercial Air-Source Ductless Heat Pump","Conditioned space served must have a combined floor area < 10,000 sq ft. ","Office, Retail, or","ton","Climate Zone:",300,0,{"$f":"IF(ISNA(V118),0,V118)","v":0},null,null,255,{"$f":"IFERROR(\n_xlfn.IFS(\nAND(OR(SelectedElectric=\"Pacific Power\",SelectedElectric=\"Portland General Electric\"),$G$119=\"CZ1 HZ1\"),\"HPREPHZ1\",\nAND(OR(SelectedElectric=\"Pacific Power\",SelectedElectric=\"Portland General Electric\"),$G$119=\"CZ2 HZ1\"),\"HPREPHZ1\",\nAND(OR(SelectedElectric=\"Pacific Power\",SelectedElectric=\"Portland General Electric\"),$G$119=\"CZ3 HZ1\"),\"HPREPHZ1\",\nOR(SelectedElectric=\"Pacific Power\",SelectedElectric=\"Portland General Electric\"),\"HPREPHZ2Z3\"),\"DNQ\")","v":"DNQ"},{"$f":"$I118","v":0},{"$f":"IFERROR(\n_xlfn.XLOOKUP($N118,ProductCode,DefaultKwh,0,0),0)","v":0},{"$f":"IFERROR(\n_xlfn.XLOOKUP($N118,ProductCode,DefaultTherms,0,0),0)","v":0},{"$f":"IFERROR($I118*$P118,0)","v":0},{"$f":"IFERROR($I118*$Q118,0)","v":0},{"$f":"IFERROR((\n(_xlfn.XLOOKUP($N118,ProductCode,AllocationElectric,0,0))*$V118)/100,0)","v":0},{"$f":"IFERROR((\n(_xlfn.XLOOKUP($N118,ProductCode,AllocationGas,0,0))*$V118)/100,0)","v":0},{"$f":"IFERROR(\n(_xlfn.XLOOKUP($N118,ProductCode,DefaultIncentive,0,0)) * $I118,0)","v":0},null,null,null,{"$f":"IF($I118<>\"\",$I118,\"\")","v":0}]
[null,null,null,"AHRI rated with SEER ≥ 20 and HSPF > 9.5","Restaurant",null,{"$f":"IFERROR(_xlfn.XLOOKUP($C$121,CZHZZipCode,CZHZCombined,\"Climate Zone\",0),\"Climate Zone\")","v":0},null,null,null,null,null,null,null,null,null,null,null,null,null,null,null,null,null,null,{"$f":"IF($I120<>\"\",$I120,\"\")","v":""}]
[null,null,"Enter Zip Code Below:",null,null,null,null,null,null,null,null,null,null,null,null,null,null,null,null,null,null,null,null,null,null,{"$f":"IF($I121<>\"\",$I121,\"\")","v":""}]
[]
[]
[]
[]
[null,null,"Ozone Laundry System","Must be new and installed on either new or existing programmable commercial washing machine(s).","Any","per system","<75 lbs capacity",5000,0,{"$f":"IF(ISNA(V125),0,V125)","v":0},null,null,80,{"$f":"IFERROR(\n_xlfn.IFS(\nSelectedDHW=\"Electric\",\"OZONSYS75EWH\",\nAND($D$1=\"Full Territory\",SelectedDHW=\"Gas\"),\"OZONSYS75GWHFULL\",\nAND($D$1=\"Gas Only\",SelectedDHW=\"Gas\"),\"OZONSYS75GWHGOT\"),\"DNQ\")","v":"DNQ"},{"$f":"$I125","v":0},{"$f":"IFERROR(\n_xlfn.XLOOKUP($N125,ProductCode,DefaultKwh,0,0),0)","v":0},{"$f":"IFERROR(\n_xlfn.XLOOKUP($N125,ProductCode,DefaultTherms,0,0),0)","v":0},{"$f":"IFERROR($I125*$P125,0)","v":0},{"$f":"IFERROR($I125*$Q125,0)","v":0},{"$f":"IFERROR((\n(_xlfn.XLOOKUP($N125,ProductCode,AllocationElectric,0,0))*$V125)/100,0)","v":0},{"$f":"IFERROR((\n(_xlfn.XLOOKUP($N125,ProductCode,AllocationGas,0,0))*$V125)/100,0)","v":0},{"$f":"IFERROR(\n(_xlfn.XLOOKUP($N125,ProductCode,DefaultIncentive,0,0)) * $I125,0)","v":0},"-Invoice or SV Report; \n-Product Cut Sheet, verify efficiency\n-Mechanical and/or plumbing as-built drawings that indicate how hot water for clothes washing is provided. Documentation of the ozone transfer method.",null,"-Verify installation of the equipment, photograph label plates/stickers that list the model #. Verify that all washers at the facility are programmed and connected to work with the ozone laundry system (partial conversions are ineligible). Verify that ozone is transferred into the water with the venturi injection or bubble diffusion process.",{"$f":"IF($I125<>\"\",$I125,\"\")","v":0}]
[null,null,null,"Each ozone generator may serve one or more washers.","(Except Multifamily)",null,"75-125 lbs capacity",7500,0,{"$f":"IF(ISNA(V126),0,V126)","v":0},null,null,80,{"$f":"IFERROR(\n_xlfn.IFS(\nSelectedDHW=\"Electric\",\"OZONSYS75125EWH\",\nAND($D$1=\"Full Territory\",SelectedDHW=\"Gas\"),\"OZONSYS75125GWHFULL\",\nAND($D$1=\"Gas Only\",SelectedDHW=\"Gas\"),\"OZONSYS75125GWHGOT\"),\"DNQ\")","v":"DNQ"},{"$f":"$I126","v":0},0,0,{"$f":"IFERROR($I126*$P126,0)","v":0},{"$f":"IFERROR($I126*$Q126,0)","v":0},0,0,0,null,null,null,{"$f":"IF($I126<>\"\",$I126,\"\")","v":0}]
[null,null,null,"All existing/new washers at a facility must be reprogrammed and connected to work with the new ozone laundry system. Partial conversions are not eligible.",null,null,"126-400 lbs capacity",15000,0,0,null,null,80,{"$f":"IFERROR(\n_xlfn.IFS(\nSelectedDHW=\"Electric\",\"OZONSYS126400EWH\",\nAND($D$1=\"Full Territory\",SelectedDHW=\"Gas\"),\"OZONSYS126400GWHFULL\",\nAND($D$1=\"Gas Only\",SelectedDHW=\"Gas\"),\"OZONSYS126400GWHGOT\"),\"DNQ\")","v":"DNQ"},0,0,0,0,0,0,0,0,null,null,null,{"$f":"IF($I127<>\"\",$I127,\"\")","v":0}]
[null,null,null,null,null,null,"401-600 lbs capacity",25000,0,0,null,null,80,{"$f":"IFERROR(\n_xlfn.IFS(\nSelectedDHW=\"Electric\",\"OZONSYS401600EWH\",\nAND($D$1=\"Full Territory\",SelectedDHW=\"Gas\"),\"OZONSYS401600GWHFULL\",\nAND($D$1=\"Gas Only\",SelectedDHW=\"Gas\"),\"OZONSYS401600GWHGOT\"),\"DNQ\")","v":"DNQ"},0,0,0,0,0,0,0,0,null,null,null,0]
[null,null,null,"Water heating for clothes washing must be provided by boilers, or gas or electric water heaters. Water heating must be provided by a participating utility.",null,null,">600 lbs capacity",30000,0,0,null,null,80,{"$f":"IFERROR(\n_xlfn.IFS(\nSelectedDHW=\"Electric\",\"OZONSYS600EWH\",\nAND($D$1=\"Full Territory\",SelectedDHW=\"Gas\"),\"OZONSYS600GWHFULL\",\nAND($D$1=\"Gas Only\",SelectedDHW=\"Gas\"),\"OZONSYS600GWHGOT\"),\"DNQ\")","v":"DNQ"},0,0,0,0,0,0,0,0,null,null,null,0]
[]
[null,null,null,"The ozone laundry system(s) must transfer ozone into the water with either the venturi injection or bubble diffusion process."]
[]
[]
[null,null,null,null,null,null,null,null,null,null,null,null,null,null,null,null,null,null,null,null,null,null,"-Product Cut Sheet for dryer capacity and product cut sheet for valves.",null,"Verify installation of equipment, photograph label plates/stickers that list the model # and capacity of the dryer. Photograph the two-stage gas valves."]
[null,null,"Two-stage Gas Valve on Clothes Dryers in On-Premises Laundry","Valves must be installed on commercial gas-fired dryers","Any","ton",null,700,0,{"$f":"IF(ISNA(V135),0,V135)","v":0},null,null,291,{"$f":"IF(SelectedDHW=\"Gas\",\"2STAGASGVALVEOPLDRY\",\"DNQ\")","v":"DNQ"},{"$f":"$I135","v":0},{"$f":"IFERROR(\n_xlfn.XLOOKUP($N135,ProductCode,DefaultKwh,0,0),0)","v":0},{"$f":"IFERROR(\n_xlfn.XLOOKUP($N135,ProductCode,DefaultTherms,0,0),0)","v":0},{"$f":"IFERROR($I135*$P135,0)","v":0},{"$f":"IFERROR($I135*$Q135,0)","v":0},{"$f":"IFERROR((\n(_xlfn.XLOOKUP($N135,ProductCode,AllocationElectric,0,0))*$V135)/100,0)","v":0},{"$f":"IFERROR((\n(_xlfn.XLOOKUP($N135,ProductCode,AllocationGas,0,0))*$V135)/100,0)","v":0},{"$f":"IFERROR(\n(_xlfn.XLOOKUP($N135,ProductCode,DefaultIncentive,0,0)) * $I135,0)","v":0},null,null,null,{"$f":"IF($I135<>\"\",$I135,\"\")","v":0}]
[null,null,null,"Dryer ≤200 pounds of dry clothes capacity or ≤65 cubic feet of dryer drum volume",null,null,null,null,null,null,null,null,null,null,null,null,null,null,null,null,null,null,null,null,null,{"$f":"IF($I137<>\"\",$I137,\"\")","v":""}]
[null,null,null,"Valves can be installed on new or existing gas-fired dryers"]
[null,null,null,null,null,null,null,null,null,null,null,null,null,null,null,null,null,null,null,null,null,null,null,null,null,""]
[null,null,null,null,null,null,null,null,null,null,null,null,null,null,null,null,null,null,null,null,null,null,null,null,"Verify installation of equipment, photograph label plates/stickers that list the model # and capacity.\nIf possible, have access panel opened to confirm mechanized dampers."]
[null,null,"Rooftop Unit Controls","Manufacturer-installed economizer on new packaged rooftop unit","Any","ton","Gas Heat",30,0,{"$f":"IF(ISNA(V140),0,V140)","v":0},null,null,195,{"$f":"IF(SelectedHeat=\"Gas\",\"RTUCTRLECOGH\",\"DNQ\")","v":"DNQ"},{"$f":"$I140","v":0},{"$f":"IFERROR(\n_xlfn.XLOOKUP($N140,ProductCode,DefaultKwh,0,0),0)","v":0},{"$f":"IFERROR(\n_xlfn.XLOOKUP($N140,ProductCode,DefaultTherms,0,0),0)","v":0},{"$f":"IFERROR($I140*$P140,0)","v":0},{"$f":"IFERROR($I140*$Q140,0)","v":0},{"$f":"IFERROR((\n(_xlfn.XLOOKUP($N140,ProductCode,AllocationElectric,0,0))*$V140)/100,0)","v":0},{"$f":"IFERROR((\n(_xlfn.XLOOKUP($N140,ProductCode,AllocationGas,0,0))*$V140)/100,0)","v":0},{"$f":"IFERROR(\n(_xlfn.XLOOKUP($N140,ProductCode,DefaultIncentive,0,0)) * $I140,0)","v":0},"-Product Cut Sheet or equipment submittal that verifies the presence of an economizer and the RTU cooling capacity.",null,null,{"$f":"IF($I140<>\"\",$I140,\"\")","v":0}]
[null,null,"Economizer","RTU cooling capacity <54,000 Btu/h",null,null,"Heat Pump Heat",30,0,{"$f":"IF(ISNA(V141),0,V141)","v":0},null,null,195,{"$f":"IF(SelectedHeat=\"Electric\",\"RTUCTRLECOHPH\",\"DNQ\")","v":"DNQ"},0,{"$f":"IFERROR(\n_xlfn.XLOOKUP($N141,ProductCode,DefaultKwh,0,0),0)","v":0},{"$f":"IFERROR(\n_xlfn.XLOOKUP($N141,ProductCode,DefaultTherms,0,0),0)","v":0},0,0,{"$f":"IFERROR((\n(_xlfn.XLOOKUP($N141,ProductCode,AllocationElectric,0,0))*$V141)/100,0)","v":0},{"$f":"IFERROR((\n(_xlfn.XLOOKUP($N141,ProductCode,AllocationGas,0,0))*$V141)/100,0)","v":0},{"$f":"IFERROR(\n(_xlfn.XLOOKUP($N141,ProductCode,DefaultIncentive,0,0)) * $I141,0)","v":0},null,null,null,{"$f":"IF($I141<>\"\",$I141,\"\")","v":0}]
[]
[null,null,null,null,null,null,null,null,null,null,null,null,null,null,null,null,null,null,null,null,null,null,"-Product Cut Sheet or equipment submittal that verifies the presence of an economizer, CO2 sensor, and the RTU cooling capacity. Mechanical as-built plans to verify the spaces served by the RTU.",null,"Verify installation of the equipment, photograph label plates/stickers that list the model #.\nPhotograph the CO2 sensor if accessible."]
[null,null,"Rooftop Unit Controls","Manufacturer-installed economizer on new packaged rooftop unit","Any","ton","Gas Heat",29,0,{"$f":"IF(ISNA(V144),0,V144)","v":0},null,null,195,{"$f":"IFERROR(\n_xlfn.IFS(\nAND(G144=\"Gas Heat\",$D$1=\"Gas Only\",SelectedHeat=\"Gas\"),\"RTUCTRLDCVGHGOT\",\nAND(G144=\"Gas Heat\",$D$1=\"Full Territory\",SelectedHeat=\"Gas\"),\"RTUCTRLDCVGH\"\n),\"DNQ\")","v":"DNQ"},{"$f":"$I144","v":0},{"$f":"IFERROR(\n_xlfn.XLOOKUP($N144,ProductCode,DefaultKwh,0,0),0)","v":0},{"$f":"IFERROR(\n_xlfn.XLOOKUP($N144,ProductCode,DefaultTherms,0,0),0)","v":0},{"$f":"IFERROR($I144*$P144,0)","v":0},{"$f":"IFERROR($I144*$Q144,0)","v":0},{"$f":"IFERROR((\n(_xlfn.XLOOKUP($N144,ProductCode,AllocationElectric,0,0))*$V144)/100,0)","v":0},{"$f":"IFERROR((\n(_xlfn.XLOOKUP($N144,ProductCode,AllocationGas,0,0))*$V144)/100,0)","v":0},{"$f":"IFERROR(\n(_xlfn.XLOOKUP($N144,ProductCode,DefaultIncentive,0,0)) * $I144,0)","v":0},null,null,null,{"$f":"IF($I144<>\"\",$I144,\"\")","v":0}]
[null,null,"Demand Control Ventilation (DCV)","RTU must also have an economizer",null,null,"Heat Pump Heat",29,0,{"$f":"IF(ISNA(V145),0,V145)","v":0},null,null,195,{"$f":"IF(AND(G145=\"Heat Pump Heat\",OR(SelectedElectric=\"Pacific Power\",SelectedElectric=\"Portland General Electric\")),\"RTUCTRLDCVHPH\",\"DNQ\")","v":"DNQ"},0,{"$f":"IFERROR(\n_xlfn.XLOOKUP($N145,ProductCode,DefaultKwh,0,0),0)","v":0},{"$f":"IFERROR(\n_xlfn.XLOOKUP($N145,ProductCode,DefaultTherms,0,0),0)","v":0},0,0,{"$f":"IFERROR((\n(_xlfn.XLOOKUP($N145,ProductCode,AllocationElectric,0,0))*$V145)/100,0)","v":0},{"$f":"IFERROR((\n(_xlfn.XLOOKUP($N145,ProductCode,AllocationGas,0,0))*$V145)/100,0)","v":0},{"$f":"IFERROR(\n(_xlfn.XLOOKUP($N145,ProductCode,DefaultIncentive,0,0)) * $I145,0)","v":0},null,null,null,{"$f":"IF($I145<>\"\",$I145,\"\")","v":0}]
[null,null,null,"RTU must not serve a space required by code to have DCV",null,null,null,null,null,null,null,null,null,null,null,null,null,null,null,null,null,null,null,null,null,""]
[null,null,null,"* contact program for eligible space types"]
[null,null,null,null,null,null,null,null,null,null,null,null,null,null,null,null,null,null,null,null,null,null,null,null,null,""]
[null,null,null,null,null,null,null,null,null,null,null,null,null,null,null,null,null,null,null,null,null,null,"-Product Cut Sheet or equipment submittal that verifies the presence of an economize, CO2 sensor, VFD, and the RTU cooling capacity. Mechanical as-built plans to verify the spaces served by the RTU.",null,"Verify installation of the equipment, photograph label plates/stickers that list the model #, capacity.\nPhotograph the VFD (project contact may need to open RTU access panel for VFD to be visually confirmed)."]
[null,null,"Rooftop Unit Controls","Manufacturer-installed economizer on new packaged rooftop unit","Any","ton","Heat Pump Heat",100,0,{"$f":"IF(ISNA(V150),0,V150)","v":0},null,null,195,{"$f":"IF(AND(G150=\"Heat Pump Heat\",OR(SelectedElectric=\"Pacific Power\",SelectedElectric=\"Portland General Electric\")),\"RTUCTRLVSFHPH\",\"DNQ\")","v":"DNQ"},{"$f":"$I150","v":0},{"$f":"IFERROR(\n_xlfn.XLOOKUP($N150,ProductCode,DefaultKwh,0,0),0)","v":0},{"$f":"IFERROR(\n_xlfn.XLOOKUP($N150,ProductCode,DefaultTherms,0,0),0)","v":0},{"$f":"IFERROR($I150*$P150,0)","v":0},{"$f":"IFERROR($I150*$Q150,0)","v":0},{"$f":"IFERROR((\n(_xlfn.XLOOKUP($N150,ProductCode,AllocationElectric,0,0))*$V150)/100,0)","v":0},{"$f":"IFERROR((\n(_xlfn.XLOOKUP($N150,ProductCode,AllocationGas,0,0))*$V150)/100,0)","v":0},{"$f":"IFERROR(\n(_xlfn.XLOOKUP($N150,ProductCode,DefaultIncentive,0,0)) * $I150,0)","v":0},null,null,null,{"$f":"IF($I150<>\"\",$I150,\"\")","v":0}]
[null,null,"Supply Fan Variable Frequency Drive (VFD)","RTU must also have an economizer and DCV",null,null,null,null,null,null,null,null,null,null,null,null,null,null,null,null,null,null,null,null,null,""]
[null,null,null,"RTU cooling capacity <65,000 Btu/h"]
[null,null,null,null,null,null,null,null,null,null,null,null,null,null,null,null,null,null,null,null,null,null,null,null,null,""]
[]
[null,null,"Server Closet Mini-Split A/C or Heat Pump","Cooling efficiency greater than SEER 18 or SEER2 18","Any","ton cooling","Mini-Split A/C",250,0,{"$f":"IF(ISNA(V155),0,V155)","v":0},null,null,3,{"$f":"IF(OR(SelectedElectric=\"Pacific Power\",SelectedElectric=\"Portland General Electric\"),\"MINISPLITAC\",\"DNQ\")","v":"DNQ"},{"$f":"$I155","v":0},{"$f":"IFERROR(\n_xlfn.XLOOKUP($N155,ProductCode,DefaultKwh,0,0),0)","v":0},{"$f":"IFERROR(\n_xlfn.XLOOKUP($N155,ProductCode,DefaultTherms,0,0),0)","v":0},{"$f":"IFERROR($I155*$P155,0)","v":0},{"$f":"IFERROR($I155*$Q155,0)","v":0},{"$f":"IFERROR((\n(_xlfn.XLOOKUP($N155,ProductCode,AllocationElectric,0,0))*$V155)/100,0)","v":0},{"$f":"IFERROR((\n(_xlfn.XLOOKUP($N155,ProductCode,AllocationGas,0,0))*$V155)/100,0)","v":0},{"$f":"IFERROR(\n(_xlfn.XLOOKUP($N155,ProductCode,DefaultIncentive,0,0)) * $I155,0)","v":0},"-Product Cut Sheet and AHRI certificate. Mechanical as-built plans that show the location and quantity of the units.",null,"Verify installation of the indoor and outdoor units, photograph label plates/stickers that list the model #, capacity & efficiency.\nVerify maximum of two units per space installed.",{"$f":"IF($I155<>\"\",$I155,\"\")","v":0}]
[null,null,null,"Cooling capacity no greater than 4.5 tons per unit","(Excluding Multifamily","capacity","Mini-Split Heat Pump",250,0,{"$f":"IF(ISNA(V156),0,V156)","v":0},null,null,3,{"$f":"IF(OR(SelectedElectric=\"Pacific Power\",SelectedElectric=\"Portland General Electric\"),\"MINISPLITHP\",\"DNQ\")","v":"DNQ"},{"$f":"$I156","v":0},{"$f":"IFERROR(\n_xlfn.XLOOKUP($N156,ProductCode,DefaultKwh,0,0),0)","v":0},{"$f":"IFERROR(\n_xlfn.XLOOKUP($N156,ProductCode,DefaultTherms,0,0),0)","v":0},{"$f":"IFERROR($I156*$P156,0)","v":0},{"$f":"IFERROR($I156*$Q156,0)","v":0},{"$f":"IFERROR((\n(_xlfn.XLOOKUP($N156,ProductCode,AllocationElectric,0,0))*$V156)/100,0)","v":0},{"$f":"IFERROR((\n(_xlfn.XLOOKUP($N156,ProductCode,AllocationGas,0,0))*$V156)/100,0)","v":0},{"$f":"IFERROR(\n(_xlfn.XLOOKUP($N156,ProductCode,DefaultIncentive,0,0)) * $I156,0)","v":0},null,null,null,{"$f":"IF($I156<>\"\",$I156,\"\")","v":0}]
[null,null,null,"Must serve a space exclusively for servers, communications, or data equipment","Tenant Spaces)",null,null,null,null,null,null,null,null,null,null,null,null,null,null,null,null,null,null,null,null,{"$f":"IF($I158<>\"\",$I158,\"\")","v":""}]
[null,null,null,"Maximum of 2 units per space"]
[]
[]
[null,null,"VFD Control on Parking Garage Fans","Installed in totally enclosed parking garage","Any","per cfm","<30,000 sq ft and unconditioned space",0.4,0,{"$f":"IF(ISNA(V161),0,V161)","v":0},null,null,271,{"$f":"IF(AND(SelectedCodeYear=\"2021 Code Year\",OR(SelectedElectric=\"Pacific Power\",SelectedElectric=\"Portland General Electric\")),\"VFDGARNMFSM\",\"DNQ\")","v":"DNQ"},{"$f":"$I161","v":0},{"$f":"IFERROR(\n_xlfn.XLOOKUP($N161,ProductCode,DefaultKwh,0,0),0)","v":0},{"$f":"IFERROR(\n_xlfn.XLOOKUP($N161,ProductCode,DefaultTherms,0,0),0)","v":0},{"$f":"IFERROR($I161*$P161,0)","v":0},{"$f":"IFERROR($I161*$Q161,0)","v":0},{"$f":"IFERROR((\n(_xlfn.XLOOKUP($N161,ProductCode,AllocationElectric,0,0))*$V161)/100,0)","v":0},{"$f":"IFERROR((\n(_xlfn.XLOOKUP($N161,ProductCode,AllocationGas,0,0))*$V161)/100,0)","v":0},{"$f":"IFERROR(\n(_xlfn.XLOOKUP($N161,ProductCode,DefaultIncentive,0,0)) * $I161,0)","v":0},"-Product Cut Sheet. Site plans that indicate parking garage is totally enclosed.",null,"Verify installation of the equipment, photograph any label plates/stickers that list the model #. Verify that CO and NO2 sensors are active. Verify operatings hours ≥140 per week.",{"$f":"IF($I161<>\"\",$I161,\"\")","v":0}]
[null,null,{"$f":"\"- 2021 Code Year\"","v":"- 2021 Code Year"},"Variable speed control on fan(s)","(Except Multifamily)",null,"≥30,000 sq ft or conditioned space",0.1,0,{"$f":"IF(ISNA(V162),0,V162)","v":0},null,null,271,{"$f":"IF(AND(SelectedCodeYear=\"2021 Code Year\",OR(SelectedElectric=\"Pacific Power\",SelectedElectric=\"Portland General Electric\")),\"VFDGARNMFLG\",\"DNQ\")","v":"DNQ"},{"$f":"$I162","v":0},{"$f":"IFERROR(\n_xlfn.XLOOKUP($N162,ProductCode,DefaultKwh,0,0),0)","v":0},{"$f":"IFERROR(\n_xlfn.XLOOKUP($N162,ProductCode,DefaultTherms,0,0),0)","v":0},{"$f":"IFERROR($I162*$P162,0)","v":0},{"$f":"IFERROR($I162*$Q162,0)","v":0},{"$f":"IFERROR((\n(_xlfn.XLOOKUP($N162,ProductCode,AllocationElectric,0,0))*$V162)/100,0)","v":0},{"$f":"IFERROR((\n(_xlfn.XLOOKUP($N162,ProductCode,AllocationGas,0,0))*$V162)/100,0)","v":0},{"$f":"IFERROR(\n(_xlfn.XLOOKUP($N162,ProductCode,DefaultIncentive,0,0)) * $I162,0)","v":0},null,null,null,{"$f":"IF($I162<>\"\",$I162,\"\")","v":0}]
[null,null,null,"Contamination-sensing device (CO and NO2) employed",null,null,null,null,null,null,null,null,null,null,null,null,null,null,null,null,null,null,null,null,null,{"$f":"IF($I164<>\"\",$I164,\"\")","v":""}]
[null,null,null,"Operating Hours ≥140 per week",null,null,null,null,null,null,null,null,null,null,null,null,null,null,null,null,null,null,null,null,null,""]
[]
[]
[null,null,"Variable Refrigerant Flow (VRF) ","Standard: Minimum fan efficiency 40% or minimum fan efficiency or index target 0.82",null,null,null,null,null,null,null,null,null,null,null,null,null,null,null,null,null,null,null,null,null,{"$f":"IF($I168<>\"\",$I168,\"\")","v":""}]
[null,null,"Multi-Split Heat Pump ","Standard: Energy recovery meeting a 50% enthalpy recovery efficiency minimum",null,null,null,null,null,null,null,null,null,null,null,null,null,null,null,null,null,null,"-Product Cut Sheet for DOAS and VRF indoor/outdoor units. \n-VRF systems must meet or exceed 2016 CEE Tier 1 - include a copy of the 2016 CEE Tier 1 table. \n-AHRI Certificate for VRF units.",null,"Verify and photograph the DOAS and VRF indoor and outdoor units. Photograph label plates/stickers that list the model #.\nVerify the majority of the indoor unit fans are set to cycle rather than running continuously during occupied hours"]
[null,null,null,"HE DOAS : Minimum fan efficiency 65% or minimum fan efficiency or index target 1.55","Office, School, ","sqft area","All Non-Ducted",1,0,{"$f":"H169*I169","v":0},null,null,216,{"$f":"IF(OR(SelectedElectric=\"Pacific Power\",SelectedElectric=\"Portland General Electric\"),\"VRFND\",\"DNQ\")","v":"DNQ"},{"$f":"$I169","v":0},{"$f":"IFERROR(\n_xlfn.XLOOKUP($N169,ProductCode,DefaultKwh,0,0),0)","v":0},{"$f":"IFERROR(\n_xlfn.XLOOKUP($N169,ProductCode,DefaultTherms,0,0),0)","v":0},{"$f":"IFERROR($I169*$P169,0)","v":0},{"$f":"IFERROR($I169*$Q169,0)","v":0},{"$f":"IFERROR((\n(_xlfn.XLOOKUP($N169,ProductCode,AllocationElectric,0,0))*$V169)/100,0)","v":0},{"$f":"IFERROR((\n(_xlfn.XLOOKUP($N169,ProductCode,AllocationGas,0,0))*$V169)/100,0)","v":0},{"$f":"IFERROR(\n(_xlfn.XLOOKUP($N169,ProductCode,DefaultIncentive,0,0)) * $I169,0)","v":0},null,null,null,{"$f":"IF($I169<>\"\",$I169,\"\")","v":0}]
[null,null,null,"HE DOAS: Energy recovery meeting a 75% enthalpy recovery efficiency minimum","Multifamily, and Retail ","(served by VRF)","All Non-Ducted w/ HE DOAS",1,0,0,null,null,216,{"$f":"IF(OR(SelectedElectric=\"Pacific Power\",SelectedElectric=\"Portland General Electric\"),\"VRFNDHEDOAS\",\"DNQ\")","v":"DNQ"},{"$f":"$I170","v":0},{"$f":"IFERROR(\n_xlfn.XLOOKUP($N170,ProductCode,DefaultKwh,0,0),0)","v":0},{"$f":"IFERROR(\n_xlfn.XLOOKUP($N170,ProductCode,DefaultTherms,0,0),0)","v":0},{"$f":"IFERROR($I170*$P170,0)","v":0},{"$f":"IFERROR($I170*$Q170,0)","v":0},{"$f":"IFERROR((\n(_xlfn.XLOOKUP($N170,ProductCode,AllocationElectric,0,0))*$V170)/100,0)","v":0},{"$f":"IFERROR((\n(_xlfn.XLOOKUP($N170,ProductCode,AllocationGas,0,0))*$V170)/100,0)","v":0},{"$f":"IFERROR(\n(_xlfn.XLOOKUP($N170,ProductCode,DefaultIncentive,0,0)) * $I170,0)","v":0},null,null,null,{"$f":"IF($I170<>\"\",$I170,\"\")","v":0}]
[null,null,null,"Each condenser unit must have a rated cooling capacity > 5 tons with variable speed compressor operation and must serve multiple indoor evaporator units"]
[]
[null,null,null,"DOAS air shall be supplied at a neutral space temperature"]
[null,null,null,"The majority of the indoor unit fans must be set to cycle rather than running continuously during occupied hours"]
[]
[null,null,null,"Proposed VRF systems must meet or exceed 2016 CEE Tier 1"]
[null,null,null,"https://www.energytrust.org/wp-content/uploads/2018/07/Appendix_A_2016-18_CEE_ComACHP_UnitarySpec.pdf"]
[]
[]
[]
[null,null,"Hydronic Heating Circulators with Speed Controls","Variable speed ECMs only","Any","kBtu/hr",">1/2 - ≤3/4 horsepower (>550 - ≤750 Max watts)",300,0,{"$f":"IF(ISNA(V181),0,V181)","v":0},null,null,247,{"$f":"IFERROR(\n_xlfn.IFS(\n(OR(SelectedElectric=\"Pacific Power\",SelectedElectric=\"Portland General Electric\")),\"HHCECMVS050075HP\"),\"DNQ\")","v":"DNQ"},{"$f":"$I181","v":0},{"$f":"IFERROR(\n_xlfn.XLOOKUP($N181,ProductCode,DefaultKwh,0,0),0)","v":0},{"$f":"IFERROR(\n_xlfn.XLOOKUP($N181,ProductCode,DefaultTherms,0,0),0)","v":0},{"$f":"IFERROR($I181*$P181,0)","v":0},{"$f":"IFERROR($I181*$Q181,0)","v":0},{"$f":"IFERROR((\n(_xlfn.XLOOKUP($N181,ProductCode,AllocationElectric,0,0))*$V181)/100,0)","v":0},{"$f":"IFERROR((\n(_xlfn.XLOOKUP($N181,ProductCode,AllocationGas,0,0))*$V181)/100,0)","v":0},{"$f":"IFERROR(\n(_xlfn.XLOOKUP($N181,ProductCode,DefaultIncentive,0,0)) * $I181,0)","v":0},"-Product Cut Sheet\n-Mechanical and/or plumbing as-built drawings to verify the ECMs and in-line circulators with horizontal motors.\n-As-built plumbing plans.",null,"Verify installation of the equipment, photograph any label plates/stickers that list the model #.",{"$f":"IF($I181<>\"\",$I181,\"\")","v":0}]
[null,null,null,"Limited to in-line circulators with horizontal motors",null,null,">3/4 - ≤1.25 horsepower (>750 - ≤1000 Max watts)",300,0,{"$f":"IF(ISNA(V182),0,V182)","v":0},null,null,247,{"$f":"IFERROR(\n_xlfn.IFS(\nOR(SelectedElectric=\"Pacific Power\",SelectedElectric=\"Portland General Electric\"),\"HHCECMVS075125HP\"),\"DNQ\")","v":"DNQ"},{"$f":"$I182","v":0},0,0,{"$f":"IFERROR($I182*$P182,0)","v":0},{"$f":"IFERROR($I182*$Q182,0)","v":0},0,0,0,null,null,null,{"$f":"IF($I182<>\"\",$I182,\"\")","v":0}]
[null,null,null,null,null,null,">1.25 - ≤1.75 horsepower (>1000 - ≤1300 Max watts)",300,0,0,null,null,247,{"$f":"IFERROR(\n_xlfn.IFS(\nOR(SelectedElectric=\"Pacific Power\",SelectedElectric=\"Portland General Electric\"),\"HHCECMVS125175HP\"),\"DNQ\")","v":"DNQ"},0,0,0,0,0,0,0,0,null,null,null,0]
[null,null,null,null,null,null,">1.75 - ≤2.5 horsepower (>1300 - ≤1750 Max watts)",300,0,0,null,null,247,{"$f":"IFERROR(\n_xlfn.IFS(\nOR(SelectedElectric=\"Pacific Power\",SelectedElectric=\"Portland General Electric\"),\"HHCECMVS175250HP\"),\"DNQ\")","v":"DNQ"},0,0,0,0,0,0,0,0,null,null,null,0]
[null,null,null,null,null,null,">2.5 - ≤3.5 horsepower (>1750 - ≤2350 Max watts)",750,0,0,null,null,247,{"$f":"IFERROR(\n_xlfn.IFS(\nOR(SelectedElectric=\"Pacific Power\",SelectedElectric=\"Portland General Electric\"),\"HHCECMVS250350HP\"),\"DNQ\")","v":"DNQ"},0,0,0,0,0,0,0,0,null,null,null,0]
[null,null,null,null,null,null,">3.5 - ≤4.5 horsepower (>2350 - ≤3100 Max watts)",750,0,0,null,null,247,{"$f":"IFERROR(\n_xlfn.IFS(\nOR(SelectedElectric=\"Pacific Power\",SelectedElectric=\"Portland General Electric\"),\"HHCECMVS350450HP\"),\"DNQ\")","v":"DNQ"},0,0,0,0,0,0,0,0,null,null,null,0]
[null,null,null,null,null,null,">4.5 - ≤5 horsepower (>3100 - ≤3700 Max watts)",750,0,0,null,null,247,{"$f":"IFERROR(\n_xlfn.IFS(\nOR(SelectedElectric=\"Pacific Power\",SelectedElectric=\"Portland General Electric\"),\"HHCECMVS450500HP\"),\"DNQ\")","v":"DNQ"},0,0,0,0,0,0,0,0,null,null,null,0]
[]
[]
[null,null,"Hydronic Heating Circulators Single Speed","Limited to in-line circulators with horizontal motors.","Any","kBtu/hr",">3/4 - ≤1.25 horsepower (>750 - ≤1000 Max watts)",200,0,{"$f":"IF(ISNA(V190),0,V190)","v":0},null,null,247,{"$f":"IFERROR(\n_xlfn.IFS(\nOR(SelectedElectric=\"Pacific Power\",SelectedElectric=\"Portland General Electric\"),\"HHCECMSS075125HP\"),\"DNQ\")","v":"DNQ"},{"$f":"$I190","v":0},{"$f":"IFERROR(\n_xlfn.XLOOKUP($N190,ProductCode,DefaultKwh,0,0),0)","v":0},{"$f":"IFERROR(\n_xlfn.XLOOKUP($N190,ProductCode,DefaultTherms,0,0),0)","v":0},{"$f":"IFERROR($I190*$P190,0)","v":0},{"$f":"IFERROR($I190*$Q190,0)","v":0},{"$f":"IFERROR((\n(_xlfn.XLOOKUP($N190,ProductCode,AllocationElectric,0,0))*$V190)/100,0)","v":0},{"$f":"IFERROR((\n(_xlfn.XLOOKUP($N190,ProductCode,AllocationGas,0,0))*$V190)/100,0)","v":0},{"$f":"IFERROR(\n(_xlfn.XLOOKUP($N190,ProductCode,DefaultIncentive,0,0)) * $I190,0)","v":0},"-Product Cut Sheet\n-Mechanical and/or plumbing as-built drawings to verify the in-line circulators with horizontal motors.\n-As-built plumbing plans.",null,"Verify installation of the equipment, photograph any label plates/stickers that list the model #.",{"$f":"IF($I190<>\"\",$I190,\"\")","v":0}]
[null,null,null,null,null,null,">1.25 - ≤1.75 horsepower (>1000 - ≤1300 Max watts)",200,0,{"$f":"IF(ISNA(V191),0,V191)","v":0},null,null,247,{"$f":"IFERROR(\n_xlfn.IFS(\nOR(SelectedElectric=\"Pacific Power\",SelectedElectric=\"Portland General Electric\"),\"HHCECMSS125175HP\"),\"DNQ\")","v":"DNQ"},{"$f":"$I191","v":0},0,0,{"$f":"IFERROR($I191*$P191,0)","v":0},{"$f":"IFERROR($I191*$Q191,0)","v":0},0,0,0,null,null,null,{"$f":"IF($I191<>\"\",$I191,\"\")","v":0}]
[null,null,null,null,null,null,">1.75 - ≤2.5 horsepower (>1300 - ≤1750 Max watts)",200,0,0,null,null,247,{"$f":"IFERROR(\n_xlfn.IFS(\nOR(SelectedElectric=\"Pacific Power\",SelectedElectric=\"Portland General Electric\"),\"HHCECMSS175250HP\"),\"DNQ\")","v":"DNQ"},0,0,0,0,0,0,0,0,null,null,null,0]
[null,null,null,null,null,null,">2.5 - ≤3.5 horsepower (>1750 - ≤2350 Max watts)",300,0,0,null,null,247,{"$f":"IFERROR(\n_xlfn.IFS(\nOR(SelectedElectric=\"Pacific Power\",SelectedElectric=\"Portland General Electric\"),\"HHCECMSS250350HP\"), \"DNQ\")","v":"DNQ"},0,0,0,0,0,0,0,0,null,null,null,0]
[null,null,null,null,null,null,">3.5 - ≤4.5 horsepower (>2350 - ≤3100 Max watts)",300,0,0,null,null,247,{"$f":"IFERROR(\n_xlfn.IFS(\nOR(SelectedElectric=\"Pacific Power\",SelectedElectric=\"Portland General Electric\"),\"HHCECMSS350450HP\"),\"DNQ\")","v":"DNQ"},0,0,0,0,0,0,0,0,null,null,null,0]
[null,null,null,null,null,null,">4.5 - ≤5 horsepower (>3100 - ≤3700 Max watts)",300,0,0,null,null,247,{"$f":"IFERROR(\n_xlfn.IFS(\nOR(SelectedElectric=\"Pacific Power\",SelectedElectric=\"Portland General Electric\"),\"HHCECMSS450500HP\"),\"DNQ\")","v":"DNQ"},0,0,0,0,0,0,0,0,null,null,null,0]
[]
[]
[null,null,"VFD on Cooling Tower Pump","VFD installed on a commercial pump with a nominal motor power up to 20 hp","Any","each","1.5 HP (1.26 to 1.75 HP)",250,0,{"$f":"IF(ISNA(V198),0,V198)","v":0},null,null,284,{"$f":"IFERROR(\n_xlfn.IFS(\nOR(SelectedElectric=\"Pacific Power\",SelectedElectric=\"Portland General Electric\"),\"CPUMPVSDCOOLT1P5HP\"),\"DNQ\")","v":"DNQ"},{"$f":"$I198","v":0},{"$f":"IFERROR(\n_xlfn.XLOOKUP($N198,ProductCode,DefaultKwh,0,0),0)","v":0},{"$f":"IFERROR(\n_xlfn.XLOOKUP($N198,ProductCode,DefaultTherms,0,0),0)","v":0},{"$f":"IFERROR($I198*$P198,0)","v":0},{"$f":"IFERROR($I198*$Q198,0)","v":0},{"$f":"IFERROR((\n(_xlfn.XLOOKUP($N198,ProductCode,AllocationElectric,0,0))*$V198)/100,0)","v":0},{"$f":"IFERROR((\n(_xlfn.XLOOKUP($N198,ProductCode,AllocationGas,0,0))*$V198)/100,0)","v":0},{"$f":"IFERROR(\n(_xlfn.XLOOKUP($N198,ProductCode,DefaultIncentive,0,0)) * $I198,0)","v":0},"-Product cut sheet for pump and VFD. As-built plumbing plans.",null,"Verify installation of the equipment, photograph any label plates/stickers that list the model #.",{"$f":"IF($I198<>\"\",$I198,\"\")","v":0}]
[null,null,null,"Irrigation pumps are ineligible",null,null,"2 HP (1.76 to 2.50 HP)",300,0,{"$f":"IF(ISNA(V199),0,V199)","v":0},null,null,284,{"$f":"IFERROR(\n_xlfn.IFS(\nOR(SelectedElectric=\"Pacific Power\",SelectedElectric=\"Portland General Electric\"),\"CPUMPVSDCOOLT2HP\"),\"DNQ\")","v":"DNQ"},{"$f":"$I199","v":0},0,0,{"$f":"IFERROR($I199*$P199,0)","v":0},{"$f":"IFERROR($I199*$Q199,0)","v":0},0,0,0,null,null,null,{"$f":"IF($I199<>\"\",$I199,\"\")","v":0}]
[null,null,null,null,null,null,"3 HP (2.51 to 3.50 HP)",350,0,0,null,null,284,{"$f":"IFERROR(\n_xlfn.IFS(\nOR(SelectedElectric=\"Pacific Power\",SelectedElectric=\"Portland General Electric\"),\"CPUMPVSDCOOLT3HP\"),\"DNQ\")","v":"DNQ"},0,0,0,0,0,0,0,0,null,null,null,0]
[null,null,null,null,null,null,"4 HP (3.51 to 4.50 HP)",450,0,0,null,null,284,{"$f":"IFERROR(\n_xlfn.IFS(\nOR(SelectedElectric=\"Pacific Power\",SelectedElectric=\"Portland General Electric\"),\"CPUMPVSDCOOLT4HP\"),\"DNQ\")","v":"DNQ"},0,0,0,0,0,0,0,0,null,null,null,0]
[null,null,null,null,null,null,"5 HP (4.51 to 6.00 HP)",500,0,0,null,null,284,{"$f":"IFERROR(\n_xlfn.IFS(\nOR(SelectedElectric=\"Pacific Power\",SelectedElectric=\"Portland General Electric\"),\"CPUMPVSDCOOLT5HP\"),\"DNQ\")","v":"DNQ"},0,0,0,0,0,0,0,0,null,null,null,0]
[null,null,null,null,null,null,"7.5 HP (6.01 to 8.00 HP)",600,0,0,null,null,284,{"$f":"IFERROR(\n_xlfn.IFS(\nOR(SelectedElectric=\"Pacific Power\",SelectedElectric=\"Portland General Electric\"),\"CPUMPVSDCOOLT7P5HP\"),\"DNQ\")","v":"DNQ"},0,0,0,0,0,0,0,0,null,null,null,0]
[null,null,null,null,null,null,"10 HP (8.01 to 12.50 HP)",700,0,0,null,null,284,{"$f":"IFERROR(\n_xlfn.IFS(\nOR(SelectedElectric=\"Pacific Power\",SelectedElectric=\"Portland General Electric\"),\"CPUMPVSDCOOLT10HP\"),\"DNQ\")","v":"DNQ"},0,0,0,0,0,0,0,0,null,null,null,0]
[null,null,null,null,null,null,"15 HP (12.51 to 17.50 HP)",850,0,{"$f":"IF(ISNA(V205),0,V205)","v":0},null,null,284,{"$f":"IFERROR(\n_xlfn.IFS(\nOR(SelectedElectric=\"Pacific Power\",SelectedElectric=\"Portland General Electric\"),\"CPUMPVSDCOOLT15HP\"),\"DNQ\")","v":"DNQ"},0,0,0,0,0,0,0,0,null,null,null,0]
[null,null,null,null,null,null,"20 HP (17.51 to 22.50 HP)",1000,0,0,null,null,284,{"$f":"IFERROR(\n_xlfn.IFS(\nOR(SelectedElectric=\"Pacific Power\",SelectedElectric=\"Portland General Electric\"),\"CPUMPVSDCOOLT20HP\"),\"DNQ\")","v":"DNQ"},0,0,0,0,0,0,0,0,null,null,null,0]
[]
[]
[null,null,"VFD on Pressure Boost Pump","VFD installed on a commercial pump with a nominal motor power up to 20 hp","Any","each","1.5 HP (1.26 to 1.75 HP)",250,0,{"$f":"IF(ISNA(V209),0,V209)","v":0},null,null,284,{"$f":"IFERROR(\n_xlfn.IFS(\nOR(SelectedElectric=\"Pacific Power\",SelectedElectric=\"Portland General Electric\"),\"CPUMPVSDPB1P5HP\"),\"DNQ\")","v":"DNQ"},{"$f":"$I209","v":0},{"$f":"IFERROR(\n_xlfn.XLOOKUP($N209,ProductCode,DefaultKwh,0,0),0)","v":0},{"$f":"IFERROR(\n_xlfn.XLOOKUP($N209,ProductCode,DefaultTherms,0,0),0)","v":0},{"$f":"IFERROR($I209*$P209,0)","v":0},{"$f":"IFERROR($I209*$Q209,0)","v":0},{"$f":"IFERROR((\n(_xlfn.XLOOKUP($N209,ProductCode,AllocationElectric,0,0))*$V209)/100,0)","v":0},{"$f":"IFERROR((\n(_xlfn.XLOOKUP($N209,ProductCode,AllocationGas,0,0))*$V209)/100,0)","v":0},{"$f":"IFERROR(\n(_xlfn.XLOOKUP($N209,ProductCode,DefaultIncentive,0,0)) * $I209,0)","v":0},"-Product cut sheet for pump and VFD. As-built plumbing plans.",null,"Verify installation of the equipment, photograph any label plates/stickers that list the model #.",{"$f":"IF($I209<>\"\",$I209,\"\")","v":0}]
[null,null,null,"Irrigation pumps are ineligible",null,null,"2 HP (1.76 to 2.50 HP)",250,0,{"$f":"IF(ISNA(V210),0,V210)","v":0},null,null,284,{"$f":"IFERROR(\n_xlfn.IFS(\nOR(SelectedElectric=\"Pacific Power\",SelectedElectric=\"Portland General Electric\"),\"CPUMPVSDPB1P5HP\"),\"DNQ\")","v":"DNQ"},{"$f":"$I210","v":0},0,0,{"$f":"IFERROR($I210*$P210,0)","v":0},{"$f":"IFERROR($I210*$Q210,0)","v":0},0,0,0,null,null,null,{"$f":"IF($I210<>\"\",$I210,\"\")","v":0}]
[null,null,null,null,null,null,"3 HP (2.51 to 3.50 HP)",350,0,0,null,null,284,{"$f":"IFERROR(\n_xlfn.IFS(\nOR(SelectedElectric=\"Pacific Power\",SelectedElectric=\"Portland General Electric\"),\"CPUMPVSDPB3HP\"),\"DNQ\")","v":"DNQ"},0,0,0,0,0,0,0,0,null,null,null,0]
[null,null,null,null,null,null,"4 HP (3.51 to 4.50 HP)",450,0,0,null,null,284,{"$f":"IFERROR(\n_xlfn.IFS(\nOR(SelectedElectric=\"Pacific Power\",SelectedElectric=\"Portland General Electric\"),\"CPUMPVSDPB4HP\"),\"DNQ\")","v":"DNQ"},0,0,0,0,0,0,0,0,null,null,null,0]
[null,null,null,null,null,null,"5 HP (4.51 to 6.00 HP)",500,0,0,null,null,284,{"$f":"IFERROR(\n_xlfn.IFS(\nOR(SelectedElectric=\"Pacific Power\",SelectedElectric=\"Portland General Electric\"),\"CPUMPVSDPB5HP\"),\"DNQ\")","v":"DNQ"},0,0,0,0,0,0,0,0,null,null,null,0]
[null,null,null,null,null,null,"7.5 HP (6.01 to 8.00 HP)",600,0,0,null,null,284,{"$f":"IFERROR(\n_xlfn.IFS(\nOR(SelectedElectric=\"Pacific Power\",SelectedElectric=\"Portland General Electric\"),\"CPUMPVSDPB7P5HP\"),\"DNQ\")","v":"DNQ"},0,0,0,0,0,0,0,0,null,null,null,0]
[null,null,null,null,null,null,"10 HP (8.01 to 12.50 HP)",700,0,0,null,null,284,{"$f":"IFERROR(\n_xlfn.IFS(\nOR(SelectedElectric=\"Pacific Power\",SelectedElectric=\"Portland General Electric\"),\"CPUMPVSDPB10HP\"),\"DNQ\")","v":"DNQ"},0,0,0,0,0,0,0,0,null,null,null,0]
[null,null,null,null,null,null,"15 HP (12.51 to 17.50 HP)",850,0,0,null,null,284,{"$f":"IFERROR(\n_xlfn.IFS(\nOR(SelectedElectric=\"Pacific Power\",SelectedElectric=\"Portland General Electric\"),\"CPUMPVSDPB15HP\"),\"DNQ\")","v":"DNQ"},0,0,0,0,0,0,0,0,null,null,null,0]
[]
[]
[null,null,"VFD on Heating Water Pump","VFD installed on a commercial pump with a nominal motor power up to 20 hp","Any","each","0.75 HP (0.50 to 0.75 HP)",150,0,{"$f":"IF(ISNA(V219),0,V219)","v":0},null,null,284,{"$f":"IFERROR(\n_xlfn.IFS(\nOR(SelectedElectric=\"Pacific Power\",SelectedElectric=\"Portland General Electric\"),\"CPUMPVSDHEAT0P75\"),\"DNQ\")","v":"DNQ"},{"$f":"$I219","v":0},{"$f":"IFERROR(\n_xlfn.XLOOKUP($N219,ProductCode,DefaultKwh,0,0),0)","v":0},{"$f":"IFERROR(\n_xlfn.XLOOKUP($N219,ProductCode,DefaultTherms,0,0),0)","v":0},{"$f":"IFERROR($I219*$P219,0)","v":0},{"$f":"IFERROR($I219*$Q219,0)","v":0},{"$f":"IFERROR((\n(_xlfn.XLOOKUP($N219,ProductCode,AllocationElectric,0,0))*$V219)/100,0)","v":0},{"$f":"IFERROR((\n(_xlfn.XLOOKUP($N219,ProductCode,AllocationGas,0,0))*$V219)/100,0)","v":0},{"$f":"IFERROR(\n(_xlfn.XLOOKUP($N219,ProductCode,DefaultIncentive,0,0)) * $I219,0)","v":0},"-Product cut sheet for pump and VFD. As-built plumbing plans.",null,"Verify installation of the equipment, photograph any label plates/stickers that list the model #.",{"$f":"IF($I219<>\"\",$I219,\"\")","v":0}]
[null,null,null,"Irrigation pumps are ineligible",null,null,"1 HP (0.76 to 1.25 HP)",200,0,{"$f":"IF(ISNA(V220),0,V220)","v":0},null,null,284,{"$f":"IFERROR(\n_xlfn.IFS(\nOR(SelectedElectric=\"Pacific Power\",SelectedElectric=\"Portland General Electric\"),\"CPUMPVSDHEAT1HP\"),\"DNQ\")","v":"DNQ"},{"$f":"$I220","v":0},0,0,{"$f":"IFERROR($I220*$P220,0)","v":0},{"$f":"IFERROR($I220*$Q220,0)","v":0},0,0,0,null,null,null,{"$f":"IF($I220<>\"\",$I220,\"\")","v":0}]
[null,null,null,null,null,null,"1.5 HP (1.26 to 1.75 HP)",250,0,0,null,null,284,{"$f":"IFERROR(\n_xlfn.IFS(\nOR(SelectedElectric=\"Pacific Power\",SelectedElectric=\"Portland General Electric\"),\"CPUMPVSDHEAT1P5HP\"),\"DNQ\")","v":"DNQ"},0,0,0,0,0,0,0,0,null,null,null,0]
[null,null,null,null,null,null,"2 HP (1.76 to 2.50 HP)",300,0,0,null,null,284,{"$f":"IFERROR(\n_xlfn.IFS(\nOR(SelectedElectric=\"Pacific Power\",SelectedElectric=\"Portland General Electric\"),\"CPUMPVSDHEAT2HP\"),\"DNQ\")","v":"DNQ"},0,0,0,0,0,0,0,0,null,null,null,0]
[null,null,null,null,null,null,"3 HP (2.51 to 3.50 HP)",350,0,0,null,null,284,{"$f":"IFERROR(\n_xlfn.IFS(\nOR(SelectedElectric=\"Pacific Power\",SelectedElectric=\"Portland General Electric\"),\"CPUMPVSDHEAT3HP\"),\"DNQ\")","v":"DNQ"},0,0,0,0,0,0,0,0,null,null,null,0]
[null,null,null,null,null,null,"4 HP (3.51 to 4.50 HP)",450,0,0,null,null,284,{"$f":"IFERROR(\n_xlfn.IFS(\nOR(SelectedElectric=\"Pacific Power\",SelectedElectric=\"Portland General Electric\"),\"CPUMPVSDHEAT4HP\"),\"DNQ\")","v":"DNQ"},0,0,0,0,0,0,0,0,null,null,null,0]
[null,null,null,null,null,null,"5 HP (4.51 to 6.00 HP)",500,0,0,null,null,284,{"$f":"IFERROR(\n_xlfn.IFS(\nOR(SelectedElectric=\"Pacific Power\",SelectedElectric=\"Portland General Electric\"),\"CPUMPVSDHEAT5HP\"),\"DNQ\")","v":"DNQ"},0,0,0,0,0,0,0,0,null,null,null,0]
[null,null,null,null,null,null,"7.5 HP (6.01 to 8.00 HP)",600,0,{"$f":"IF(ISNA(V226),0,V226)","v":0},null,null,284,{"$f":"IFERROR(\n_xlfn.IFS(\nOR(SelectedElectric=\"Pacific Power\",SelectedElectric=\"Portland General Electric\"),\"CPUMPVSDHEAT7P5HP\"),\"DNQ\")","v":"DNQ"},0,0,0,0,0,0,0,0,null,null,null,0]
[]
[]
[null,null,"VFD on Chilled Water Pump","VFD installed on a commercial pump with a nominal motor power up to 20 hp","Any","each","0.75 HP (0.50 to 0.75 HP)",150,0,{"$f":"IF(ISNA(V229),0,V229)","v":0},null,null,284,{"$f":"IFERROR(\n_xlfn.IFS(\nOR(SelectedElectric=\"Pacific Power\",SelectedElectric=\"Portland General Electric\"),\"CPUMPVSDCOOL0P75HP\"),\"DNQ\")","v":"DNQ"},{"$f":"$I229","v":0},{"$f":"IFERROR(\n_xlfn.XLOOKUP($N229,ProductCode,DefaultKwh,0,0),0)","v":0},{"$f":"IFERROR(\n_xlfn.XLOOKUP($N229,ProductCode,DefaultTherms,0,0),0)","v":0},{"$f":"IFERROR($I229*$P229,0)","v":0},{"$f":"IFERROR($I229*$Q229,0)","v":0},{"$f":"IFERROR((\n(_xlfn.XLOOKUP($N229,ProductCode,AllocationElectric,0,0))*$V229)/100,0)","v":0},{"$f":"IFERROR((\n(_xlfn.XLOOKUP($N229,ProductCode,AllocationGas,0,0))*$V229)/100,0)","v":0},{"$f":"IFERROR(\n(_xlfn.XLOOKUP($N229,ProductCode,DefaultIncentive,0,0)) * $I229,0)","v":0},"-Product cut sheet for pump and VFD. As-built plumbing plans.",null,"Verify installation of the equipment, photograph any label plates/stickers that list the model #.",{"$f":"IF($I229<>\"\",$I229,\"\")","v":0}]
[null,null,null,"Irrigation pumps are ineligible",null,null,"1 HP (0.76 to 1.25 HP)",200,0,{"$f":"IF(ISNA(V230),0,V230)","v":0},null,null,284,{"$f":"IFERROR(\n_xlfn.IFS(\nOR(SelectedElectric=\"Pacific Power\",SelectedElectric=\"Portland General Electric\"),\"CPUMPVSDCOOL1HP\"),\"DNQ\")","v":"DNQ"},{"$f":"$I230","v":0},0,0,{"$f":"IFERROR($I230*$P230,0)","v":0},{"$f":"IFERROR($I230*$Q230,0)","v":0},0,0,0,null,null,null,{"$f":"IF($I230<>\"\",$I230,\"\")","v":0}]
[null,null,null,null,null,null,"1.5 HP (1.26 to 1.75 HP)",250,0,0,null,null,284,{"$f":"IFERROR(\n_xlfn.IFS(\nOR(SelectedElectric=\"Pacific Power\",SelectedElectric=\"Portland General Electric\"),\"CPUMPVSDCOOL1P5HP\"),\"DNQ\")","v":"DNQ"},0,0,0,0,0,0,0,0,null,null,null,0]
[null,null,null,null,null,null,"2 HP (1.76 to 2.50 HP)",300,0,0,null,null,284,{"$f":"IFERROR(\n_xlfn.IFS(\nOR(SelectedElectric=\"Pacific Power\",SelectedElectric=\"Portland General Electric\"),\"CPUMPVSDCOOL2HP\"),\"DNQ\")","v":"DNQ"},0,0,0,0,0,0,0,0,null,null,null,0]
[null,null,null,null,null,null,"3 HP (2.51 to 3.50 HP)",350,0,0,null,null,284,{"$f":"IFERROR(\n_xlfn.IFS(\nOR(SelectedElectric=\"Pacific Power\",SelectedElectric=\"Portland General Electric\"),\"CPUMPVSDCOOL3HP\"),\"DNQ\")","v":"DNQ"},0,0,0,0,0,0,0,0,null,null,null,0]
[null,null,null,null,null,null,"4 HP (3.51 to 4.50 HP)",450,0,0,null,null,284,{"$f":"IFERROR(\n_xlfn.IFS(\nOR(SelectedElectric=\"Pacific Power\",SelectedElectric=\"Portland General Electric\"),\"CPUMPVSDCOOL4HP\"),\"DNQ\")","v":"DNQ"},0,0,0,0,0,0,0,0,null,null,null,0]
[null,null,null,null,null,null,"5 HP (4.51 to 6.00 HP)",500,0,0,null,null,284,{"$f":"IFERROR(\n_xlfn.IFS(\nOR(SelectedElectric=\"Pacific Power\",SelectedElectric=\"Portland General Electric\"),\"CPUMPVSDCOOL5HP\"),\"DNQ\")","v":"DNQ"},0,0,0,0,0,0,0,0,null,null,null,0]
[]
[]
[null,"Food Service Options"]
[]
[null,null,"Dishwasher, Multi Tank Conveyor","ENERGY STAR® v 3.0","Any","each",null,900,0,{"$f":"IF(ISNA(V240),0,V240)","v":0},null,null,35,{"$f":"IF(NOT(SelectedGas=\"None\"),\"DWMTCONHDTEMPE\",\"DNQ\")","v":"DWMTCONHDTEMPE"},{"$f":"$I240","v":0},{"$f":"IFERROR(\n_xlfn.XLOOKUP($N240,ProductCode,DefaultKwh,0,0),0)","v":4197.5},{"$f":"IFERROR(\n_xlfn.XLOOKUP($N240,ProductCode,DefaultTherms,0,0),0)","v":0},{"$f":"IFERROR($I240*$P240,0)","v":0},{"$f":"IFERROR($I240*$Q240,0)","v":0},{"$f":"IFERROR((\n(_xlfn.XLOOKUP($N240,ProductCode,AllocationElectric,0,0))*$V240)/100,0)","v":0},{"$f":"IFERROR((\n(_xlfn.XLOOKUP($N240,ProductCode,AllocationGas,0,0))*$V240)/100,0)","v":0},{"$f":"IFERROR(\n(_xlfn.XLOOKUP($N240,ProductCode,DefaultIncentive,0,0)) * $I240,0)","v":0},"-locate on ENERGY STAR QPL - provide screen shot or pdf of the listing\n-Product cut sheet (confirm water temp)",null,"Verify installation of the equipment, photograph label plates / stickers that list the model #",{"$f":"IF($I240<>\"\",$I240,\"\")","v":0}]
[null,null,{"$f":"\"- High/Dual Temp\"","v":"- High/Dual Temp"},"Flight type dishwashers do not qualify",null,null,null,null,null,null,null,null,null,null,null,null,null,null,null,null,null,null,null,null,null,{"$f":"IF($I242<>\"\",$I242,\"\")","v":""}]
[null,null,null,null,null,null,null,null,null,null,null,null,null,null,null,null,null,null,null,null,null,null,null,null,null,""]
[]
[null,null,"Dishwasher, Single Tank Conveyor","ENERGY STAR® v 3.0","Any","each","Low/Dual Temp",900,0,{"$f":"IF(ISNA(V244),0,V244)","v":0},null,null,35,{"$f":"IF(NOT(SelectedGas=\"None\"),\"DWSTCONLDTEMPE\",\"DNQ\")","v":"DWSTCONLDTEMPE"},{"$f":"$I244","v":0},{"$f":"IFERROR(\n_xlfn.XLOOKUP($N244,ProductCode,DefaultKwh,0,0),0)","v":5335.72},{"$f":"IFERROR(\n_xlfn.XLOOKUP($N244,ProductCode,DefaultTherms,0,0),0)","v":0},{"$f":"IFERROR($I244*$P244,0)","v":0},{"$f":"IFERROR($I244*$Q244,0)","v":0},{"$f":"IFERROR((\n(_xlfn.XLOOKUP($N244,ProductCode,AllocationElectric,0,0))*$V244)/100,0)","v":0},{"$f":"IFERROR((\n(_xlfn.XLOOKUP($N244,ProductCode,AllocationGas,0,0))*$V244)/100,0)","v":0},{"$f":"IFERROR(\n(_xlfn.XLOOKUP($N244,ProductCode,DefaultIncentive,0,0)) * $I244,0)","v":0},"-locate on ENERGY STAR QPL - provide screen shot or pdf of the listing\n-Product cut sheet (confirm water temp)",null,"Verify installation of the equipment, photograph label plates / stickers that list the model #",{"$f":"IF($I244<>\"\",$I244,\"\")","v":0}]
[null,null,null,"Flight type dishwashers do not qualify",null,null,"High/Dual Temp",900,0,{"$f":"IF(ISNA(V245),0,V245)","v":0},null,null,35,{"$f":"IF(NOT(SelectedGas=\"None\"),\"DWSTCONHTEMPE\",\"DNQ\")","v":"DWSTCONHTEMPE"},{"$f":"$I245","v":0},{"$f":"IFERROR(\n_xlfn.XLOOKUP($N245,ProductCode,DefaultKwh,0,0),0)","v":9402.4},{"$f":"IFERROR(\n_xlfn.XLOOKUP($N245,ProductCode,DefaultTherms,0,0),0)","v":0},{"$f":"IFERROR($I245*$P245,0)","v":0},{"$f":"IFERROR($I245*$Q245,0)","v":0},{"$f":"IFERROR((\n(_xlfn.XLOOKUP($N245,ProductCode,AllocationElectric,0,0))*$V245)/100,0)","v":0},{"$f":"IFERROR((\n(_xlfn.XLOOKUP($N245,ProductCode,AllocationGas,0,0))*$V245)/100,0)","v":0},{"$f":"IFERROR(\n(_xlfn.XLOOKUP($N245,ProductCode,DefaultIncentive,0,0)) * $I245,0)","v":0},null,null,null,{"$f":"IF($I245<>\"\",$I245,\"\")","v":0}]
[null,null,null,null,null,null,null,null,null,null,null,null,null,null,null,null,null,null,null,null,null,null,null,null,null,""]
[]
[null,null,"Electric Convection Oven Half-Size","ENERGY STAR® v 3.0","Any","each","Half-Size",300,0,{"$f":"IF(ISNA(V248),0,V248)","v":0},null,null,101,{"$f":"IF(OR(SelectedElectric=\"Pacific Power\",SelectedElectric=\"Portland General Electric\"),\"ELECONVOVES3HALF\",\"DNQ\")","v":"DNQ"},{"$f":"$I248","v":0},{"$f":"IFERROR(\n_xlfn.XLOOKUP($N248,ProductCode,DefaultKwh,0,0),0)","v":0},{"$f":"IFERROR(\n_xlfn.XLOOKUP($N248,ProductCode,DefaultTherms,0,0),0)","v":0},{"$f":"IFERROR($I248*$P248,0)","v":0},{"$f":"IFERROR($I248*$Q248,0)","v":0},{"$f":"IFERROR((\n(_xlfn.XLOOKUP($N248,ProductCode,AllocationElectric,0,0))*$V248)/100,0)","v":0},{"$f":"IFERROR((\n(_xlfn.XLOOKUP($N248,ProductCode,AllocationGas,0,0))*$V248)/100,0)","v":0},{"$f":"IFERROR(\n(_xlfn.XLOOKUP($N248,ProductCode,DefaultIncentive,0,0)) * $I248,0)","v":0},"-locate on ENERGY STAR QPL - provide screen shot or pdf of the listing\n-Product cut sheet (confirm half-size)",null,"Verify installation of the equipment, photograph label plates / stickers that list the model #",{"$f":"IF($I248<>\"\",$I248,\"\")","v":0}]
[null,null,null,null,null,null,"Full-Size",500,0,{"$f":"IF(ISNA(V249),0,V249)","v":0},null,null,101,{"$f":"IF(OR(SelectedElectric=\"Pacific Power\",SelectedElectric=\"Portland General Electric\"),\"ELECONVOVES3FULL\",\"DNQ\")","v":"DNQ"},{"$f":"$I249","v":0},{"$f":"IFERROR(\n_xlfn.XLOOKUP($N249,ProductCode,DefaultKwh,0,0),0)","v":0},{"$f":"IFERROR(\n_xlfn.XLOOKUP($N249,ProductCode,DefaultTherms,0,0),0)","v":0},{"$f":"IFERROR($I249*$P249,0)","v":0},{"$f":"IFERROR($I249*$Q249,0)","v":0},{"$f":"IFERROR((\n(_xlfn.XLOOKUP($N249,ProductCode,AllocationElectric,0,0))*$V249)/100,0)","v":0},{"$f":"IFERROR((\n(_xlfn.XLOOKUP($N249,ProductCode,AllocationGas,0,0))*$V249)/100,0)","v":0},{"$f":"IFERROR(\n(_xlfn.XLOOKUP($N249,ProductCode,DefaultIncentive,0,0)) * $I249,0)","v":0},null,null,null,{"$f":"IF($I249<>\"\",$I249,\"\")","v":0}]
[null,null,null,null,null,null,null,null,null,null,null,null,null,null,null,null,null,null,null,null,null,null,null,null,null,""]
[]
[null,null,"Electric Combination Oven","ENERGY STAR v 3.0","Any","each","3-4 pan capacity",500,0,{"$f":"IF(ISNA(V252),0,V252)","v":0},null,null,101,{"$f":"IF(OR(SelectedElectric=\"Pacific Power\",SelectedElectric=\"Portland General Electric\"),\"COMBOOVES334PANELE\",\"DNQ\")","v":"DNQ"},{"$f":"$I252","v":0},{"$f":"IFERROR(\n_xlfn.XLOOKUP($N252,ProductCode,DefaultKwh,0,0),0)","v":0},{"$f":"IFERROR(\n_xlfn.XLOOKUP($N252,ProductCode,DefaultTherms,0,0),0)","v":0},{"$f":"IFERROR($I252*$P252,0)","v":0},{"$f":"IFERROR($I252*$Q252,0)","v":0},{"$f":"IFERROR((\n(_xlfn.XLOOKUP($N252,ProductCode,AllocationElectric,0,0))*$V252)/100,0)","v":0},{"$f":"IFERROR((\n(_xlfn.XLOOKUP($N252,ProductCode,AllocationGas,0,0))*$V252)/100,0)","v":0},{"$f":"IFERROR(\n(_xlfn.XLOOKUP($N252,ProductCode,DefaultIncentive,0,0)) * $I252,0)","v":0},"-locate on ENERGY STAR QPL - provide screen shot or pdf of the listing\n-Product cut sheet (confirm full-size)",null,"Verify installation of the equipment, photograph label plates / stickers that list the model #",{"$f":"IF($I252<>\"\",$I252,\"\")","v":0}]
[null,null,null,null,null,null,"5-40 pan capacity",1000,0,{"$f":"IF(ISNA(V253),0,V253)","v":0},null,null,101,{"$f":"IF(OR(SelectedElectric=\"Pacific Power\",SelectedElectric=\"Portland General Electric\"),\"COMBOOVES3540PANELE\",\"DNQ\")","v":"DNQ"},{"$f":"$I253","v":0},{"$f":"IFERROR(\n_xlfn.XLOOKUP($N253,ProductCode,DefaultKwh,0,0),0)","v":0},{"$f":"IFERROR(\n_xlfn.XLOOKUP($N253,ProductCode,DefaultTherms,0,0),0)","v":0},{"$f":"IFERROR($I253*$P253,0)","v":0},{"$f":"IFERROR($I253*$Q253,0)","v":0},{"$f":"IFERROR((\n(_xlfn.XLOOKUP($N253,ProductCode,AllocationElectric,0,0))*$V253)/100,0)","v":0},{"$f":"IFERROR((\n(_xlfn.XLOOKUP($N253,ProductCode,AllocationGas,0,0))*$V253)/100,0)","v":0},{"$f":"IFERROR(\n(_xlfn.XLOOKUP($N253,ProductCode,DefaultIncentive,0,0)) * $I253,0)","v":0},null,null,null,{"$f":"IF($I253<>\"\",$I253,\"\")","v":0}]
[null,null,null,null,null,null,null,null,null,null,null,null,null,null,null,null,null,null,null,null,null,null,null,null,null,{"$f":"IF($I259<>\"\",$I259,\"\")","v":""}]
[]
[null,null,"Electric Hot Food Holding Cabinet, Half Size","ENERGY STAR","Any","each",null,450,0,{"$f":"IF(ISNA(V256),0,V256)","v":0},null,null,101,{"$f":"IF(NOT(SelectedGas=\"None\"),\"HOTCABINETHALF\",\"DNQ\")","v":"HOTCABINETHALF"},{"$f":"$I256","v":0},{"$f":"IFERROR(\n_xlfn.XLOOKUP($N256,ProductCode,DefaultKwh,0,0),0)","v":736.04},{"$f":"IFERROR(\n_xlfn.XLOOKUP($N256,ProductCode,DefaultTherms,0,0),0)","v":0},{"$f":"IFERROR($I256*$P256,0)","v":0},{"$f":"IFERROR($I256*$Q256,0)","v":0},{"$f":"IFERROR((\n(_xlfn.XLOOKUP($N256,ProductCode,AllocationElectric,0,0))*$V256)/100,0)","v":0},{"$f":"IFERROR((\n(_xlfn.XLOOKUP($N256,ProductCode,AllocationGas,0,0))*$V256)/100,0)","v":0},{"$f":"IFERROR(\n(_xlfn.XLOOKUP($N256,ProductCode,DefaultIncentive,0,0)) * $I256,0)","v":0},"-locate on ENERGY STAR QPL - provide screen shot or pdf of the listing\n-Product cut sheet (confirm size)",null,"Verify installation of the equipment, photograph label plates / stickers that list the model #",{"$f":"IF($I256<>\"\",$I256,\"\")","v":0}]
[null,null,null,"Must have interior volume less than 13 cubic feet"]
[]
[]
[null,null,"Gas Double Rack Oven","ENERGY STAR® v 3.0","Any","each","Double Rack",2000,0,{"$f":"IF(ISNA(V260),0,V260)","v":0},null,null,101,{"$f":"IF(NOT(SelectedGas=\"None\"),\"RACKOVENDOUB\",\"DNQ\")","v":"RACKOVENDOUB"},{"$f":"$I260","v":0},{"$f":"IFERROR(\n_xlfn.XLOOKUP($N260,ProductCode,DefaultKwh,0,0),0)","v":0},{"$f":"IFERROR(\n_xlfn.XLOOKUP($N260,ProductCode,DefaultTherms,0,0),0)","v":218.44},{"$f":"IFERROR($I260*$P260,0)","v":0},{"$f":"IFERROR($I260*$Q260,0)","v":0},{"$f":"IFERROR((\n(_xlfn.XLOOKUP($N260,ProductCode,AllocationElectric,0,0))*$V260)/100,0)","v":0},{"$f":"IFERROR((\n(_xlfn.XLOOKUP($N260,ProductCode,AllocationGas,0,0))*$V260)/100,0)","v":0},{"$f":"IFERROR(\n(_xlfn.XLOOKUP($N260,ProductCode,DefaultIncentive,0,0)) * $I260,0)","v":0},"-locate on ENERGY STAR QPL - provide screen shot or pdf of the listing\n-Product cut sheet (confirm full-size)",null,"Verify installation of the equipment, photograph label plates / stickers that list the model #",{"$f":"IF($I260<>\"\",$I260,\"\")","v":0}]
[null,null,null,"Double accomodates two standard full-size sheet pans measuring 18 x 26 x 1 inch"]
[]
[]
[null,null,"Gas-fired Automatic Conveyor Broiler","Automatic conveyor with catalyst ","Any","each","under 20\"",2500,0,{"$f":"IF(ISNA(V264),0,V264)","v":0},null,null,101,{"$f":"IFERROR(\n_xlfn.IFS(\n$D$1=\"Full Territory\",\"BROILER20F\",\n$D$1=\"Electric Only\",\"BROILER20E\",\n$D$1=\"Gas Only\",\"BROILER20GO\"),\"DNQ\")","v":"DNQ"},{"$f":"$I264","v":0},{"$f":"IFERROR(\n_xlfn.XLOOKUP($N264,ProductCode,DefaultKwh,0,0),0)","v":0},{"$f":"IFERROR(\n_xlfn.XLOOKUP($N264,ProductCode,DefaultTherms,0,0),0)","v":0},{"$f":"IFERROR($I264*$P264,0)","v":0},{"$f":"IFERROR($I264*$Q264,0)","v":0},{"$f":"IFERROR((\n(_xlfn.XLOOKUP($N264,ProductCode,AllocationElectric,0,0))*$V264)/100,0)","v":0},{"$f":"IFERROR((\n(_xlfn.XLOOKUP($N264,ProductCode,AllocationGas,0,0))*$V264)/100,0)","v":0},{"$f":"IFERROR(\n(_xlfn.XLOOKUP($N264,ProductCode,DefaultIncentive,0,0)) * $I264,0)","v":0},"-Product cut sheet",null,"Verify installation of the equipment, photograph label plates / stickers that list the model #. Verify that unit is continuous two speed and >90cfm.",{"$f":"IF($I264<>\"\",$I264,\"\")","v":0}]
[null,null,{"$f":"\"- Continuous Two Speed\"","v":"- Continuous Two Speed"},"Input rate less than 80 kBtu/h OR dual stage OR",null,null,"20-26\"",3000,0,0,null,null,101,{"$f":"IFERROR(\n_xlfn.IFS(\n$D$1=\"Full Territory\",\"BROILER2026F\",\n$D$1=\"Electric Only\",\"BROILER2026E\",\n$D$1=\"Gas Only\",\"BROILER2026GO\"),\"DNQ\")","v":"DNQ"},0,{"$f":"IFERROR(\n_xlfn.XLOOKUP($N265,ProductCode,DefaultKwh,0,0),0)","v":0},{"$f":"IFERROR(\n_xlfn.XLOOKUP($N265,ProductCode,DefaultTherms,0,0),0)","v":0},0,0,{"$f":"IFERROR((\n(_xlfn.XLOOKUP($N265,ProductCode,AllocationElectric,0,0))*$V265)/100,0)","v":0},{"$f":"IFERROR((\n(_xlfn.XLOOKUP($N265,ProductCode,AllocationGas,0,0))*$V265)/100,0)","v":0},{"$f":"IFERROR(\n(_xlfn.XLOOKUP($N265,ProductCode,DefaultIncentive,0,0)) * $I265,0)","v":0},null,null,null,{"$f":"IF($I265<>\"\",$I265,\"\")","v":0}]
[null,null,{"$f":"\"- Greater than 90 cfm\"","v":"- Greater than 90 cfm"},"modulating gas valve with a capability of throttling the input rate below 80 kBtu/h",null,null,"over 26\"",3500,0,0,null,null,101,{"$f":"IFERROR(\n_xlfn.IFS(\n$D$1=\"Full Territory\",\"BROILER26F\",\n$D$1=\"Electric Only\",\"BROILER26E\",\n$D$1=\"Gas Only\",\"BROILER26GO\"),\"DNQ\")","v":"DNQ"},0,{"$f":"IFERROR(\n_xlfn.XLOOKUP($N266,ProductCode,DefaultKwh,0,0),0)","v":0},{"$f":"IFERROR(\n_xlfn.XLOOKUP($N266,ProductCode,DefaultTherms,0,0),0)","v":0},0,0,{"$f":"IFERROR((\n(_xlfn.XLOOKUP($N266,ProductCode,AllocationElectric,0,0))*$V266)/100,0)","v":0},{"$f":"IFERROR((\n(_xlfn.XLOOKUP($N266,ProductCode,AllocationGas,0,0))*$V266)/100,0)","v":0},{"$f":"IFERROR(\n(_xlfn.XLOOKUP($N266,ProductCode,DefaultIncentive,0,0)) * $I266,0)","v":0},null,null,null,{"$f":"IF($I266<>\"\",$I266,\"\")","v":0}]
[]
[]
[null,null,"Ice Maker","ENERGY STAR v 3.0","Any","each","Batch SCU, >200 lb/day",180,0,{"$f":"IF(ISNA(V269),0,V269)","v":0},null,null,90,"ICESCUBATCH",{"$f":"$I269","v":0},{"$f":"IFERROR(\n_xlfn.XLOOKUP($N269,ProductCode,DefaultKwh,0,0),0)","v":559.25},{"$f":"IFERROR(\n_xlfn.XLOOKUP($N269,ProductCode,DefaultTherms,0,0),0)","v":0},{"$f":"IFERROR($I269*$P269,0)","v":0},{"$f":"IFERROR($I269*$Q269,0)","v":0},{"$f":"IFERROR((\n(_xlfn.XLOOKUP($N269,ProductCode,AllocationElectric,0,0))*$V269)/100,0)","v":0},{"$f":"IFERROR((\n(_xlfn.XLOOKUP($N269,ProductCode,AllocationGas,0,0))*$V269)/100,0)","v":0},{"$f":"IFERROR(\n(_xlfn.XLOOKUP($N269,ProductCode,DefaultIncentive,0,0)) * $I269,0)","v":0},"-locate on ENERGY STAR QPL - provide screen shot or pdf of the listing\n-Product cut sheet ",null,"Verify installation of the equipment, photograph label plates / stickers that list the model #",{"$f":"IF($I269<>\"\",$I269,\"\")","v":0}]
[null,null,null,"Must be ≤4,000 lb/day",null,null,"Batch RCU, >988 lb/day",400,0,0,null,null,90,"ICERCUBATCH",0,{"$f":"IFERROR(\n_xlfn.XLOOKUP($N270,ProductCode,DefaultKwh,0,0),0)","v":1244.53},{"$f":"IFERROR(\n_xlfn.XLOOKUP($N270,ProductCode,DefaultTherms,0,0),0)","v":0},0,0,{"$f":"IFERROR((\n(_xlfn.XLOOKUP($N270,ProductCode,AllocationElectric,0,0))*$V270)/100,0)","v":0},{"$f":"IFERROR((\n(_xlfn.XLOOKUP($N270,ProductCode,AllocationGas,0,0))*$V270)/100,0)","v":0},{"$f":"IFERROR(\n(_xlfn.XLOOKUP($N270,ProductCode,DefaultIncentive,0,0)) * $I270,0)","v":0},null,null,null,{"$f":"IF($I270<>\"\",$I270,\"\")","v":0}]
[null,null,null,null,null,null,"Batch IMH, >1,500 lb/day",400,0,0,null,null,90,"ICEIMHBATCH",0,{"$f":"IFERROR(\n_xlfn.XLOOKUP($N271,ProductCode,DefaultKwh,0,0),0)","v":1831.57},{"$f":"IFERROR(\n_xlfn.XLOOKUP($N271,ProductCode,DefaultTherms,0,0),0)","v":0},0,0,{"$f":"IFERROR((\n(_xlfn.XLOOKUP($N271,ProductCode,AllocationElectric,0,0))*$V271)/100,0)","v":0},{"$f":"IFERROR((\n(_xlfn.XLOOKUP($N271,ProductCode,AllocationGas,0,0))*$V271)/100,0)","v":0},{"$f":"IFERROR(\n(_xlfn.XLOOKUP($N271,ProductCode,DefaultIncentive,0,0)) * $I271,0)","v":0},null,null,null,{"$f":"IF($I271<>\"\",$I271,\"\")","v":0}]
[null,null,null,null,null,null,"Continuous RCU, >800 lb/day",400,0,0,null,null,90,"ICERCUCONT",0,{"$f":"IFERROR(\n_xlfn.XLOOKUP($N272,ProductCode,DefaultKwh,0,0),0)","v":4207.47},{"$f":"IFERROR(\n_xlfn.XLOOKUP($N272,ProductCode,DefaultTherms,0,0),0)","v":0},0,0,{"$f":"IFERROR((\n(_xlfn.XLOOKUP($N272,ProductCode,AllocationElectric,0,0))*$V272)/100,0)","v":0},{"$f":"IFERROR((\n(_xlfn.XLOOKUP($N272,ProductCode,AllocationGas,0,0))*$V272)/100,0)","v":0},{"$f":"IFERROR(\n(_xlfn.XLOOKUP($N272,ProductCode,DefaultIncentive,0,0)) * $I272,0)","v":0},null,null,null,{"$f":"IF($I272<>\"\",$I272,\"\")","v":0}]
[null,null,null,null,null,null,"Continuous IMH, >820 lb/day",400,0,{"$f":"IF(ISNA(V273),0,V273)","v":0},null,null,90,"ICEIMHCONT",{"$f":"$I273","v":0},{"$f":"IFERROR(\n_xlfn.XLOOKUP($N273,ProductCode,DefaultKwh,0,0),0)","v":1138.52},{"$f":"IFERROR(\n_xlfn.XLOOKUP($N273,ProductCode,DefaultTherms,0,0),0)","v":0},0,0,{"$f":"IFERROR((\n(_xlfn.XLOOKUP($N273,ProductCode,AllocationElectric,0,0))*$V273)/100,0)","v":0},{"$f":"IFERROR((\n(_xlfn.XLOOKUP($N273,ProductCode,AllocationGas,0,0))*$V273)/100,0)","v":0},{"$f":"IFERROR(\n(_xlfn.XLOOKUP($N273,ProductCode,DefaultIncentive,0,0)) * $I273,0)","v":0},null,null,null,0]
[]
[]
[null,null,"On-Demand Overwrapper","Must use either a mechanical or optical control system","Any","each",null,350,0,{"$f":"IF(ISNA(V276),0,V276)","v":0},null,null,230,{"$f":"IF(NOT(SelectedGas=\"None\"),\"OVERWRAPPER\",\"DNQ\")","v":"OVERWRAPPER"},{"$f":"$I276","v":0},{"$f":"IFERROR(\n_xlfn.XLOOKUP($N276,ProductCode,DefaultKwh,0,0),0)","v":1584.49},{"$f":"IFERROR(\n_xlfn.XLOOKUP($N276,ProductCode,DefaultTherms,0,0),0)","v":-37.57},{"$f":"IFERROR($I276*$P276,0)","v":0},{"$f":"IFERROR($I276*$Q276,0)","v":0},{"$f":"IFERROR((\n(_xlfn.XLOOKUP($N276,ProductCode,AllocationElectric,0,0))*$V276)/100,0)","v":0},{"$f":"IFERROR((\n(_xlfn.XLOOKUP($N276,ProductCode,AllocationGas,0,0))*$V276)/100,0)","v":0},{"$f":"IFERROR(\n(_xlfn.XLOOKUP($N276,ProductCode,DefaultIncentive,0,0)) * $I276,0)","v":0},"-Product cut sheet (confirm control system)",null,"Verify installation of the equipment, photograph label plates / stickers that list the model #",{"$f":"IF($I276<>\"\",$I276,\"\")","v":0}]
[]
[]
[null,null,"Reach-In Glass Door Freezer","ENERGY STAR","Any","each","0 < V < 15",40,0,{"$f":"IF(ISNA(V279),0,V279)","v":0},null,null,186,{"$f":"IFERROR(\n_xlfn.IFS(\n$C$283=\"Electric Resistance\",\"FREZRCHVRT015ELE\",\n$C$283=\"Heat Pump\",\"FREZRCHVRT015HP\",\nAND($C$283=\"Natural Gas\",$D$1=\"Full Territory\"),\"FREZRCHVRT015GAS\",\nAND($C$283=\"Natural Gas\",$D$1=\"Electric Only\"),\"FREZRCHVRT015GEOT\"),\"DNQ\")","v":"DNQ"},{"$f":"$I279","v":0},{"$f":"IFERROR(\n_xlfn.XLOOKUP($N279,ProductCode,DefaultKwh,0,0),0)","v":0},{"$f":"IFERROR(\n_xlfn.XLOOKUP($N279,ProductCode,DefaultTherms,0,0),0)","v":0},{"$f":"IFERROR($I279*$P279,0)","v":0},{"$f":"IFERROR($I279*$Q279,0)","v":0},{"$f":"IFERROR((\n(_xlfn.XLOOKUP($N279,ProductCode,AllocationElectric,0,0))*$V279)/100,0)","v":0},{"$f":"IFERROR((\n(_xlfn.XLOOKUP($N279,ProductCode,AllocationGas,0,0))*$V279)/100,0)","v":0},{"$f":"IFERROR(\n(_xlfn.XLOOKUP($N279,ProductCode,DefaultIncentive,0,0)) * $I279,0)","v":0},"-Provide Energy Star certificate\n-Product cut sheet",null,"Verify installation of the equipment, photograph label plates / stickers that list the model #. Verify unit has glass doors and is self-contained with built-in compressor for cooling.",{"$f":"IF($I279<>\"\",$I279,\"\")","v":0}]
[null,null,null,"Must be packaged and self-contained w/built-in compressor for cooling",null,null,"15 ≤ V < 30",80,0,0,null,null,186,{"$f":"IFERROR(\n_xlfn.IFS(\n$C$283=\"Electric Resistance\",\"FREZRCHVRT1530ELE\",\n$C$283=\"Heat Pump\",\"FREZRCHVRT1530HP\",\nAND($C$283=\"Natural Gas\",$D$1=\"Full Territory\"),\"FREZRCHVRT1530GAS\",\nAND($C$283=\"Natural Gas\",$D$1=\"Electric Only\"),\"FREZRCHVRT1530GEOT\"),\"DNQ\")","v":"DNQ"},0,{"$f":"IFERROR(\n_xlfn.XLOOKUP($N280,ProductCode,DefaultKwh,0,0),0)","v":0},{"$f":"IFERROR(\n_xlfn.XLOOKUP($N280,ProductCode,DefaultTherms,0,0),0)","v":0},0,0,{"$f":"IFERROR((\n(_xlfn.XLOOKUP($N280,ProductCode,AllocationElectric,0,0))*$V280)/100,0)","v":0},{"$f":"IFERROR((\n(_xlfn.XLOOKUP($N280,ProductCode,AllocationGas,0,0))*$V280)/100,0)","v":0},{"$f":"IFERROR(\n(_xlfn.XLOOKUP($N280,ProductCode,DefaultIncentive,0,0)) * $I280,0)","v":0},null,null,null,{"$f":"IF($I280<>\"\",$I280,\"\")","v":0}]
[null,null,null,"Must have glass doors",null,null,"30 ≤ V < 50",190,0,{"$f":"IF(ISNA(V281),0,V281)","v":0},null,null,186,{"$f":"IFERROR(\n_xlfn.IFS(\n$C$283=\"Electric Resistance\",\"FREZRCHVRT3050ELE\",\n$C$283=\"Heat Pump\",\"FREZRCHVRT3050HP\",\nAND($C$283=\"Natural Gas\",$D$1=\"Full Territory\"),\"FREZRCHVRT3050GAS\",\nAND($C$283=\"Natural Gas\",$D$1=\"Electric Only\"),\"FREZRCHVRT3050GEOT\"),\"DNQ\")","v":"DNQ"},0,{"$f":"IFERROR(\n_xlfn.XLOOKUP($N281,ProductCode,DefaultKwh,0,0),0)","v":0},{"$f":"IFERROR(\n_xlfn.XLOOKUP($N281,ProductCode,DefaultTherms,0,0),0)","v":0},0,0,{"$f":"IFERROR((\n(_xlfn.XLOOKUP($N281,ProductCode,AllocationElectric,0,0))*$V281)/100,0)","v":0},{"$f":"IFERROR((\n(_xlfn.XLOOKUP($N281,ProductCode,AllocationGas,0,0))*$V281)/100,0)","v":0},{"$f":"IFERROR(\n(_xlfn.XLOOKUP($N281,ProductCode,DefaultIncentive,0,0)) * $I281,0)","v":0},null,null,null,{"$f":"IF($I281<>\"\",$I281,\"\")","v":0}]
[null,null,null,"Used or rebuilt equipment is not eligible",null,null,"50 ≤ V",325,0,0,null,null,186,{"$f":"IFERROR(\n_xlfn.IFS(\n$C$283=\"Electric Resistance\",\"FREZRCHVRT50ELE\",\n$C$283=\"Heat Pump\",\"FREZRCHVRT50HP\",\nAND($C$283=\"Natural Gas\",$D$1=\"Full Territory\"),\"FREZRCHVRT50GAS\",\nAND($C$283=\"Natural Gas\",$D$1=\"Electric Only\"),\"FREZRCHVRT50GEOT\"),\"DNQ\")","v":"DNQ"},0,{"$f":"IFERROR(\n_xlfn.XLOOKUP($N282,ProductCode,DefaultKwh,0,0),0)","v":0},{"$f":"IFERROR(\n_xlfn.XLOOKUP($N282,ProductCode,DefaultTherms,0,0),0)","v":0},0,0,{"$f":"IFERROR((\n(_xlfn.XLOOKUP($N282,ProductCode,AllocationElectric,0,0))*$V282)/100,0)","v":0},{"$f":"IFERROR((\n(_xlfn.XLOOKUP($N282,ProductCode,AllocationGas,0,0))*$V282)/100,0)","v":0},{"$f":"IFERROR(\n(_xlfn.XLOOKUP($N282,ProductCode,DefaultIncentive,0,0)) * $I282,0)","v":0},null,null,null,{"$f":"IF($I282<>\"\",$I282,\"\")","v":0}]
[null,null,"<Select Space Heat Type>"]
[null,null,null,null,null,null,null,null,null,null,null,null,null,null,null,null,null,null,null,null,null,null,"-Provide Energy Star certificate\n-Product cut sheet",null,"Verify installation of the equipment, photograph label plates / stickers that list the model #. Verify unit has glass doors and is self-contained with built-in compressor for cooling."]
[null,null,"Reach-In Glass Door Refrigerator","ENERGY STAR","Any","each","0 < V < 15",20,0,{"$f":"IF(ISNA(V285),0,V285)","v":0},null,null,186,{"$f":"IFERROR(\n_xlfn.IFS(\n$C$289=\"Electric Resistance\",\"FRIGRCHVRT015ELE\",\n$C$289=\"Heat Pump\",\"FRIGRCHVRT015HP\",\nAND($C$289=\"Natural Gas\",$D$1=\"Full Territory\"),\"FRIGRCHVRT015GAS\",\nAND($C$289=\"Natural Gas\",$D$1=\"Electric Only\"),\"FRIGRCHVRT015GEOT\"),\"DNQ\")","v":"DNQ"},{"$f":"$I285","v":0},{"$f":"IFERROR(\n_xlfn.XLOOKUP($N285,ProductCode,DefaultKwh,0,0),0)","v":0},{"$f":"IFERROR(\n_xlfn.XLOOKUP($N285,ProductCode,DefaultTherms,0,0),0)","v":0},{"$f":"IFERROR($I285*$P285,0)","v":0},{"$f":"IFERROR($I285*$Q285,0)","v":0},{"$f":"IFERROR((\n(_xlfn.XLOOKUP($N285,ProductCode,AllocationElectric,0,0))*$V285)/100,0)","v":0},{"$f":"IFERROR((\n(_xlfn.XLOOKUP($N285,ProductCode,AllocationGas,0,0))*$V285)/100,0)","v":0},{"$f":"IFERROR(\n(_xlfn.XLOOKUP($N285,ProductCode,DefaultIncentive,0,0)) * $I285,0)","v":0},null,null,null,{"$f":"IF($I285<>\"\",$I285,\"\")","v":0}]
[null,null,null,"Must be packaged and self-contained w/built-in compressor for cooling",null,null,null,null,null,null,null,null,null,null,null,null,null,null,null,null,null,null,null,null,null,{"$f":"IF($I288<>\"\",$I288,\"\")","v":""}]
[null,null,null,"Must have glass doors"]
[null,null,null,"Used or rebuilt equipment is not eligible",null,null,null,null,null,null,null,null,null,null,null,null,null,null,null,null,null,null,null,null,null,{"$f":"IF($I302<>\"\",$I302,\"\")","v":""}]
[null,null,"<Select Space Heat Type>"]
[]
[null,null,"Refrigerated Cases with Doors","ENERGY STAR v 3.0","Any","each","Remote condensing, vertical med temp",150,0,{"$f":"IF(ISNA(V291),0,V291)","v":0},null,null,201,{"$f":"IFERROR(\n_xlfn.IFS(\nAND($D$1=\"Full Territory\",SelectedHeat=\"Electric\"),\"COOLCASEDRRCVTMEDELE\",\nAND($D$1=\"Full Territory\",SelectedHeat=\"Gas\"),\"COOLCASEDRRCVTMEDGAS\",\nAND($D$1=\"Electric Only\",SelectedHeat=\"Gas\"),\"COOLCASEDRRCVTMEDEOT\",\nAND($D$1=\"Gas Only\"),\"COOLCASEDRRCVTMEDGOT\"\n),\"DNQ\")","v":"DNQ"},{"$f":"$I291","v":0},{"$f":"IFERROR(\n_xlfn.XLOOKUP($N291,ProductCode,DefaultKwh,0,0),0)","v":0},{"$f":"IFERROR(\n_xlfn.XLOOKUP($N291,ProductCode,DefaultTherms,0,0),0)","v":0},{"$f":"IFERROR($I291*$P291,0)","v":0},{"$f":"IFERROR($I291*$Q291,0)","v":0},{"$f":"IFERROR((\n(_xlfn.XLOOKUP($N291,ProductCode,AllocationElectric,0,0))*$V291)/100,0)","v":0},{"$f":"IFERROR((\n(_xlfn.XLOOKUP($N291,ProductCode,AllocationGas,0,0))*$V291)/100,0)","v":0},{"$f":"IFERROR(\n(_xlfn.XLOOKUP($N291,ProductCode,DefaultIncentive,0,0)) * $I291,0)","v":0},"-locate on ENERGY STAR QPL - provide screen shot or pdf of the listing\n-Product cut sheet",null,"Verify installation of the equipment, photograph label plates / stickers that list the model #. Verify unit has transparent doors. Verify if unit is self-contained with gas heating (applicable to electric-only territories).",{"$f":"IF($I291<>\"\",$I291,\"\")","v":0}]
[null,null,null,"Doors must be transparent",null,null,"Remote condensing, horizontal med temp",150,0,{"$f":"IF(ISNA(V292),0,V292)","v":0},null,null,201,{"$f":"IFERROR(\n_xlfn.IFS(\nAND($D$1=\"Full Territory\",SelectedHeat=\"Electric\"),\"COOLCASEDRRCHZMEDELE\",\nAND($D$1=\"Full Territory\",SelectedHeat=\"Gas\"),\"COOLCASEDRRCHZMEDGAS\",\nAND($D$1=\"Electric Only\",SelectedHeat=\"Gas\"),\"COOLCASEDRRCHZMEDEOT\",\nAND($D$1=\"Gas Only\"),\"COOLCASEDRRCHZMEDGOT\"\n),\"DNQ\")","v":"DNQ"},{"$f":"$I292","v":0},{"$f":"IFERROR(\n_xlfn.XLOOKUP($N292,ProductCode,DefaultKwh,0,0),0)","v":0},{"$f":"IFERROR(\n_xlfn.XLOOKUP($N292,ProductCode,DefaultTherms,0,0),0)","v":0},{"$f":"IFERROR($I292*$P292,0)","v":0},{"$f":"IFERROR($I292*$Q292,0)","v":0},{"$f":"IFERROR((\n(_xlfn.XLOOKUP($N292,ProductCode,AllocationElectric,0,0))*$V292)/100,0)","v":0},{"$f":"IFERROR((\n(_xlfn.XLOOKUP($N292,ProductCode,AllocationGas,0,0))*$V292)/100,0)","v":0},{"$f":"IFERROR(\n(_xlfn.XLOOKUP($N292,ProductCode,DefaultIncentive,0,0)) * $I292,0)","v":0},null,null,null,{"$f":"IF($I292<>\"\",$I292,\"\")","v":0}]
[null,null,null,"Self-contained eligible with gas heating in electric only territories",null,null,"Remote condensing, horizontal low temp",150,0,0,null,null,201,{"$f":"IFERROR(\n_xlfn.IFS(\nAND($D$1=\"Full Territory\",SelectedHeat=\"Electric\"),\"COOLCASEDRRCHZLOWELE\",\nAND($D$1=\"Full Territory\",SelectedHeat=\"Gas\"),\"COOLCASEDRRCHZLOWGAS\",\nAND($D$1=\"Electric Only\",SelectedHeat=\"Gas\"),\"COOLCASEDRRCHZLOWEOT\",\nAND($D$1=\"Gas Only\"),\"COOLCASEDRRCHZLOWGOT\"\n),\"DNQ\")","v":"DNQ"},{"$f":"$I293","v":0},{"$f":"IFERROR(\n_xlfn.XLOOKUP($N293,ProductCode,DefaultKwh,0,0),0)","v":0},{"$f":"IFERROR(\n_xlfn.XLOOKUP($N293,ProductCode,DefaultTherms,0,0),0)","v":0},{"$f":"IFERROR($I293*$P293,0)","v":0},{"$f":"IFERROR($I293*$Q293,0)","v":0},{"$f":"IFERROR((\n(_xlfn.XLOOKUP($N293,ProductCode,AllocationElectric,0,0))*$V293)/100,0)","v":0},{"$f":"IFERROR((\n(_xlfn.XLOOKUP($N293,ProductCode,AllocationGas,0,0))*$V293)/100,0)","v":0},{"$f":"IFERROR(\n(_xlfn.XLOOKUP($N293,ProductCode,DefaultIncentive,0,0)) * $I293,0)","v":0},null,null,null,{"$f":"IF($I293<>\"\",$I293,\"\")","v":0}]
[null,null,null,"Refurbished cases are not eligible for this measure",null,null,"Self-Contained, horizontal low temp",150,0,0,null,null,201,{"$f":"IFERROR(\n_xlfn.IFS(\nAND($D$1=\"Electric Only\",SelectedHeat=\"Gas\"),\"COOLCASEDRSCHZLOWEOT\"),\"DNQ\")","v":"DNQ"},{"$f":"$I294","v":0},{"$f":"IFERROR(\n_xlfn.XLOOKUP($N294,ProductCode,DefaultKwh,0,0),0)","v":0},{"$f":"IFERROR(\n_xlfn.XLOOKUP($N294,ProductCode,DefaultTherms,0,0),0)","v":0},{"$f":"IFERROR($I294*$P294,0)","v":0},{"$f":"IFERROR($I294*$Q294,0)","v":0},{"$f":"IFERROR((\n(_xlfn.XLOOKUP($N294,ProductCode,AllocationElectric,0,0))*$V294)/100,0)","v":0},{"$f":"IFERROR((\n(_xlfn.XLOOKUP($N294,ProductCode,AllocationGas,0,0))*$V294)/100,0)","v":0},{"$f":"IFERROR(\n(_xlfn.XLOOKUP($N294,ProductCode,DefaultIncentive,0,0)) * $I294,0)","v":0},null,null,null,{"$f":"IF($I294<>\"\",$I294,\"\")","v":0}]
[]
[]
[null,null,"Steam Cooker","ENERGY STAR","Any","each","Electric Steam Cooker",2500,0,{"$f":"IF(ISNA(V297),0,V297)","v":0},null,null,101,{"$f":"IF(OR(SelectedElectric=\"Pacific Power\",SelectedElectric=\"Portland General Electric\"),\"ELESTEAM\",\"DNQ\")","v":"DNQ"},{"$f":"$I297","v":0},{"$f":"IFERROR(\n_xlfn.XLOOKUP($N297,ProductCode,DefaultKwh,0,0),0)","v":0},{"$f":"IFERROR(\n_xlfn.XLOOKUP($N297,ProductCode,DefaultTherms,0,0),0)","v":0},{"$f":"IFERROR($I297*$P297,0)","v":0},{"$f":"IFERROR($I297*$Q297,0)","v":0},{"$f":"IFERROR((\n(_xlfn.XLOOKUP($N297,ProductCode,AllocationElectric,0,0))*$V297)/100,0)","v":0},{"$f":"IFERROR((\n(_xlfn.XLOOKUP($N297,ProductCode,AllocationGas,0,0))*$V297)/100,0)","v":0},{"$f":"IFERROR(\n(_xlfn.XLOOKUP($N297,ProductCode,DefaultIncentive,0,0)) * $I297,0)","v":0},"-locate on ENERGY STAR QPL - provide screen shot or pdf of the listing\n-Product cut sheet (confirm full size)",null,"Verify installation of the equipment, photograph any accessible label plates / stickers that list the model #",{"$f":"IF($I297<>\"\",$I297,\"\")","v":0}]
[null,null,null,null,null,null,"Gas Steam Cooker",3400,0,{"$f":"IF(ISNA(V298),0,V298)","v":0},null,null,101,{"$f":"IF(NOT(SelectedGas=\"None\"),\"GASSTEAMCOOK\",\"DNQ\")","v":"GASSTEAMCOOK"},0,{"$f":"IFERROR(\n_xlfn.XLOOKUP($N298,ProductCode,DefaultKwh,0,0),0)","v":0},{"$f":"IFERROR(\n_xlfn.XLOOKUP($N298,ProductCode,DefaultTherms,0,0),0)","v":555.32000000000005},0,0,{"$f":"IFERROR((\n(_xlfn.XLOOKUP($N298,ProductCode,AllocationElectric,0,0))*$V298)/100,0)","v":0},{"$f":"IFERROR((\n(_xlfn.XLOOKUP($N298,ProductCode,AllocationGas,0,0))*$V298)/100,0)","v":0},{"$f":"IFERROR(\n(_xlfn.XLOOKUP($N298,ProductCode,DefaultIncentive,0,0)) * $I298,0)","v":0},null,null,null,{"$f":"IF($I298<>\"\",$I298,\"\")","v":0}]
[]
[null,"TOTAL REQUESTED INCENTIVE",null,null,null,null,null,null,null,{"$f":"IFERROR(SUM(J9:$J299),0)","v":0}]
[null,"Please attach product data sheets containing Product Model Number, Manufacturer, & Product Specifications to this application."]
[null,"Additional incentive opportunities for your project such as elevators, energy recovery ventilation, kitchen vent hoods, lighting, and technical assistance are available. \nContact your outreach manager to learn more."]
[]
["Condensing Boiler - New Multifamily"]

{"sheet":"Changelog","index":2,"n_rows":49,"n_cols":6,"rows_kept":49,"cut":false,"hidden":true,"merged":[[0,2,0,4],[1,2,1,4],[2,2,2,4],[3,2,3,4]]}
["Macro Name","Shortcut or button","Function"]
["FilterMeasures","Button located on Measure Totals tab","Filters the measure totals by column N (Quantity)."]
["Hide","Ctrl+h","Hides unused columns(only use on user facing application tabs)."]
["Unhide","Ctrl+o","Unhides columns."]
[]
["Date","Revision","Category","Fixed in Version","Notes","Initials"]
["2022-01-01","v.2022.1","New Version",null,"New 520S Released for 2022","JV"]
["2022-03-01","v2","Updates","v.2022.2","Climate Zones Updated on CZ HZ Tab","JV"]
["2022-03-01","v2","Updates","v.2022.2","Condensing Furnaces, updates to allow multiples","JV"]
["2022-03-01","v2","Updates","v.2022.2","Gas Steam Cooker Incentive cell updated to $2,000","JV"]
["2022-03-01","v2","Updates","v.2022.2","VRF Requirements updated with the heat recovery efficiency language ","JV"]
["2022-03-01","v2","Updates","v.2022.2","Dishwasher requirement updated to Energy Star 3.0","JV"]
["2022-03-01","v2","Updates","v.2022.2","Verifed and updated groupings","JV"]
["2022-03-01","v2","Updates","v.2022.2","Added conditional formatting for non-qualifying code years","JV"]
["2022-03-01","v2","Updates","v.2022.2","Condensing Boiler requirement for 2019 Code Year","JV"]
["2022-03-01","v2","Updates","v.2022.2","Added conditional formatting for kBtu/h on tankless water heaters","JV"]
[null,null,null,null,"Active Measures Updated"]
["2022-03-01","v2","Updates","v.2022.2","Default Incentive updated for MFCONDENSFURN91 in Column 6","JV"]
["2022-03-01","v2","Updates","v.2022.2","Updafte Import, Measure Totals, Measure Lookups, Active Measures tabs","JM"]
["2022-04-18","v2","Updates","v.2022.2","Added 2014 code program information option -- Boilers and Garage Ventilation only measures not available for 2014 code","JM"]
["2022-09-28","v2023.1","Updates",null,"COM and MF boiler removed","AM"]
["2022-09-28","v2023.1","Updates",null,"added hydronic heating circulators measure","AM"]
["2022-09-28","v2023.1","Updates",null,"updated incentives for tankless WH","AM"]
["2022-10-13","v2023.1","Updates",null,"updated incentives for hydronic heating circulators measure","AM"]
["2022-10-13","v2023.1","Updates",null,"removed MF condensing furnaces","JV"]
["2022-10-13","v2023.1","Updates",null,"removed evaporator motor","JV"]
["2022-10-13","v2023.1","Updates",null,"removed spa covers","JV"]
["2022-10-13","v2023.1","Updates",null,"added new minisplit heat pumpmeasure","JV"]
["2022-10-13","v2023.1","Updates",null,"Updated minisplit totals for 2023","JV"]
["2022-10-13","v2023.1","Updates",null,"Added language from marketing materials for further incentive opportunities","JV"]
["2022-10-13","v2023.1","Updates",null,"updated MF Condensing Tankless savings/incentives","JV"]
["2022-10-13","v2023.1","Updates",null,"Fixed product lookup for Residential Washers on MF tab","JV"]
["2022-10-13","v2023.1","Updates",null,"Updated single speed bath fan requirements on MF tab","JV"]
["2022-10-13","v2023.1","Updates",null,"Fixed product lookup for condensing tankless water heater > 200 on HVAC tab","JV"]
["2022-10-26","v2023.1","Updates",null,"Added MAD 284 VFDs as new tab","JV"]
["2022-10-26","v2023.1","Updates",null,"Added MAD 52 on Multifamily tab","JV"]
["2022-12-09","v2023.1","Updates",null,"Final cleanup and small formatting changes to last rows on tabs","JV"]
["2023-03-20","v2023.2","Updates",null,"Fixed equipment option for commercial air-source heat pump","AM"]
["2023-03-20","v2023.2","Updates",null,"Updated formulas for incentive totals on each tab","AM"]
["2023-03-20","v2023.2","Updates",null,"Updated measure lookup formulas with new product codes, catching errors","AM"]
["2023-03-20","v2023.2","Updates",null,"Updated footer with current mailing address and form version","AM"]
["2023-03-27","v2023.2","Updates",null,"Updated electric oven incentive and measures with Energy Star v3.0 new product requests","AM"]
["2023-05-17","v2023.2","Updates",null,"Update formula in HVAC tab to remove duplicate error","AM"]
["2023-08-29","v2023.3","Updates",null,"adding double rack gas oven measure (MAD 101)","AM"]
["2023-09-27","v2024.1","Updates",null,"Combined equipment options and updated formulas","JV"]
["2023-10-10","v2024.1","Updates",null,"Updated all measures for EOY changes, corrected broken formulas, updated all product codes.","AM"]
["2023-11-10","v2024.1","Updates",null,"Completed incentive updates, EOY changes, and review of requirements, review requirements, and SV notes","JV"]
["2024-01-03","v2024.1","Updates",null,"Updating active measures for 2024","JV/AM"]
["2024-01-04","v2024.1","Updates",null,"Added electric hot food holding cabinets, protected workbook for use","JV/AM"]

{"sheet":"Measure Totals","index":3,"n_rows":10,"n_cols":12,"rows_kept":10,"cut":false,"hidden":true,"merged":[]}
[]
[null,null,"Installation Measures:"]
[null,null,"Measure Code","Measure","Incremental Cost","Quantity","Elec Savings","Elec Incentive","Gas Savings","Gas Incentive","Total Incentive"]
[null,null,"Quantity","(Multiple Items)"]
[]
[null,null,"Measure","Measure Name","Sum of Incremental Cost","Sum of Quantity","Sum of kWh","Sum of Incentive Ele","Sum of Therms","Sum of Incenitve Gas","Sum of Incentive","Min of Product Version ID"]
[null,null,"BFSS5","Bath Fan - Continuous single speed, <10 cfm/W",77.260000000000005,2,137.66,30,0,0,30,13853]
[null,null,"BFSS10","Bath Fan - Continuous single speed, >=10 cfm/W, <15 cfm/W",46,1,112.63,25,0,0,25,13854]
[null,null,"BFSS15","Bath Fan - Continuous single speed, >=15 cfm/W",177,3,381.69,90,0,0,90,13855]
[null,null,"Grand Total",null,300.26,6,631.98,145,0,0,145,13853]

{"sheet":"Import Pivot","index":4,"n_rows":7,"n_cols":15,"rows_kept":7,"cut":false,"hidden":true,"merged":[]}
[null,null,"Quantity","(Multiple Items)"]
[]
[null,null,"Measure","Sum of Quantity","Sum of ProjectCost","Sum of Incentive","Sum of kWh","Sum of Therms","Min of Installer","Max of ReservationDate","Max of InstalledDate","Max of LifeYears","Max of LP_ELE","Max of LP_GAS","Sum of Product Version ID"]
[null,null,"BFSS5",2,null,30,137.66,0,null,null,null,null,null,null,13853]
[null,null,"BFSS10",1,null,25,112.63,0,null,null,null,null,null,null,13854]
[null,null,"BFSS15",3,null,90,381.69,0,null,null,null,null,null,null,13855]
[null,null,"Grand Total",6,null,145,631.98,0,null,null,null,null,null,null,41562]

{"sheet":"MeasureTotals Lookups","index":5,"n_rows":207,"n_cols":18,"rows_kept":207,"cut":false,"hidden":true,"merged":[[1,1,1,12]]}
[]
[null,"Import Data"]
[null,"Measure","Quantity","ProjectCost","Incentive","kWh","Therms","Installer","ReservationDate","InstalledDate","LifeYears","LP_ELE","LP_GAS","Product Version ID","Incentive Ele","Incenitve Gas","Measure Name","Incremental Cost"]
[null,"MINISPLITAC",{"$f":"SUMIF('Equipment Options'!N:N,'MeasureTotals Lookups'!$B4,'Equipment Options'!O:O)","v":0},null,{"$f":"SUMIF('Equipment Options'!N:N,'MeasureTotals Lookups'!$B4,'Equipment Options'!V:V)","v":0},{"$f":"SUMIF('Equipment Options'!N:N,'MeasureTotals Lookups'!$B4,'Equipment Options'!R:R)","v":0},{"$f":"SUMIF('Equipment Options'!N:N,'MeasureTotals Lookups'!$B4,'Equipment Options'!S:S)","v":0},null,null,null,null,null,null,{"$f":"_xlfn.XLOOKUP($B4,ProductCode,ProductVersionId,\"\",0)","v":17692},{"$f":"SUMIF('Equipment Options'!N:N,'MeasureTotals Lookups'!$B4,'Equipment Options'!T:T)","v":0},{"$f":"SUMIF('Equipment Options'!N:N,'MeasureTotals Lookups'!$B4,'Equipment Options'!U:U)","v":0},{"$f":"_xlfn.XLOOKUP($B4,ProductCode,ProductDescription,\"\",0)","v":"Server Closet/Telecom Room Mini-Split Air Conditioner"},{"$f":"(_xlfn.XLOOKUP($B4,ProductCode,IncrementalCost,\"\",0))*C4","v":0}]
[null,"MINISPLITHP",{"$f":"SUMIF('Equipment Options'!N:N,'MeasureTotals Lookups'!$B5,'Equipment Options'!O:O)","v":0},null,{"$f":"SUMIF('Equipment Options'!N:N,'MeasureTotals Lookups'!$B5,'Equipment Options'!V:V)","v":0},{"$f":"SUMIF('Equipment Options'!N:N,'MeasureTotals Lookups'!$B5,'Equipment Options'!R:R)","v":0},{"$f":"SUMIF('Equipment Options'!N:N,'MeasureTotals Lookups'!$B5,'Equipment Options'!S:S)","v":0},null,null,null,null,null,null,17693,{"$f":"SUMIF('Equipment Options'!N:N,'MeasureTotals Lookups'!$B5,'Equipment Options'!T:T)","v":0},{"$f":"SUMIF('Equipment Options'!N:N,'MeasureTotals Lookups'!$B5,'Equipment Options'!U:U)","v":0},"Server Closet/Telecom Room Mini-Split Heat Pumps",0]
[null,"DHWCONDTANKMF",{"$f":"SUMIF('Equipment Options'!N:N,'MeasureTotals Lookups'!$B6,'Equipment Options'!O:O)","v":0},null,{"$f":"SUMIF('Equipment Options'!N:N,'MeasureTotals Lookups'!$B6,'Equipment Options'!V:V)","v":0},{"$f":"SUMIF('Equipment Options'!N:N,'MeasureTotals Lookups'!$B6,'Equipment Options'!R:R)","v":0},{"$f":"SUMIF('Equipment Options'!N:N,'MeasureTotals Lookups'!$B6,'Equipment Options'!S:S)","v":0},null,null,null,null,null,null,18351,{"$f":"SUMIF('Equipment Options'!N:N,'MeasureTotals Lookups'!$B6,'Equipment Options'!T:T)","v":0},{"$f":"SUMIF('Equipment Options'!N:N,'MeasureTotals Lookups'!$B6,'Equipment Options'!U:U)","v":0},"Condensing Tank Water Heater, Multifamily",0]
[null,"DHWCONDNMF",{"$f":"SUMIF('Equipment Options'!N:N,'MeasureTotals Lookups'!$B7,'Equipment Options'!O:O)","v":0},null,{"$f":"SUMIF('Equipment Options'!N:N,'MeasureTotals Lookups'!$B7,'Equipment Options'!V:V)","v":0},{"$f":"SUMIF('Equipment Options'!N:N,'MeasureTotals Lookups'!$B7,'Equipment Options'!R:R)","v":0},{"$f":"SUMIF('Equipment Options'!N:N,'MeasureTotals Lookups'!$B7,'Equipment Options'!S:S)","v":0},null,null,null,null,null,null,18353,{"$f":"SUMIF('Equipment Options'!N:N,'MeasureTotals Lookups'!$B7,'Equipment Options'!T:T)","v":0},{"$f":"SUMIF('Equipment Options'!N:N,'MeasureTotals Lookups'!$B7,'Equipment Options'!U:U)","v":0},"Condensing Tank Water Heater, All Except MF",0]
[null,"DWSTCONHTEMPE",{"$f":"SUMIF('Equipment Options'!N:N,'MeasureTotals Lookups'!$B8,'Equipment Options'!O:O)","v":0},null,{"$f":"SUMIF('Equipment Options'!N:N,'MeasureTotals Lookups'!$B8,'Equipment Options'!V:V)","v":0},{"$f":"SUMIF('Equipment Options'!N:N,'MeasureTotals Lookups'!$B8,'Equipment Options'!R:R)","v":0},{"$f":"SUMIF('Equipment Options'!N:N,'MeasureTotals Lookups'!$B8,'Equipment Options'!S:S)","v":0},null,null,null,null,null,null,13323,{"$f":"SUMIF('Equipment Options'!N:N,'MeasureTotals Lookups'!$B8,'Equipment Options'!T:T)","v":0},{"$f":"SUMIF('Equipment Options'!N:N,'MeasureTotals Lookups'!$B8,'Equipment Options'!U:U)","v":0},"Dishwasher - Single Tank Conveyor- High Temp - Ele WH",0]
[null,"DWSTCONLDTEMPE",{"$f":"SUMIF('Equipment Options'!N:N,'MeasureTotals Lookups'!$B9,'Equipment Options'!O:O)","v":0},null,{"$f":"SUMIF('Equipment Options'!N:N,'MeasureTotals Lookups'!$B9,'Equipment Options'!V:V)","v":0},{"$f":"SUMIF('Equipment Options'!N:N,'MeasureTotals Lookups'!$B9,'Equipment Options'!R:R)","v":0},{"$f":"SUMIF('Equipment Options'!N:N,'MeasureTotals Lookups'!$B9,'Equipment Options'!S:S)","v":0},null,null,null,null,null,null,13324,{"$f":"SUMIF('Equipment Options'!N:N,'MeasureTotals Lookups'!$B9,'Equipment Options'!T:T)","v":0},{"$f":"SUMIF('Equipment Options'!N:N,'MeasureTotals Lookups'!$B9,'Equipment Options'!U:U)","v":0},"Dishwasher - Single Tank Conveyor - Low or Dual temp - Ele WH",0]
[null,"DWMTCONHDTEMPE",{"$f":"SUMIF('Equipment Options'!N:N,'MeasureTotals Lookups'!$B10,'Equipment Options'!O:O)","v":0},null,{"$f":"SUMIF('Equipment Options'!N:N,'MeasureTotals Lookups'!$B10,'Equipment Options'!V:V)","v":0},{"$f":"SUMIF('Equipment Options'!N:N,'MeasureTotals Lookups'!$B10,'Equipment Options'!R:R)","v":0},{"$f":"SUMIF('Equipment Options'!N:N,'MeasureTotals Lookups'!$B10,'Equipment Options'!S:S)","v":0},null,null,null,null,null,null,13325,{"$f":"SUMIF('Equipment Options'!N:N,'MeasureTotals Lookups'!$B10,'Equipment Options'!T:T)","v":0},{"$f":"SUMIF('Equipment Options'!N:N,'MeasureTotals Lookups'!$B10,'Equipment Options'!U:U)","v":0},"Dishwasher - Multi Tank Conveyor - High or Dual Temp - Elec WH",0]
[null,"COMHPWHT3",{"$f":"SUMIF('Equipment Options'!N:N,'MeasureTotals Lookups'!$B11,'Equipment Options'!O:O)","v":0},null,{"$f":"SUMIF('Equipment Options'!N:N,'MeasureTotals Lookups'!$B11,'Equipment Options'!V:V)","v":0},{"$f":"SUMIF('Equipment Options'!N:N,'MeasureTotals Lookups'!$B11,'Equipment Options'!R:R)","v":0},{"$f":"SUMIF('Equipment Options'!N:N,'MeasureTotals Lookups'!$B11,'Equipment Options'!S:S)","v":0},null,null,null,null,null,null,18356,{"$f":"SUMIF('Equipment Options'!N:N,'MeasureTotals Lookups'!$B11,'Equipment Options'!T:T)","v":0},{"$f":"SUMIF('Equipment Options'!N:N,'MeasureTotals Lookups'!$B11,'Equipment Options'!U:U)","v":0},"Comm Heat Pump Water Heater Tier 3+ Any Building Type",0]
[null,"CTWH200COMMF",{"$f":"SUMIF('Equipment Options'!N:N,'MeasureTotals Lookups'!$B12,'Equipment Options'!O:O)","v":0},null,{"$f":"SUMIF('Equipment Options'!N:N,'MeasureTotals Lookups'!$B12,'Equipment Options'!V:V)","v":0},{"$f":"SUMIF('Equipment Options'!N:N,'MeasureTotals Lookups'!$B12,'Equipment Options'!R:R)","v":0},{"$f":"SUMIF('Equipment Options'!N:N,'MeasureTotals Lookups'!$B12,'Equipment Options'!S:S)","v":0},null,null,null,null,null,null,18357,{"$f":"SUMIF('Equipment Options'!N:N,'MeasureTotals Lookups'!$B12,'Equipment Options'!T:T)","v":0},{"$f":"SUMIF('Equipment Options'!N:N,'MeasureTotals Lookups'!$B12,'Equipment Options'!U:U)","v":0},"Tankless Water Heater >= 200 kBtu/h, MF",0]
[null,"CTWH200COMNONMF",{"$f":"SUMIF('Equipment Options'!N:N,'MeasureTotals Lookups'!$B13,'Equipment Options'!O:O)","v":0},null,{"$f":"SUMIF('Equipment Options'!N:N,'MeasureTotals Lookups'!$B13,'Equipment Options'!V:V)","v":0},{"$f":"SUMIF('Equipment Options'!N:N,'MeasureTotals Lookups'!$B13,'Equipment Options'!R:R)","v":0},{"$f":"SUMIF('Equipment Options'!N:N,'MeasureTotals Lookups'!$B13,'Equipment Options'!S:S)","v":0},null,null,null,null,null,null,18358,{"$f":"SUMIF('Equipment Options'!N:N,'MeasureTotals Lookups'!$B13,'Equipment Options'!T:T)","v":0},{"$f":"SUMIF('Equipment Options'!N:N,'MeasureTotals Lookups'!$B13,'Equipment Options'!U:U)","v":0},"Tankless Water Heaters >= 200 kBtu/h, All Except MF",0]
[null,"OZONSYS126400EWH",{"$f":"SUMIF('Equipment Options'!N:N,'MeasureTotals Lookups'!$B14,'Equipment Options'!O:O)","v":0},null,{"$f":"SUMIF('Equipment Options'!N:N,'MeasureTotals Lookups'!$B14,'Equipment Options'!V:V)","v":0},{"$f":"SUMIF('Equipment Options'!N:N,'MeasureTotals Lookups'!$B14,'Equipment Options'!R:R)","v":0},{"$f":"SUMIF('Equipment Options'!N:N,'MeasureTotals Lookups'!$B14,'Equipment Options'!S:S)","v":0},null,null,null,null,null,null,17926,{"$f":"SUMIF('Equipment Options'!N:N,'MeasureTotals Lookups'!$B14,'Equipment Options'!T:T)","v":0},{"$f":"SUMIF('Equipment Options'!N:N,'MeasureTotals Lookups'!$B14,'Equipment Options'!U:U)","v":0},"Ozone Laundry System 126-400 Lbs Capacity - Ele WH",0]
[null,"OZONSYS401600GWHGOT",{"$f":"SUMIF('Equipment Options'!N:N,'MeasureTotals Lookups'!$B15,'Equipment Options'!O:O)","v":0},null,{"$f":"SUMIF('Equipment Options'!N:N,'MeasureTotals Lookups'!$B15,'Equipment Options'!V:V)","v":0},{"$f":"SUMIF('Equipment Options'!N:N,'MeasureTotals Lookups'!$B15,'Equipment Options'!R:R)","v":0},{"$f":"SUMIF('Equipment Options'!N:N,'MeasureTotals Lookups'!$B15,'Equipment Options'!S:S)","v":0},null,null,null,null,null,null,17927,{"$f":"SUMIF('Equipment Options'!N:N,'MeasureTotals Lookups'!$B15,'Equipment Options'!T:T)","v":0},{"$f":"SUMIF('Equipment Options'!N:N,'MeasureTotals Lookups'!$B15,'Equipment Options'!U:U)","v":0},"Ozone Laundry System 401-600 Lbs Capacity - Gas WH GOT",0]
[null,"OZONSYS401600GWHFULL",{"$f":"SUMIF('Equipment Options'!N:N,'MeasureTotals Lookups'!$B16,'Equipment Options'!O:O)","v":0},null,{"$f":"SUMIF('Equipment Options'!N:N,'MeasureTotals Lookups'!$B16,'Equipment Options'!V:V)","v":0},{"$f":"SUMIF('Equipment Options'!N:N,'MeasureTotals Lookups'!$B16,'Equipment Options'!R:R)","v":0},{"$f":"SUMIF('Equipment Options'!N:N,'MeasureTotals Lookups'!$B16,'Equipment Options'!S:S)","v":0},null,null,null,null,null,null,17928,{"$f":"SUMIF('Equipment Options'!N:N,'MeasureTotals Lookups'!$B16,'Equipment Options'!T:T)","v":0},{"$f":"SUMIF('Equipment Options'!N:N,'MeasureTotals Lookups'!$B16,'Equipment Options'!U:U)","v":0},"Ozone Laundry System 401-600 Lbs Capacity - Gas WH Full Terr",0]
[null,"OZONSYS401600EWH",{"$f":"SUMIF('Equipment Options'!N:N,'MeasureTotals Lookups'!$B17,'Equipment Options'!O:O)","v":0},null,{"$f":"SUMIF('Equipment Options'!N:N,'MeasureTotals Lookups'!$B17,'Equipment Options'!V:V)","v":0},{"$f":"SUMIF('Equipment Options'!N:N,'MeasureTotals Lookups'!$B17,'Equipment Options'!R:R)","v":0},{"$f":"SUMIF('Equipment Options'!N:N,'MeasureTotals Lookups'!$B17,'Equipment Options'!S:S)","v":0},null,null,null,null,null,null,17929,{"$f":"SUMIF('Equipment Options'!N:N,'MeasureTotals Lookups'!$B17,'Equipment Options'!T:T)","v":0},{"$f":"SUMIF('Equipment Options'!N:N,'MeasureTotals Lookups'!$B17,'Equipment Options'!U:U)","v":0},"Ozone Laundry System 401-600 Lbs Capacity - Ele WH",0]
[null,"OZONSYS600GWHGOT",{"$f":"SUMIF('Equipment Options'!N:N,'MeasureTotals Lookups'!$B18,'Equipment Options'!O:O)","v":0},null,{"$f":"SUMIF('Equipment Options'!N:N,'MeasureTotals Lookups'!$B18,'Equipment Options'!V:V)","v":0},{"$f":"SUMIF('Equipment Options'!N:N,'MeasureTotals Lookups'!$B18,'Equipment Options'!R:R)","v":0},{"$f":"SUMIF('Equipment Options'!N:N,'MeasureTotals Lookups'!$B18,'Equipment Options'!S:S)","v":0},null,null,null,null,null,null,17930,{"$f":"SUMIF('Equipment Options'!N:N,'MeasureTotals Lookups'!$B18,'Equipment Options'!T:T)","v":0},{"$f":"SUMIF('Equipment Options'!N:N,'MeasureTotals Lookups'!$B18,'Equipment Options'!U:U)","v":0},"Ozone Laundry System > 600 Lbs Capacity - Gas WH GOT",0]
[null,"OZONSYS600GWHFULL",{"$f":"SUMIF('Equipment Options'!N:N,'MeasureTotals Lookups'!$B19,'Equipment Options'!O:O)","v":0},null,{"$f":"SUMIF('Equipment Options'!N:N,'MeasureTotals Lookups'!$B19,'Equipment Options'!V:V)","v":0},{"$f":"SUMIF('Equipment Options'!N:N,'MeasureTotals Lookups'!$B19,'Equipment Options'!R:R)","v":0},{"$f":"SUMIF('Equipment Options'!N:N,'MeasureTotals Lookups'!$B19,'Equipment Options'!S:S)","v":0},null,null,null,null,null,null,17931,{"$f":"SUMIF('Equipment Options'!N:N,'MeasureTotals Lookups'!$B19,'Equipment Options'!T:T)","v":0},{"$f":"SUMIF('Equipment Options'!N:N,'MeasureTotals Lookups'!$B19,'Equipment Options'!U:U)","v":0},"Ozone Laundry System > 600 Lbs Capacity - Gas WH Full Terr",0]
[null,"OZONSYS600EWH",{"$f":"SUMIF('Equipment Options'!N:N,'MeasureTotals Lookups'!$B20,'Equipment Options'!O:O)","v":0},null,{"$f":"SUMIF('Equipment Options'!N:N,'MeasureTotals Lookups'!$B20,'Equipment Options'!V:V)","v":0},{"$f":"SUMIF('Equipment Options'!N:N,'MeasureTotals Lookups'!$B20,'Equipment Options'!R:R)","v":0},{"$f":"SUMIF('Equipment Options'!N:N,'MeasureTotals Lookups'!$B20,'Equipment Options'!S:S)","v":0},null,null,null,null,null,null,17932,{"$f":"SUMIF('Equipment Options'!N:N,'MeasureTotals Lookups'!$B20,'Equipment Options'!T:T)","v":0},{"$f":"SUMIF('Equipment Options'!N:N,'MeasureTotals Lookups'!$B20,'Equipment Options'!U:U)","v":0},"Ozone Laundry System > 600 Lbs Capacity - Ele WH",0]
[null,"OZONSYS75GWHFULL",{"$f":"SUMIF('Equipment Options'!N:N,'MeasureTotals Lookups'!$B21,'Equipment Options'!O:O)","v":0},null,{"$f":"SUMIF('Equipment Options'!N:N,'MeasureTotals Lookups'!$B21,'Equipment Options'!V:V)","v":0},{"$f":"SUMIF('Equipment Options'!N:N,'MeasureTotals Lookups'!$B21,'Equipment Options'!R:R)","v":0},{"$f":"SUMIF('Equipment Options'!N:N,'MeasureTotals Lookups'!$B21,'Equipment Options'!S:S)","v":0},null,null,null,null,null,null,17933,{"$f":"SUMIF('Equipment Options'!N:N,'MeasureTotals Lookups'!$B21,'Equipment Options'!T:T)","v":0},{"$f":"SUMIF('Equipment Options'!N:N,'MeasureTotals Lookups'!$B21,'Equipment Options'!U:U)","v":0},"Ozone Laundry System < 75 Lbs Capacity - Gas WH Full Terr",0]
[null,"OZONSYS75EWH",{"$f":"SUMIF('Equipment Options'!N:N,'MeasureTotals Lookups'!$B22,'Equipment Options'!O:O)","v":0},null,{"$f":"SUMIF('Equipment Options'!N:N,'MeasureTotals Lookups'!$B22,'Equipment Options'!V:V)","v":0},{"$f":"SUMIF('Equipment Options'!N:N,'MeasureTotals Lookups'!$B22,'Equipment Options'!R:R)","v":0},{"$f":"SUMIF('Equipment Options'!N:N,'MeasureTotals Lookups'!$B22,'Equipment Options'!S:S)","v":0},null,null,null,null,null,null,17934,{"$f":"SUMIF('Equipment Options'!N:N,'MeasureTotals Lookups'!$B22,'Equipment Options'!T:T)","v":0},{"$f":"SUMIF('Equipment Options'!N:N,'MeasureTotals Lookups'!$B22,'Equipment Options'!U:U)","v":0},"Ozone Laundry System < 75 Lbs Capacity - Ele WH",0]
[null,"OZONSYS75125GWHGOT",{"$f":"SUMIF('Equipment Options'!N:N,'MeasureTotals Lookups'!$B23,'Equipment Options'!O:O)","v":0},null,{"$f":"SUMIF('Equipment Options'!N:N,'MeasureTotals Lookups'!$B23,'Equipment Options'!V:V)","v":0},{"$f":"SUMIF('Equipment Options'!N:N,'MeasureTotals Lookups'!$B23,'Equipment Options'!R:R)","v":0},{"$f":"SUMIF('Equipment Options'!N:N,'MeasureTotals Lookups'!$B23,'Equipment Options'!S:S)","v":0},null,null,null,null,null,null,17935,{"$f":"SUMIF('Equipment Options'!N:N,'MeasureTotals Lookups'!$B23,'Equipment Options'!T:T)","v":0},{"$f":"SUMIF('Equipment Options'!N:N,'MeasureTotals Lookups'!$B23,'Equipment Options'!U:U)","v":0},"Ozone Laundry System 75-125 Lbs Capacity - Gas WH GOT",0]
[null,"OZONSYS75125GWHFULL",{"$f":"SUMIF('Equipment Options'!N:N,'MeasureTotals Lookups'!$B24,'Equipment Options'!O:O)","v":0},null,{"$f":"SUMIF('Equipment Options'!N:N,'MeasureTotals Lookups'!$B24,'Equipment Options'!V:V)","v":0},{"$f":"SUMIF('Equipment Options'!N:N,'MeasureTotals Lookups'!$B24,'Equipment Options'!R:R)","v":0},{"$f":"SUMIF('Equipment Options'!N:N,'MeasureTotals Lookups'!$B24,'Equipment Options'!S:S)","v":0},null,null,null,null,null,null,17936,{"$f":"SUMIF('Equipment Options'!N:N,'MeasureTotals Lookups'!$B24,'Equipment Options'!T:T)","v":0},{"$f":"SUMIF('Equipment Options'!N:N,'MeasureTotals Lookups'!$B24,'Equipment Options'!U:U)","v":0},"Ozone Laundry System 75-125 Lbs Capacity - Gas WH Full Terr",0]
[null,"OZONSYS75125EWH",{"$f":"SUMIF('Equipment Options'!N:N,'MeasureTotals Lookups'!$B25,'Equipment Options'!O:O)","v":0},null,{"$f":"SUMIF('Equipment Options'!N:N,'MeasureTotals Lookups'!$B25,'Equipment Options'!V:V)","v":0},{"$f":"SUMIF('Equipment Options'!N:N,'MeasureTotals Lookups'!$B25,'Equipment Options'!R:R)","v":0},{"$f":"SUMIF('Equipment Options'!N:N,'MeasureTotals Lookups'!$B25,'Equipment Options'!S:S)","v":0},null,null,null,null,null,null,17937,{"$f":"SUMIF('Equipment Options'!N:N,'MeasureTotals Lookups'!$B25,'Equipment Options'!T:T)","v":0},{"$f":"SUMIF('Equipment Options'!N:N,'MeasureTotals Lookups'!$B25,'Equipment Options'!U:U)","v":0},"Ozone Laundry System 75-125 Lbs Capacity - Ele WH",0]
[null,"OZONSYS126400GWHGOT",{"$f":"SUMIF('Equipment Options'!N:N,'MeasureTotals Lookups'!$B26,'Equipment Options'!O:O)","v":0},null,{"$f":"SUMIF('Equipment Options'!N:N,'MeasureTotals Lookups'!$B26,'Equipment Options'!V:V)","v":0},{"$f":"SUMIF('Equipment Options'!N:N,'MeasureTotals Lookups'!$B26,'Equipment Options'!R:R)","v":0},{"$f":"SUMIF('Equipment Options'!N:N,'MeasureTotals Lookups'!$B26,'Equipment Options'!S:S)","v":0},null,null,null,null,null,null,17938,{"$f":"SUMIF('Equipment Options'!N:N,'MeasureTotals Lookups'!$B26,'Equipment Options'!T:T)","v":0},{"$f":"SUMIF('Equipment Options'!N:N,'MeasureTotals Lookups'!$B26,'Equipment Options'!U:U)","v":0},"Ozone Laundry System 126-400 Lbs Capacity - Gas WH GOT",0]
[null,"OZONSYS126400GWHFULL",{"$f":"SUMIF('Equipment Options'!N:N,'MeasureTotals Lookups'!$B27,'Equipment Options'!O:O)","v":0},null,{"$f":"SUMIF('Equipment Options'!N:N,'MeasureTotals Lookups'!$B27,'Equipment Options'!V:V)","v":0},{"$f":"SUMIF('Equipment Options'!N:N,'MeasureTotals Lookups'!$B27,'Equipment Options'!R:R)","v":0},{"$f":"SUMIF('Equipment Options'!N:N,'MeasureTotals Lookups'!$B27,'Equipment Options'!S:S)","v":0},null,null,null,null,null,null,17939,{"$f":"SUMIF('Equipment Options'!N:N,'MeasureTotals Lookups'!$B27,'Equipment Options'!T:T)","v":0},{"$f":"SUMIF('Equipment Options'!N:N,'MeasureTotals Lookups'!$B27,'Equipment Options'!U:U)","v":0},"Ozone Laundry System 126-400 Lbs Capacity - Gas WH Full Terr",0]
[null,"OZONSYS75GWHGOT",{"$f":"SUMIF('Equipment Options'!N:N,'MeasureTotals Lookups'!$B28,'Equipment Options'!O:O)","v":0},null,{"$f":"SUMIF('Equipment Options'!N:N,'MeasureTotals Lookups'!$B28,'Equipment Options'!V:V)","v":0},{"$f":"SUMIF('Equipment Options'!N:N,'MeasureTotals Lookups'!$B28,'Equipment Options'!R:R)","v":0},{"$f":"SUMIF('Equipment Options'!N:N,'MeasureTotals Lookups'!$B28,'Equipment Options'!S:S)","v":0},null,null,null,null,null,null,17947,{"$f":"SUMIF('Equipment Options'!N:N,'MeasureTotals Lookups'!$B28,'Equipment Options'!T:T)","v":0},{"$f":"SUMIF('Equipment Options'!N:N,'MeasureTotals Lookups'!$B28,'Equipment Options'!U:U)","v":0},"Ozone Laundry System < 75 Lbs Capacity - Gas WH GOT",0]
[null,"COMWASHEDRYGET",{"$f":"SUMIF('Equipment Options'!N:N,'MeasureTotals Lookups'!$B29,'Equipment Options'!O:O)","v":0},null,{"$f":"SUMIF('Equipment Options'!N:N,'MeasureTotals Lookups'!$B29,'Equipment Options'!V:V)","v":0},{"$f":"SUMIF('Equipment Options'!N:N,'MeasureTotals Lookups'!$B29,'Equipment Options'!R:R)","v":0},{"$f":"SUMIF('Equipment Options'!N:N,'MeasureTotals Lookups'!$B29,'Equipment Options'!S:S)","v":0},null,null,null,null,null,null,17948,{"$f":"SUMIF('Equipment Options'!N:N,'MeasureTotals Lookups'!$B29,'Equipment Options'!T:T)","v":0},{"$f":"SUMIF('Equipment Options'!N:N,'MeasureTotals Lookups'!$B29,'Equipment Options'!U:U)","v":0},"Commercial Washer Gas/Other Dryer Ele WH, Energy Star, EOT",0]
[null,"COMWASHGDRYEET",{"$f":"SUMIF('Equipment Options'!N:N,'MeasureTotals Lookups'!$B30,'Equipment Options'!O:O)","v":0},null,{"$f":"SUMIF('Equipment Options'!N:N,'MeasureTotals Lookups'!$B30,'Equipment Options'!V:V)","v":0},{"$f":"SUMIF('Equipment Options'!N:N,'MeasureTotals Lookups'!$B30,'Equipment Options'!R:R)","v":0},{"$f":"SUMIF('Equipment Options'!N:N,'MeasureTotals Lookups'!$B30,'Equipment Options'!S:S)","v":0},null,null,null,null,null,null,17949,{"$f":"SUMIF('Equipment Options'!N:N,'MeasureTotals Lookups'!$B30,'Equipment Options'!T:T)","v":0},{"$f":"SUMIF('Equipment Options'!N:N,'MeasureTotals Lookups'!$B30,'Equipment Options'!U:U)","v":0},"Commercial Washer Ele Dryer Gas/Other WH, Energy Star, EOT",0]
[null,"COMWASHEDRYGMFET",{"$f":"SUMIF('Equipment Options'!N:N,'MeasureTotals Lookups'!$B31,'Equipment Options'!O:O)","v":0},null,{"$f":"SUMIF('Equipment Options'!N:N,'MeasureTotals Lookups'!$B31,'Equipment Options'!V:V)","v":0},{"$f":"SUMIF('Equipment Options'!N:N,'MeasureTotals Lookups'!$B31,'Equipment Options'!R:R)","v":0},{"$f":"SUMIF('Equipment Options'!N:N,'MeasureTotals Lookups'!$B31,'Equipment Options'!S:S)","v":0},null,null,null,null,null,null,17950,{"$f":"SUMIF('Equipment Options'!N:N,'MeasureTotals Lookups'!$B31,'Equipment Options'!T:T)","v":0},{"$f":"SUMIF('Equipment Options'!N:N,'MeasureTotals Lookups'!$B31,'Equipment Options'!U:U)","v":0},"MF Commercial Washer Gas/Other Dryer Ele WH, Energy Star, EOT",0]
[null,"COMWASHGDRYEMFET",{"$f":"SUMIF('Equipment Options'!N:N,'MeasureTotals Lookups'!$B32,'Equipment Options'!O:O)","v":0},null,{"$f":"SUMIF('Equipment Options'!N:N,'MeasureTotals Lookups'!$B32,'Equipment Options'!V:V)","v":0},{"$f":"SUMIF('Equipment Options'!N:N,'MeasureTotals Lookups'!$B32,'Equipment Options'!R:R)","v":0},{"$f":"SUMIF('Equipment Options'!N:N,'MeasureTotals Lookups'!$B32,'Equipment Options'!S:S)","v":0},null,null,null,null,null,null,17951,{"$f":"SUMIF('Equipment Options'!N:N,'MeasureTotals Lookups'!$B32,'Equipment Options'!T:T)","v":0},{"$f":"SUMIF('Equipment Options'!N:N,'MeasureTotals Lookups'!$B32,'Equipment Options'!U:U)","v":0},"MF Commercial Washer Ele Dryer Gas/Other WH, Energy Star, EOT",0]
[null,"COMWASHGDRYGFT",{"$f":"SUMIF('Equipment Options'!N:N,'MeasureTotals Lookups'!$B33,'Equipment Options'!O:O)","v":0},null,{"$f":"SUMIF('Equipment Options'!N:N,'MeasureTotals Lookups'!$B33,'Equipment Options'!V:V)","v":0},{"$f":"SUMIF('Equipment Options'!N:N,'MeasureTotals Lookups'!$B33,'Equipment Options'!R:R)","v":0},{"$f":"SUMIF('Equipment Options'!N:N,'MeasureTotals Lookups'!$B33,'Equipment Options'!S:S)","v":0},null,null,null,null,null,null,17952,{"$f":"SUMIF('Equipment Options'!N:N,'MeasureTotals Lookups'!$B33,'Equipment Options'!T:T)","v":0},{"$f":"SUMIF('Equipment Options'!N:N,'MeasureTotals Lookups'!$B33,'Equipment Options'!U:U)","v":0},"Commercial Washer Gas Dryer Gas WH, Energy Star",0]
[null,"COMWASHEDRYGFT",{"$f":"SUMIF('Equipment Options'!N:N,'MeasureTotals Lookups'!$B34,'Equipment Options'!O:O)","v":0},null,{"$f":"SUMIF('Equipment Options'!N:N,'MeasureTotals Lookups'!$B34,'Equipment Options'!V:V)","v":0},{"$f":"SUMIF('Equipment Options'!N:N,'MeasureTotals Lookups'!$B34,'Equipment Options'!R:R)","v":0},{"$f":"SUMIF('Equipment Options'!N:N,'MeasureTotals Lookups'!$B34,'Equipment Options'!S:S)","v":0},null,null,null,null,null,null,17953,{"$f":"SUMIF('Equipment Options'!N:N,'MeasureTotals Lookups'!$B34,'Equipment Options'!T:T)","v":0},{"$f":"SUMIF('Equipment Options'!N:N,'MeasureTotals Lookups'!$B34,'Equipment Options'!U:U)","v":0},"Commercial Washer Gas Dryer Ele WH, Energy Star",0]
[null,"COMWASHGDRYEFT",{"$f":"SUMIF('Equipment Options'!N:N,'MeasureTotals Lookups'!$B35,'Equipment Options'!O:O)","v":0},null,{"$f":"SUMIF('Equipment Options'!N:N,'MeasureTotals Lookups'!$B35,'Equipment Options'!V:V)","v":0},{"$f":"SUMIF('Equipment Options'!N:N,'MeasureTotals Lookups'!$B35,'Equipment Options'!R:R)","v":0},{"$f":"SUMIF('Equipment Options'!N:N,'MeasureTotals Lookups'!$B35,'Equipment Options'!S:S)","v":0},null,null,null,null,null,null,17954,{"$f":"SUMIF('Equipment Options'!N:N,'MeasureTotals Lookups'!$B35,'Equipment Options'!T:T)","v":0},{"$f":"SUMIF('Equipment Options'!N:N,'MeasureTotals Lookups'!$B35,'Equipment Options'!U:U)","v":0},"Commercial Washer Ele Dryer Gas WH, Energy Star",0]
[null,"COMWASHEDRYEFT",{"$f":"SUMIF('Equipment Options'!N:N,'MeasureTotals Lookups'!$B36,'Equipment Options'!O:O)","v":0},null,{"$f":"SUMIF('Equipment Options'!N:N,'MeasureTotals Lookups'!$B36,'Equipment Options'!V:V)","v":0},{"$f":"SUMIF('Equipment Options'!N:N,'MeasureTotals Lookups'!$B36,'Equipment Options'!R:R)","v":0},{"$f":"SUMIF('Equipment Options'!N:N,'MeasureTotals Lookups'!$B36,'Equipment Options'!S:S)","v":0},null,null,null,null,null,null,{"$f":"_xlfn.XLOOKUP($B36,ProductCode,ProductVersionId,\"\",0)","v":17955},{"$f":"SUMIF('Equipment Options'!N:N,'MeasureTotals Lookups'!$B36,'Equipment Options'!T:T)","v":0},{"$f":"SUMIF('Equipment Options'!N:N,'MeasureTotals Lookups'!$B36,'Equipment Options'!U:U)","v":0},{"$f":"_xlfn.XLOOKUP($B36,ProductCode,ProductDescription,\"\",0)","v":"Commercial Washer Ele Dryer Ele WH, Energy Star"},0]
[null,"COMWASHGDRYGMFFT",{"$f":"SUMIF('Equipment Options'!N:N,'MeasureTotals Lookups'!$B37,'Equipment Options'!O:O)","v":0},null,{"$f":"SUMIF('Equipment Options'!N:N,'MeasureTotals Lookups'!$B37,'Equipment Options'!V:V)","v":0},{"$f":"SUMIF('Equipment Options'!N:N,'MeasureTotals Lookups'!$B37,'Equipment Options'!R:R)","v":0},{"$f":"SUMIF('Equipment Options'!N:N,'MeasureTotals Lookups'!$B37,'Equipment Options'!S:S)","v":0},null,null,null,null,null,null,17956,{"$f":"SUMIF('Equipment Options'!N:N,'MeasureTotals Lookups'!$B37,'Equipment Options'!T:T)","v":0},{"$f":"SUMIF('Equipment Options'!N:N,'MeasureTotals Lookups'!$B37,'Equipment Options'!U:U)","v":0},"MF Commercial Washer Gas Dryer Gas WH, Energy Star",0]
[null,"COMWASHEDRYGMFFT",{"$f":"SUMIF('Equipment Options'!N:N,'MeasureTotals Lookups'!$B38,'Equipment Options'!O:O)","v":0},null,{"$f":"SUMIF('Equipment Options'!N:N,'MeasureTotals Lookups'!$B38,'Equipment Options'!V:V)","v":0},{"$f":"SUMIF('Equipment Options'!N:N,'MeasureTotals Lookups'!$B38,'Equipment Options'!R:R)","v":0},{"$f":"SUMIF('Equipment Options'!N:N,'MeasureTotals Lookups'!$B38,'Equipment Options'!S:S)","v":0},null,null,null,null,null,null,17957,{"$f":"SUMIF('Equipment Options'!N:N,'MeasureTotals Lookups'!$B38,'Equipment Options'!T:T)","v":0},{"$f":"SUMIF('Equipment Options'!N:N,'MeasureTotals Lookups'!$B38,'Equipment Options'!U:U)","v":0},"MF Commercial Washer Gas Dryer Ele WH, Energy Star",0]
[null,"COMWASHGDRYEMFFT",{"$f":"SUMIF('Equipment Options'!N:N,'MeasureTotals Lookups'!$B39,'Equipment Options'!O:O)","v":0},null,{"$f":"SUMIF('Equipment Options'!N:N,'MeasureTotals Lookups'!$B39,'Equipment Options'!V:V)","v":0},{"$f":"SUMIF('Equipment Options'!N:N,'MeasureTotals Lookups'!$B39,'Equipment Options'!R:R)","v":0},{"$f":"SUMIF('Equipment Options'!N:N,'MeasureTotals Lookups'!$B39,'Equipment Options'!S:S)","v":0},null,null,null,null,null,null,17958,{"$f":"SUMIF('Equipment Options'!N:N,'MeasureTotals Lookups'!$B39,'Equipment Options'!T:T)","v":0},{"$f":"SUMIF('Equipment Options'!N:N,'MeasureTotals Lookups'!$B39,'Equipment Options'!U:U)","v":0},"MF Commercial Washer Ele Dryer Gas WH, Energy Star",0]
[null,"COMWASHEDRYEMFFT",{"$f":"SUMIF('Equipment Options'!N:N,'MeasureTotals Lookups'!$B40,'Equipment Options'!O:O)","v":0},null,{"$f":"SUMIF('Equipment Options'!N:N,'MeasureTotals Lookups'!$B40,'Equipment Options'!V:V)","v":0},{"$f":"SUMIF('Equipment Options'!N:N,'MeasureTotals Lookups'!$B40,'Equipment Options'!R:R)","v":0},{"$f":"SUMIF('Equipment Options'!N:N,'MeasureTotals Lookups'!$B40,'Equipment Options'!S:S)","v":0},null,null,null,null,null,null,17959,{"$f":"SUMIF('Equipment Options'!N:N,'MeasureTotals Lookups'!$B40,'Equipment Options'!T:T)","v":0},{"$f":"SUMIF('Equipment Options'!N:N,'MeasureTotals Lookups'!$B40,'Equipment Options'!U:U)","v":0},"MF Commercial Washer Ele Dryer Ele WH, Energy Star",0]
[null,"COMWASHGDRYGGT",{"$f":"SUMIF('Equipment Options'!N:N,'MeasureTotals Lookups'!$B41,'Equipment Options'!O:O)","v":0},null,{"$f":"SUMIF('Equipment Options'!N:N,'MeasureTotals Lookups'!$B41,'Equipment Options'!V:V)","v":0},{"$f":"SUMIF('Equipment Options'!N:N,'MeasureTotals Lookups'!$B41,'Equipment Options'!R:R)","v":0},{"$f":"SUMIF('Equipment Options'!N:N,'MeasureTotals Lookups'!$B41,'Equipment Options'!S:S)","v":0},null,null,null,null,null,null,17960,{"$f":"SUMIF('Equipment Options'!N:N,'MeasureTotals Lookups'!$B41,'Equipment Options'!T:T)","v":0},{"$f":"SUMIF('Equipment Options'!N:N,'MeasureTotals Lookups'!$B41,'Equipment Options'!U:U)","v":0},"Commercial Washer Gas Dryer Gas WH, Energy Star, GOT",0]
[null,"COMWASHEDRYGGT",{"$f":"SUMIF('Equipment Options'!N:N,'MeasureTotals Lookups'!$B42,'Equipment Options'!O:O)","v":0},null,{"$f":"SUMIF('Equipment Options'!N:N,'MeasureTotals Lookups'!$B42,'Equipment Options'!V:V)","v":0},{"$f":"SUMIF('Equipment Options'!N:N,'MeasureTotals Lookups'!$B42,'Equipment Options'!R:R)","v":0},{"$f":"SUMIF('Equipment Options'!N:N,'MeasureTotals Lookups'!$B42,'Equipment Options'!S:S)","v":0},null,null,null,null,null,null,17961,{"$f":"SUMIF('Equipment Options'!N:N,'MeasureTotals Lookups'!$B42,'Equipment Options'!T:T)","v":0},{"$f":"SUMIF('Equipment Options'!N:N,'MeasureTotals Lookups'!$B42,'Equipment Options'!U:U)","v":0},"Commercial Washer Gas Dryer Ele WH, Energy Star, GOT",0]
[null,"COMWASHGDRYEGT",{"$f":"SUMIF('Equipment Options'!N:N,'MeasureTotals Lookups'!$B43,'Equipment Options'!O:O)","v":0},null,{"$f":"SUMIF('Equipment Options'!N:N,'MeasureTotals Lookups'!$B43,'Equipment Options'!V:V)","v":0},{"$f":"SUMIF('Equipment Options'!N:N,'MeasureTotals Lookups'!$B43,'Equipment Options'!R:R)","v":0},{"$f":"SUMIF('Equipment Options'!N:N,'MeasureTotals Lookups'!$B43,'Equipment Options'!S:S)","v":0},null,null,null,null,null,null,17962,{"$f":"SUMIF('Equipment Options'!N:N,'MeasureTotals Lookups'!$B43,'Equipment Options'!T:T)","v":0},{"$f":"SUMIF('Equipment Options'!N:N,'MeasureTotals Lookups'!$B43,'Equipment Options'!U:U)","v":0},"Commercial Washer Ele Dryer Gas WH, Energy Star, GOT",0]
[null,"COMWASHGDRYGMFGT",{"$f":"SUMIF('Equipment Options'!N:N,'MeasureTotals Lookups'!$B44,'Equipment Options'!O:O)","v":0},null,{"$f":"SUMIF('Equipment Options'!N:N,'MeasureTotals Lookups'!$B44,'Equipment Options'!V:V)","v":0},{"$f":"SUMIF('Equipment Options'!N:N,'MeasureTotals Lookups'!$B44,'Equipment Options'!R:R)","v":0},{"$f":"SUMIF('Equipment Options'!N:N,'MeasureTotals Lookups'!$B44,'Equipment Options'!S:S)","v":0},null,null,null,null,null,null,17963,{"$f":"SUMIF('Equipment Options'!N:N,'MeasureTotals Lookups'!$B44,'Equipment Options'!T:T)","v":0},{"$f":"SUMIF('Equipment Options'!N:N,'MeasureTotals Lookups'!$B44,'Equipment Options'!U:U)","v":0},"MF Commercial Washer Gas Dryer Gas WH, Energy Star, GOT",0]
[null,"COMWASHEDRYGMFGT",{"$f":"SUMIF('Equipment Options'!N:N,'MeasureTotals Lookups'!$B45,'Equipment Options'!O:O)","v":0},null,{"$f":"SUMIF('Equipment Options'!N:N,'MeasureTotals Lookups'!$B45,'Equipment Options'!V:V)","v":0},{"$f":"SUMIF('Equipment Options'!N:N,'MeasureTotals Lookups'!$B45,'Equipment Options'!R:R)","v":0},{"$f":"SUMIF('Equipment Options'!N:N,'MeasureTotals Lookups'!$B45,'Equipment Options'!S:S)","v":0},null,null,null,null,null,null,17964,{"$f":"SUMIF('Equipment Options'!N:N,'MeasureTotals Lookups'!$B45,'Equipment Options'!T:T)","v":0},{"$f":"SUMIF('Equipment Options'!N:N,'MeasureTotals Lookups'!$B45,'Equipment Options'!U:U)","v":0},"MF Commercial Washer Gas Dryer Ele WH, Energy Star, GOT",0]
[null,"COMWASHGDRYEMFGT",{"$f":"SUMIF('Equipment Options'!N:N,'MeasureTotals Lookups'!$B46,'Equipment Options'!O:O)","v":0},null,{"$f":"SUMIF('Equipment Options'!N:N,'MeasureTotals Lookups'!$B46,'Equipment Options'!V:V)","v":0},{"$f":"SUMIF('Equipment Options'!N:N,'MeasureTotals Lookups'!$B46,'Equipment Options'!R:R)","v":0},{"$f":"SUMIF('Equipment Options'!N:N,'MeasureTotals Lookups'!$B46,'Equipment Options'!S:S)","v":0},null,null,null,null,null,null,17965,{"$f":"SUMIF('Equipment Options'!N:N,'MeasureTotals Lookups'!$B46,'Equipment Options'!T:T)","v":0},{"$f":"SUMIF('Equipment Options'!N:N,'MeasureTotals Lookups'!$B46,'Equipment Options'!U:U)","v":0},"MF Commercial Washer Ele Dryer Gas WH, Energy Star, GOT",0]
[null,"ICESCUBATCH",{"$f":"SUMIF('Equipment Options'!N:N,'MeasureTotals Lookups'!$B47,'Equipment Options'!O:O)","v":0},null,{"$f":"SUMIF('Equipment Options'!N:N,'MeasureTotals Lookups'!$B47,'Equipment Options'!V:V)","v":0},{"$f":"SUMIF('Equipment Options'!N:N,'MeasureTotals Lookups'!$B47,'Equipment Options'!R:R)","v":0},{"$f":"SUMIF('Equipment Options'!N:N,'MeasureTotals Lookups'!$B47,'Equipment Options'!S:S)","v":0},null,null,null,null,null,null,17966,{"$f":"SUMIF('Equipment Options'!N:N,'MeasureTotals Lookups'!$B47,'Equipment Options'!T:T)","v":0},{"$f":"SUMIF('Equipment Options'!N:N,'MeasureTotals Lookups'!$B47,'Equipment Options'!U:U)","v":0},"Commercial Ice Maker, Enrgy Str, Batch SCU, 200-4,000 lb/day",0]
[null,"ICERCUBATCH",{"$f":"SUMIF('Equipment Options'!N:N,'MeasureTotals Lookups'!$B48,'Equipment Options'!O:O)","v":0},null,{"$f":"SUMIF('Equipment Options'!N:N,'MeasureTotals Lookups'!$B48,'Equipment Options'!V:V)","v":0},{"$f":"SUMIF('Equipment Options'!N:N,'MeasureTotals Lookups'!$B48,'Equipment Options'!R:R)","v":0},{"$f":"SUMIF('Equipment Options'!N:N,'MeasureTotals Lookups'!$B48,'Equipment Options'!S:S)","v":0},null,null,null,null,null,null,17967,{"$f":"SUMIF('Equipment Options'!N:N,'MeasureTotals Lookups'!$B48,'Equipment Options'!T:T)","v":0},{"$f":"SUMIF('Equipment Options'!N:N,'MeasureTotals Lookups'!$B48,'Equipment Options'!U:U)","v":0},"Commercial Ice Maker, Enrgy Str, Batch RCU, 988-4,000 lb/day",0]
[null,"ICERCUCONT",{"$f":"SUMIF('Equipment Options'!N:N,'MeasureTotals Lookups'!$B49,'Equipment Options'!O:O)","v":0},null,{"$f":"SUMIF('Equipment Options'!N:N,'MeasureTotals Lookups'!$B49,'Equipment Options'!V:V)","v":0},{"$f":"SUMIF('Equipment Options'!N:N,'MeasureTotals Lookups'!$B49,'Equipment Options'!R:R)","v":0},{"$f":"SUMIF('Equipment Options'!N:N,'MeasureTotals Lookups'!$B49,'Equipment Options'!S:S)","v":0},null,null,null,null,null,null,17968,{"$f":"SUMIF('Equipment Options'!N:N,'MeasureTotals Lookups'!$B49,'Equipment Options'!T:T)","v":0},{"$f":"SUMIF('Equipment Options'!N:N,'MeasureTotals Lookups'!$B49,'Equipment Options'!U:U)","v":0},"Commercial Ice Maker, Enrgy Str, Cont RCU, 800-4,000 lb/day",0]
[null,"ICEIMHCONT",{"$f":"SUMIF('Equipment Options'!N:N,'MeasureTotals Lookups'!$B50,'Equipment Options'!O:O)","v":0},null,{"$f":"SUMIF('Equipment Options'!N:N,'MeasureTotals Lookups'!$B50,'Equipment Options'!V:V)","v":0},{"$f":"SUMIF('Equipment Options'!N:N,'MeasureTotals Lookups'!$B50,'Equipment Options'!R:R)","v":0},{"$f":"SUMIF('Equipment Options'!N:N,'MeasureTotals Lookups'!$B50,'Equipment Options'!S:S)","v":0},null,null,null,null,null,null,17969,{"$f":"SUMIF('Equipment Options'!N:N,'MeasureTotals Lookups'!$B50,'Equipment Options'!T:T)","v":0},{"$f":"SUMIF('Equipment Options'!N:N,'MeasureTotals Lookups'!$B50,'Equipment Options'!U:U)","v":0},"Commercial Ice Maker, Enrgy Str, Cont IMH, 820-4,000 lb/day",0]
[null,"ICEIMHBATCH",{"$f":"SUMIF('Equipment Options'!N:N,'MeasureTotals Lookups'!$B51,'Equipment Options'!O:O)","v":0},null,{"$f":"SUMIF('Equipment Options'!N:N,'MeasureTotals Lookups'!$B51,'Equipment Options'!V:V)","v":0},{"$f":"SUMIF('Equipment Options'!N:N,'MeasureTotals Lookups'!$B51,'Equipment Options'!R:R)","v":0},{"$f":"SUMIF('Equipment Options'!N:N,'MeasureTotals Lookups'!$B51,'Equipment Options'!S:S)","v":0},null,null,null,null,null,null,17970,{"$f":"SUMIF('Equipment Options'!N:N,'MeasureTotals Lookups'!$B51,'Equipment Options'!T:T)","v":0},{"$f":"SUMIF('Equipment Options'!N:N,'MeasureTotals Lookups'!$B51,'Equipment Options'!U:U)","v":0},"Commercial Ice Maker, Energy Star, Batch IMH, 1,500-4,000 lb/day",0]
[null,"HOTCABINETHALF",{"$f":"SUMIF('Equipment Options'!N:N,'MeasureTotals Lookups'!$B52,'Equipment Options'!O:O)","v":0},null,{"$f":"SUMIF('Equipment Options'!N:N,'MeasureTotals Lookups'!$B52,'Equipment Options'!V:V)","v":0},{"$f":"SUMIF('Equipment Options'!N:N,'MeasureTotals Lookups'!$B52,'Equipment Options'!R:R)","v":0},{"$f":"SUMIF('Equipment Options'!N:N,'MeasureTotals Lookups'!$B52,'Equipment Options'!S:S)","v":0},null,null,null,null,null,null,13300,{"$f":"SUMIF('Equipment Options'!N:N,'MeasureTotals Lookups'!$B52,'Equipment Options'!T:T)","v":0},{"$f":"SUMIF('Equipment Options'!N:N,'MeasureTotals Lookups'!$B52,'Equipment Options'!U:U)","v":0},"Electric Hot Food Holding Cabinet, Half Size",0]
[null,"ELESTEAM",{"$f":"SUMIF('Equipment Options'!N:N,'MeasureTotals Lookups'!$B53,'Equipment Options'!O:O)","v":0},null,{"$f":"SUMIF('Equipment Options'!N:N,'MeasureTotals Lookups'!$B53,'Equipment Options'!V:V)","v":0},{"$f":"SUMIF('Equipment Options'!N:N,'MeasureTotals Lookups'!$B53,'Equipment Options'!R:R)","v":0},{"$f":"SUMIF('Equipment Options'!N:N,'MeasureTotals Lookups'!$B53,'Equipment Options'!S:S)","v":0},null,null,null,null,null,null,13309,{"$f":"SUMIF('Equipment Options'!N:N,'MeasureTotals Lookups'!$B53,'Equipment Options'!T:T)","v":0},{"$f":"SUMIF('Equipment Options'!N:N,'MeasureTotals Lookups'!$B53,'Equipment Options'!U:U)","v":0},"Electric Steam Cooker",0]
[null,"ELECONVOVES3FULL",{"$f":"SUMIF('Equipment Options'!N:N,'MeasureTotals Lookups'!$B54,'Equipment Options'!O:O)","v":0},null,{"$f":"SUMIF('Equipment Options'!N:N,'MeasureTotals Lookups'!$B54,'Equipment Options'!V:V)","v":0},{"$f":"SUMIF('Equipment Options'!N:N,'MeasureTotals Lookups'!$B54,'Equipment Options'!R:R)","v":0},{"$f":"SUMIF('Equipment Options'!N:N,'MeasureTotals Lookups'!$B54,'Equipment Options'!S:S)","v":0},null,null,null,null,null,null,16354,{"$f":"SUMIF('Equipment Options'!N:N,'MeasureTotals Lookups'!$B54,'Equipment Options'!T:T)","v":0},{"$f":"SUMIF('Equipment Options'!N:N,'MeasureTotals Lookups'!$B54,'Equipment Options'!U:U)","v":0},"Electric Convection Oven - Full Size - Energy Star 3.0",0]
[null,"ELECONVOVES3HALF",{"$f":"SUMIF('Equipment Options'!N:N,'MeasureTotals Lookups'!$B55,'Equipment Options'!O:O)","v":0},null,{"$f":"SUMIF('Equipment Options'!N:N,'MeasureTotals Lookups'!$B55,'Equipment Options'!V:V)","v":0},{"$f":"SUMIF('Equipment Options'!N:N,'MeasureTotals Lookups'!$B55,'Equipment Options'!R:R)","v":0},{"$f":"SUMIF('Equipment Options'!N:N,'MeasureTotals Lookups'!$B55,'Equipment Options'!S:S)","v":0},null,null,null,null,null,null,16355,{"$f":"SUMIF('Equipment Options'!N:N,'MeasureTotals Lookups'!$B55,'Equipment Options'!T:T)","v":0},{"$f":"SUMIF('Equipment Options'!N:N,'MeasureTotals Lookups'!$B55,'Equipment Options'!U:U)","v":0},"Electric Convection Oven - Half Size - Energy Star 3.0",0]
[null,"COMBOOVES334PANELE",{"$f":"SUMIF('Equipment Options'!N:N,'MeasureTotals Lookups'!$B56,'Equipment Options'!O:O)","v":0},null,{"$f":"SUMIF('Equipment Options'!N:N,'MeasureTotals Lookups'!$B56,'Equipment Options'!V:V)","v":0},{"$f":"SUMIF('Equipment Options'!N:N,'MeasureTotals Lookups'!$B56,'Equipment Options'!R:R)","v":0},{"$f":"SUMIF('Equipment Options'!N:N,'MeasureTotals Lookups'!$B56,'Equipment Options'!S:S)","v":0},null,null,null,null,null,null,16759,{"$f":"SUMIF('Equipment Options'!N:N,'MeasureTotals Lookups'!$B56,'Equipment Options'!T:T)","v":0},{"$f":"SUMIF('Equipment Options'!N:N,'MeasureTotals Lookups'!$B56,'Equipment Options'!U:U)","v":0},"Electric Combination Ovens 3-4 Pan Capacity ESTAR 3.0",0]
[null,"COMBOOVES3540PANELE",{"$f":"SUMIF('Equipment Options'!N:N,'MeasureTotals Lookups'!$B57,'Equipment Options'!O:O)","v":0},null,{"$f":"SUMIF('Equipment Options'!N:N,'MeasureTotals Lookups'!$B57,'Equipment Options'!V:V)","v":0},{"$f":"SUMIF('Equipment Options'!N:N,'MeasureTotals Lookups'!$B57,'Equipment Options'!R:R)","v":0},{"$f":"SUMIF('Equipment Options'!N:N,'MeasureTotals Lookups'!$B57,'Equipment Options'!S:S)","v":0},null,null,null,null,null,null,16760,{"$f":"SUMIF('Equipment Options'!N:N,'MeasureTotals Lookups'!$B57,'Equipment Options'!T:T)","v":0},{"$f":"SUMIF('Equipment Options'!N:N,'MeasureTotals Lookups'!$B57,'Equipment Options'!U:U)","v":0},"Electric Combination Ovens 5-40 Pan Capacity ESTAR 3.0",0]
[null,"RACKOVENDOUB",{"$f":"SUMIF('Equipment Options'!N:N,'MeasureTotals Lookups'!$B58,'Equipment Options'!O:O)","v":0},null,{"$f":"SUMIF('Equipment Options'!N:N,'MeasureTotals Lookups'!$B58,'Equipment Options'!V:V)","v":0},{"$f":"SUMIF('Equipment Options'!N:N,'MeasureTotals Lookups'!$B58,'Equipment Options'!R:R)","v":0},{"$f":"SUMIF('Equipment Options'!N:N,'MeasureTotals Lookups'!$B58,'Equipment Options'!S:S)","v":0},null,null,null,null,null,null,18152,{"$f":"SUMIF('Equipment Options'!N:N,'MeasureTotals Lookups'!$B58,'Equipment Options'!T:T)","v":0},{"$f":"SUMIF('Equipment Options'!N:N,'MeasureTotals Lookups'!$B58,'Equipment Options'!U:U)","v":0},"Rack Oven - Double Rack",0]
[null,"GASSTEAMCOOK",{"$f":"SUMIF('Equipment Options'!N:N,'MeasureTotals Lookups'!$B59,'Equipment Options'!O:O)","v":0},null,{"$f":"SUMIF('Equipment Options'!N:N,'MeasureTotals Lookups'!$B59,'Equipment Options'!V:V)","v":0},{"$f":"SUMIF('Equipment Options'!N:N,'MeasureTotals Lookups'!$B59,'Equipment Options'!R:R)","v":0},{"$f":"SUMIF('Equipment Options'!N:N,'MeasureTotals Lookups'!$B59,'Equipment Options'!S:S)","v":0},null,null,null,null,null,null,18181,{"$f":"SUMIF('Equipment Options'!N:N,'MeasureTotals Lookups'!$B59,'Equipment Options'!T:T)","v":0},{"$f":"SUMIF('Equipment Options'!N:N,'MeasureTotals Lookups'!$B59,'Equipment Options'!U:U)","v":0},"Gas Steam Cooker",0]
[null,"BROILER2026E",{"$f":"SUMIF('Equipment Options'!N:N,'MeasureTotals Lookups'!$B60,'Equipment Options'!O:O)","v":0},null,{"$f":"SUMIF('Equipment Options'!N:N,'MeasureTotals Lookups'!$B60,'Equipment Options'!V:V)","v":0},{"$f":"SUMIF('Equipment Options'!N:N,'MeasureTotals Lookups'!$B60,'Equipment Options'!R:R)","v":0},{"$f":"SUMIF('Equipment Options'!N:N,'MeasureTotals Lookups'!$B60,'Equipment Options'!S:S)","v":0},null,null,null,null,null,null,18182,{"$f":"SUMIF('Equipment Options'!N:N,'MeasureTotals Lookups'!$B60,'Equipment Options'!T:T)","v":0},{"$f":"SUMIF('Equipment Options'!N:N,'MeasureTotals Lookups'!$B60,'Equipment Options'!U:U)","v":0},"Gas-fired Conveyor Broilers 20-26\", Elec Only Territory",0]
[null,"BROILER20E",{"$f":"SUMIF('Equipment Options'!N:N,'MeasureTotals Lookups'!$B61,'Equipment Options'!O:O)","v":0},null,{"$f":"SUMIF('Equipment Options'!N:N,'MeasureTotals Lookups'!$B61,'Equipment Options'!V:V)","v":0},{"$f":"SUMIF('Equipment Options'!N:N,'MeasureTotals Lookups'!$B61,'Equipment Options'!R:R)","v":0},{"$f":"SUMIF('Equipment Options'!N:N,'MeasureTotals Lookups'!$B61,'Equipment Options'!S:S)","v":0},null,null,null,null,null,null,18183,{"$f":"SUMIF('Equipment Options'!N:N,'MeasureTotals Lookups'!$B61,'Equipment Options'!T:T)","v":0},{"$f":"SUMIF('Equipment Options'!N:N,'MeasureTotals Lookups'!$B61,'Equipment Options'!U:U)","v":0},"Gas-fired Conveyor Broilers <20\", Elec Only Territory",0]
[null,"BROILER26F",{"$f":"SUMIF('Equipment Options'!N:N,'MeasureTotals Lookups'!$B62,'Equipment Options'!O:O)","v":0},null,{"$f":"SUMIF('Equipment Options'!N:N,'MeasureTotals Lookups'!$B62,'Equipment Options'!V:V)","v":0},{"$f":"SUMIF('Equipment Options'!N:N,'MeasureTotals Lookups'!$B62,'Equipment Options'!R:R)","v":0},{"$f":"SUMIF('Equipment Options'!N:N,'MeasureTotals Lookups'!$B62,'Equipment Options'!S:S)","v":0},null,null,null,null,null,null,18184,{"$f":"SUMIF('Equipment Options'!N:N,'MeasureTotals Lookups'!$B62,'Equipment Options'!T:T)","v":0},{"$f":"SUMIF('Equipment Options'!N:N,'MeasureTotals Lookups'!$B62,'Equipment Options'!U:U)","v":0},"Gas-fired Conveyor Broilers >26\", Full Territory",0]
[null,"BROILER2026F",{"$f":"SUMIF('Equipment Options'!N:N,'MeasureTotals Lookups'!$B63,'Equipment Options'!O:O)","v":0},null,{"$f":"SUMIF('Equipment Options'!N:N,'MeasureTotals Lookups'!$B63,'Equipment Options'!V:V)","v":0},{"$f":"SUMIF('Equipment Options'!N:N,'MeasureTotals Lookups'!$B63,'Equipment Options'!R:R)","v":0},{"$f":"SUMIF('Equipment Options'!N:N,'MeasureTotals Lookups'!$B63,'Equipment Options'!S:S)","v":0},null,null,null,null,null,null,18185,{"$f":"SUMIF('Equipment Options'!N:N,'MeasureTotals Lookups'!$B63,'Equipment Options'!T:T)","v":0},{"$f":"SUMIF('Equipment Options'!N:N,'MeasureTotals Lookups'!$B63,'Equipment Options'!U:U)","v":0},"Gas-fired Conveyor Broilers, 20-26\", Full Territory",0]
[null,"BROILER20F",{"$f":"SUMIF('Equipment Options'!N:N,'MeasureTotals Lookups'!$B64,'Equipment Options'!O:O)","v":0},null,{"$f":"SUMIF('Equipment Options'!N:N,'MeasureTotals Lookups'!$B64,'Equipment Options'!V:V)","v":0},{"$f":"SUMIF('Equipment Options'!N:N,'MeasureTotals Lookups'!$B64,'Equipment Options'!R:R)","v":0},{"$f":"SUMIF('Equipment Options'!N:N,'MeasureTotals Lookups'!$B64,'Equipment Options'!S:S)","v":0},null,null,null,null,null,null,18186,{"$f":"SUMIF('Equipment Options'!N:N,'MeasureTotals Lookups'!$B64,'Equipment Options'!T:T)","v":0},{"$f":"SUMIF('Equipment Options'!N:N,'MeasureTotals Lookups'!$B64,'Equipment Options'!U:U)","v":0},"Gas-fired Conveyor Broilers <20\", Full Territory",0]
[null,"BROILER26GO",{"$f":"SUMIF('Equipment Options'!N:N,'MeasureTotals Lookups'!$B65,'Equipment Options'!O:O)","v":0},null,{"$f":"SUMIF('Equipment Options'!N:N,'MeasureTotals Lookups'!$B65,'Equipment Options'!V:V)","v":0},{"$f":"SUMIF('Equipment Options'!N:N,'MeasureTotals Lookups'!$B65,'Equipment Options'!R:R)","v":0},{"$f":"SUMIF('Equipment Options'!N:N,'MeasureTotals Lookups'!$B65,'Equipment Options'!S:S)","v":0},null,null,null,null,null,null,18187,{"$f":"SUMIF('Equipment Options'!N:N,'MeasureTotals Lookups'!$B65,'Equipment Options'!T:T)","v":0},{"$f":"SUMIF('Equipment Options'!N:N,'MeasureTotals Lookups'!$B65,'Equipment Options'!U:U)","v":0},"Gas-fired Conveyor Broilers >26\", Gas Only Territory",0]
[null,"BROILER2026GO",{"$f":"SUMIF('Equipment Options'!N:N,'MeasureTotals Lookups'!$B66,'Equipment Options'!O:O)","v":0},null,{"$f":"SUMIF('Equipment Options'!N:N,'MeasureTotals Lookups'!$B66,'Equipment Options'!V:V)","v":0},{"$f":"SUMIF('Equipment Options'!N:N,'MeasureTotals Lookups'!$B66,'Equipment Options'!R:R)","v":0},{"$f":"SUMIF('Equipment Options'!N:N,'MeasureTotals Lookups'!$B66,'Equipment Options'!S:S)","v":0},null,null,null,null,null,null,18188,{"$f":"SUMIF('Equipment Options'!N:N,'MeasureTotals Lookups'!$B66,'Equipment Options'!T:T)","v":0},{"$f":"SUMIF('Equipment Options'!N:N,'MeasureTotals Lookups'!$B66,'Equipment Options'!U:U)","v":0},"Gas-fired Conveyor Broilers 20-26\", Gas Only Territory",0]
[null,"BROILER20GO",{"$f":"SUMIF('Equipment Options'!N:N,'MeasureTotals Lookups'!$B67,'Equipment Options'!O:O)","v":0},null,{"$f":"SUMIF('Equipment Options'!N:N,'MeasureTotals Lookups'!$B67,'Equipment Options'!V:V)","v":0},{"$f":"SUMIF('Equipment Options'!N:N,'MeasureTotals Lookups'!$B67,'Equipment Options'!R:R)","v":0},{"$f":"SUMIF('Equipment Options'!N:N,'MeasureTotals Lookups'!$B67,'Equipment Options'!S:S)","v":0},null,null,null,null,null,null,18189,{"$f":"SUMIF('Equipment Options'!N:N,'MeasureTotals Lookups'!$B67,'Equipment Options'!T:T)","v":0},{"$f":"SUMIF('Equipment Options'!N:N,'MeasureTotals Lookups'!$B67,'Equipment Options'!U:U)","v":0},"Gas-fired Conveyor Broilers <20\", Gas Only Territory",0]
[null,"BROILER26E",{"$f":"SUMIF('Equipment Options'!N:N,'MeasureTotals Lookups'!$B68,'Equipment Options'!O:O)","v":0},null,{"$f":"SUMIF('Equipment Options'!N:N,'MeasureTotals Lookups'!$B68,'Equipment Options'!V:V)","v":0},{"$f":"SUMIF('Equipment Options'!N:N,'MeasureTotals Lookups'!$B68,'Equipment Options'!R:R)","v":0},{"$f":"SUMIF('Equipment Options'!N:N,'MeasureTotals Lookups'!$B68,'Equipment Options'!S:S)","v":0},null,null,null,null,null,null,{"$f":"_xlfn.XLOOKUP($B68,ProductCode,ProductVersionId,\"\",0)","v":18213},{"$f":"SUMIF('Equipment Options'!N:N,'MeasureTotals Lookups'!$B68,'Equipment Options'!T:T)","v":0},{"$f":"SUMIF('Equipment Options'!N:N,'MeasureTotals Lookups'!$B68,'Equipment Options'!U:U)","v":0},{"$f":"_xlfn.XLOOKUP($B68,ProductCode,ProductDescription,\"\",0)","v":"Gas-fired Conveyor Broilers >26\", Elec Only Territory"},{"$f":"(_xlfn.XLOOKUP($B68,ProductCode,IncrementalCost,\"\",0))*C68","v":0}]
[null,"ESTARFRIDGE",{"$f":"SUMIF('Equipment Options'!N:N,'MeasureTotals Lookups'!$B69,'Equipment Options'!O:O)","v":0},null,{"$f":"SUMIF('Equipment Options'!N:N,'MeasureTotals Lookups'!$B69,'Equipment Options'!V:V)","v":0},{"$f":"SUMIF('Equipment Options'!N:N,'MeasureTotals Lookups'!$B69,'Equipment Options'!R:R)","v":0},{"$f":"SUMIF('Equipment Options'!N:N,'MeasureTotals Lookups'!$B69,'Equipment Options'!S:S)","v":0},null,null,null,null,null,null,17915,{"$f":"SUMIF('Equipment Options'!N:N,'MeasureTotals Lookups'!$B69,'Equipment Options'!T:T)","v":0},{"$f":"SUMIF('Equipment Options'!N:N,'MeasureTotals Lookups'!$B69,'Equipment Options'!U:U)","v":0},"Multifamily Refrigerator",0]
[null,"ESMEFRIDGE",{"$f":"SUMIF('Equipment Options'!N:N,'MeasureTotals Lookups'!$B70,'Equipment Options'!O:O)","v":0},null,{"$f":"SUMIF('Equipment Options'!N:N,'MeasureTotals Lookups'!$B70,'Equipment Options'!V:V)","v":0},{"$f":"SUMIF('Equipment Options'!N:N,'MeasureTotals Lookups'!$B70,'Equipment Options'!R:R)","v":0},{"$f":"SUMIF('Equipment Options'!N:N,'MeasureTotals Lookups'!$B70,'Equipment Options'!S:S)","v":0},null,null,null,null,null,null,17916,{"$f":"SUMIF('Equipment Options'!N:N,'MeasureTotals Lookups'!$B70,'Equipment Options'!T:T)","v":0},{"$f":"SUMIF('Equipment Options'!N:N,'MeasureTotals Lookups'!$B70,'Equipment Options'!U:U)","v":0},"Energy Star Most Efficient (ESME) Multifamily Refrigerator",0]
[null,"ESETAFRIDGE",{"$f":"SUMIF('Equipment Options'!N:N,'MeasureTotals Lookups'!$B71,'Equipment Options'!O:O)","v":0},null,{"$f":"SUMIF('Equipment Options'!N:N,'MeasureTotals Lookups'!$B71,'Equipment Options'!V:V)","v":0},{"$f":"SUMIF('Equipment Options'!N:N,'MeasureTotals Lookups'!$B71,'Equipment Options'!R:R)","v":0},{"$f":"SUMIF('Equipment Options'!N:N,'MeasureTotals Lookups'!$B71,'Equipment Options'!S:S)","v":0},null,null,null,null,null,null,17987,{"$f":"SUMIF('Equipment Options'!N:N,'MeasureTotals Lookups'!$B71,'Equipment Options'!T:T)","v":0},{"$f":"SUMIF('Equipment Options'!N:N,'MeasureTotals Lookups'!$B71,'Equipment Options'!U:U)","v":0},"Energy Star Emerging Tech Award (ESETA) Multifamily Refrigerator",0]
[null,"RADHEATNONMOD",{"$f":"SUMIF('Equipment Options'!N:N,'MeasureTotals Lookups'!$B72,'Equipment Options'!O:O)","v":0},null,{"$f":"SUMIF('Equipment Options'!N:N,'MeasureTotals Lookups'!$B72,'Equipment Options'!V:V)","v":0},{"$f":"SUMIF('Equipment Options'!N:N,'MeasureTotals Lookups'!$B72,'Equipment Options'!R:R)","v":0},{"$f":"SUMIF('Equipment Options'!N:N,'MeasureTotals Lookups'!$B72,'Equipment Options'!S:S)","v":0},null,null,null,null,null,null,13851,{"$f":"SUMIF('Equipment Options'!N:N,'MeasureTotals Lookups'!$B72,'Equipment Options'!T:T)","v":0},{"$f":"SUMIF('Equipment Options'!N:N,'MeasureTotals Lookups'!$B72,'Equipment Options'!U:U)","v":0},"Infrared Radiant Heaters, non-modulating",0]
[null,"RADHEATMODGO",{"$f":"SUMIF('Equipment Options'!N:N,'MeasureTotals Lookups'!$B73,'Equipment Options'!O:O)","v":0},null,{"$f":"SUMIF('Equipment Options'!N:N,'MeasureTotals Lookups'!$B73,'Equipment Options'!V:V)","v":0},{"$f":"SUMIF('Equipment Options'!N:N,'MeasureTotals Lookups'!$B73,'Equipment Options'!R:R)","v":0},{"$f":"SUMIF('Equipment Options'!N:N,'MeasureTotals Lookups'!$B73,'Equipment Options'!S:S)","v":0},null,null,null,null,null,null,13852,{"$f":"SUMIF('Equipment Options'!N:N,'MeasureTotals Lookups'!$B73,'Equipment Options'!T:T)","v":0},{"$f":"SUMIF('Equipment Options'!N:N,'MeasureTotals Lookups'!$B73,'Equipment Options'!U:U)","v":0},"Infrared Radiant Heaters, Modulating, Gas Only",0]
[null,"RADHEATMOD",{"$f":"SUMIF('Equipment Options'!N:N,'MeasureTotals Lookups'!$B74,'Equipment Options'!O:O)","v":0},null,{"$f":"SUMIF('Equipment Options'!N:N,'MeasureTotals Lookups'!$B74,'Equipment Options'!V:V)","v":0},{"$f":"SUMIF('Equipment Options'!N:N,'MeasureTotals Lookups'!$B74,'Equipment Options'!R:R)","v":0},{"$f":"SUMIF('Equipment Options'!N:N,'MeasureTotals Lookups'!$B74,'Equipment Options'!S:S)","v":0},null,null,null,null,null,null,13890,{"$f":"SUMIF('Equipment Options'!N:N,'MeasureTotals Lookups'!$B74,'Equipment Options'!T:T)","v":0},{"$f":"SUMIF('Equipment Options'!N:N,'MeasureTotals Lookups'!$B74,'Equipment Options'!U:U)","v":0},"Infrared Radiant Heaters, Modulating",0]
[null,"RADHEATNONMODGO",{"$f":"SUMIF('Equipment Options'!N:N,'MeasureTotals Lookups'!$B75,'Equipment Options'!O:O)","v":0},null,{"$f":"SUMIF('Equipment Options'!N:N,'MeasureTotals Lookups'!$B75,'Equipment Options'!V:V)","v":0},{"$f":"SUMIF('Equipment Options'!N:N,'MeasureTotals Lookups'!$B75,'Equipment Options'!R:R)","v":0},{"$f":"SUMIF('Equipment Options'!N:N,'MeasureTotals Lookups'!$B75,'Equipment Options'!S:S)","v":0},null,null,null,null,null,null,13891,{"$f":"SUMIF('Equipment Options'!N:N,'MeasureTotals Lookups'!$B75,'Equipment Options'!T:T)","v":0},{"$f":"SUMIF('Equipment Options'!N:N,'MeasureTotals Lookups'!$B75,'Equipment Options'!U:U)","v":0},"Infrared Radiant Heaters, Non-Modulating, Gas Only",0]
[null,"LCGASGOT",{"$f":"SUMIF('Equipment Options'!N:N,'MeasureTotals Lookups'!$B76,'Equipment Options'!O:O)","v":0},null,{"$f":"SUMIF('Equipment Options'!N:N,'MeasureTotals Lookups'!$B76,'Equipment Options'!V:V)","v":0},{"$f":"SUMIF('Equipment Options'!N:N,'MeasureTotals Lookups'!$B76,'Equipment Options'!R:R)","v":0},{"$f":"SUMIF('Equipment Options'!N:N,'MeasureTotals Lookups'!$B76,'Equipment Options'!S:S)","v":0},null,null,null,null,null,null,14202,{"$f":"SUMIF('Equipment Options'!N:N,'MeasureTotals Lookups'!$B76,'Equipment Options'!T:T)","v":0},{"$f":"SUMIF('Equipment Options'!N:N,'MeasureTotals Lookups'!$B76,'Equipment Options'!U:U)","v":0},"MF Laundry Center, In-Unit, Gas DHW, GOT",0]
[null,"LCGAS",{"$f":"SUMIF('Equipment Options'!N:N,'MeasureTotals Lookups'!$B77,'Equipment Options'!O:O)","v":0},null,{"$f":"SUMIF('Equipment Options'!N:N,'MeasureTotals Lookups'!$B77,'Equipment Options'!V:V)","v":0},{"$f":"SUMIF('Equipment Options'!N:N,'MeasureTotals Lookups'!$B77,'Equipment Options'!R:R)","v":0},{"$f":"SUMIF('Equipment Options'!N:N,'MeasureTotals Lookups'!$B77,'Equipment Options'!S:S)","v":0},null,null,null,null,null,null,14203,{"$f":"SUMIF('Equipment Options'!N:N,'MeasureTotals Lookups'!$B77,'Equipment Options'!T:T)","v":0},{"$f":"SUMIF('Equipment Options'!N:N,'MeasureTotals Lookups'!$B77,'Equipment Options'!U:U)","v":0},"MF Laundry Center, In-Unit, Gas DHW",0]
[null,"LCELEEOT",{"$f":"SUMIF('Equipment Options'!N:N,'MeasureTotals Lookups'!$B78,'Equipment Options'!O:O)","v":0},null,{"$f":"SUMIF('Equipment Options'!N:N,'MeasureTotals Lookups'!$B78,'Equipment Options'!V:V)","v":0},{"$f":"SUMIF('Equipment Options'!N:N,'MeasureTotals Lookups'!$B78,'Equipment Options'!R:R)","v":0},{"$f":"SUMIF('Equipment Options'!N:N,'MeasureTotals Lookups'!$B78,'Equipment Options'!S:S)","v":0},null,null,null,null,null,null,14204,{"$f":"SUMIF('Equipment Options'!N:N,'MeasureTotals Lookups'!$B78,'Equipment Options'!T:T)","v":0},{"$f":"SUMIF('Equipment Options'!N:N,'MeasureTotals Lookups'!$B78,'Equipment Options'!U:U)","v":0},"MF Laundry Center, In-Unit, Electric DHW, EOT",0]
[null,"LCELE",{"$f":"SUMIF('Equipment Options'!N:N,'MeasureTotals Lookups'!$B79,'Equipment Options'!O:O)","v":0},null,{"$f":"SUMIF('Equipment Options'!N:N,'MeasureTotals Lookups'!$B79,'Equipment Options'!V:V)","v":0},{"$f":"SUMIF('Equipment Options'!N:N,'MeasureTotals Lookups'!$B79,'Equipment Options'!R:R)","v":0},{"$f":"SUMIF('Equipment Options'!N:N,'MeasureTotals Lookups'!$B79,'Equipment Options'!S:S)","v":0},null,null,null,null,null,null,14205,{"$f":"SUMIF('Equipment Options'!N:N,'MeasureTotals Lookups'!$B79,'Equipment Options'!T:T)","v":0},{"$f":"SUMIF('Equipment Options'!N:N,'MeasureTotals Lookups'!$B79,'Equipment Options'!U:U)","v":0},"MF Laundry Center, In-Unit, Electric DHW",0]
[null,"WASHGASFLGOT",{"$f":"SUMIF('Equipment Options'!N:N,'MeasureTotals Lookups'!$B80,'Equipment Options'!O:O)","v":0},null,{"$f":"SUMIF('Equipment Options'!N:N,'MeasureTotals Lookups'!$B80,'Equipment Options'!V:V)","v":0},{"$f":"SUMIF('Equipment Options'!N:N,'MeasureTotals Lookups'!$B80,'Equipment Options'!R:R)","v":0},{"$f":"SUMIF('Equipment Options'!N:N,'MeasureTotals Lookups'!$B80,'Equipment Options'!S:S)","v":0},null,null,null,null,null,null,14206,{"$f":"SUMIF('Equipment Options'!N:N,'MeasureTotals Lookups'!$B80,'Equipment Options'!T:T)","v":0},{"$f":"SUMIF('Equipment Options'!N:N,'MeasureTotals Lookups'!$B80,'Equipment Options'!U:U)","v":0},"MF Clothes Washer, In-Unit, Gas DHW, GOT",0]
[null,"WASHELEFLEOT",{"$f":"SUMIF('Equipment Options'!N:N,'MeasureTotals Lookups'!$B81,'Equipment Options'!O:O)","v":0},null,{"$f":"SUMIF('Equipment Options'!N:N,'MeasureTotals Lookups'!$B81,'Equipment Options'!V:V)","v":0},{"$f":"SUMIF('Equipment Options'!N:N,'MeasureTotals Lookups'!$B81,'Equipment Options'!R:R)","v":0},{"$f":"SUMIF('Equipment Options'!N:N,'MeasureTotals Lookups'!$B81,'Equipment Options'!S:S)","v":0},null,null,null,null,null,null,14207,{"$f":"SUMIF('Equipment Options'!N:N,'MeasureTotals Lookups'!$B81,'Equipment Options'!T:T)","v":0},{"$f":"SUMIF('Equipment Options'!N:N,'MeasureTotals Lookups'!$B81,'Equipment Options'!U:U)","v":0},"MF Clothes Washer, In-Unit, Electric DHW, EOT",0]
[null,"WASHELEFL",{"$f":"SUMIF('Equipment Options'!N:N,'MeasureTotals Lookups'!$B82,'Equipment Options'!O:O)","v":0},null,{"$f":"SUMIF('Equipment Options'!N:N,'MeasureTotals Lookups'!$B82,'Equipment Options'!V:V)","v":0},{"$f":"SUMIF('Equipment Options'!N:N,'MeasureTotals Lookups'!$B82,'Equipment Options'!R:R)","v":0},{"$f":"SUMIF('Equipment Options'!N:N,'MeasureTotals Lookups'!$B82,'Equipment Options'!S:S)","v":0},null,null,null,null,null,null,14208,{"$f":"SUMIF('Equipment Options'!N:N,'MeasureTotals Lookups'!$B82,'Equipment Options'!T:T)","v":0},{"$f":"SUMIF('Equipment Options'!N:N,'MeasureTotals Lookups'!$B82,'Equipment Options'!U:U)","v":0},"MF Clothes Washer, In-Unit, Electric DHW",0]
[null,"WASHGASFL",{"$f":"SUMIF('Equipment Options'!N:N,'MeasureTotals Lookups'!$B83,'Equipment Options'!O:O)","v":0},null,{"$f":"SUMIF('Equipment Options'!N:N,'MeasureTotals Lookups'!$B83,'Equipment Options'!V:V)","v":0},{"$f":"SUMIF('Equipment Options'!N:N,'MeasureTotals Lookups'!$B83,'Equipment Options'!R:R)","v":0},{"$f":"SUMIF('Equipment Options'!N:N,'MeasureTotals Lookups'!$B83,'Equipment Options'!S:S)","v":0},null,null,null,null,null,null,14230,{"$f":"SUMIF('Equipment Options'!N:N,'MeasureTotals Lookups'!$B83,'Equipment Options'!T:T)","v":0},{"$f":"SUMIF('Equipment Options'!N:N,'MeasureTotals Lookups'!$B83,'Equipment Options'!U:U)","v":0},"MF Clothes Washer, In-Unit, Gas DHW",0]
[null,"FRIGRCHVRT015GEOT",{"$f":"SUMIF('Equipment Options'!N:N,'MeasureTotals Lookups'!$B84,'Equipment Options'!O:O)","v":0},null,{"$f":"SUMIF('Equipment Options'!N:N,'MeasureTotals Lookups'!$B84,'Equipment Options'!V:V)","v":0},{"$f":"SUMIF('Equipment Options'!N:N,'MeasureTotals Lookups'!$B84,'Equipment Options'!R:R)","v":0},{"$f":"SUMIF('Equipment Options'!N:N,'MeasureTotals Lookups'!$B84,'Equipment Options'!S:S)","v":0},null,null,null,null,null,null,18040,{"$f":"SUMIF('Equipment Options'!N:N,'MeasureTotals Lookups'!$B84,'Equipment Options'!T:T)","v":0},{"$f":"SUMIF('Equipment Options'!N:N,'MeasureTotals Lookups'!$B84,'Equipment Options'!U:U)","v":0},"Vertical Reach-in Refrigerator, <15, Gas Heat, EOT",0]
[null,"FRIGRCHVRT015HP",{"$f":"SUMIF('Equipment Options'!N:N,'MeasureTotals Lookups'!$B85,'Equipment Options'!O:O)","v":0},null,{"$f":"SUMIF('Equipment Options'!N:N,'MeasureTotals Lookups'!$B85,'Equipment Options'!V:V)","v":0},{"$f":"SUMIF('Equipment Options'!N:N,'MeasureTotals Lookups'!$B85,'Equipment Options'!R:R)","v":0},{"$f":"SUMIF('Equipment Options'!N:N,'MeasureTotals Lookups'!$B85,'Equipment Options'!S:S)","v":0},null,null,null,null,null,null,18041,{"$f":"SUMIF('Equipment Options'!N:N,'MeasureTotals Lookups'!$B85,'Equipment Options'!T:T)","v":0},{"$f":"SUMIF('Equipment Options'!N:N,'MeasureTotals Lookups'!$B85,'Equipment Options'!U:U)","v":0},"Vertical Reach-in Refrigerator, <15, Heat Pump",0]
[null,"FRIGRCHVRT015GAS",{"$f":"SUMIF('Equipment Options'!N:N,'MeasureTotals Lookups'!$B86,'Equipment Options'!O:O)","v":0},null,{"$f":"SUMIF('Equipment Options'!N:N,'MeasureTotals Lookups'!$B86,'Equipment Options'!V:V)","v":0},{"$f":"SUMIF('Equipment Options'!N:N,'MeasureTotals Lookups'!$B86,'Equipment Options'!R:R)","v":0},{"$f":"SUMIF('Equipment Options'!N:N,'MeasureTotals Lookups'!$B86,'Equipment Options'!S:S)","v":0},null,null,null,null,null,null,18065,{"$f":"SUMIF('Equipment Options'!N:N,'MeasureTotals Lookups'!$B86,'Equipment Options'!T:T)","v":0},{"$f":"SUMIF('Equipment Options'!N:N,'MeasureTotals Lookups'!$B86,'Equipment Options'!U:U)","v":0},"Vertical Reach-in Refrigerator, <15, Gas Heat",0]
[null,"FRIGRCHVRT015ELE",{"$f":"SUMIF('Equipment Options'!N:N,'MeasureTotals Lookups'!$B87,'Equipment Options'!O:O)","v":0},null,{"$f":"SUMIF('Equipment Options'!N:N,'MeasureTotals Lookups'!$B87,'Equipment Options'!V:V)","v":0},{"$f":"SUMIF('Equipment Options'!N:N,'MeasureTotals Lookups'!$B87,'Equipment Options'!R:R)","v":0},{"$f":"SUMIF('Equipment Options'!N:N,'MeasureTotals Lookups'!$B87,'Equipment Options'!S:S)","v":0},null,null,null,null,null,null,18066,{"$f":"SUMIF('Equipment Options'!N:N,'MeasureTotals Lookups'!$B87,'Equipment Options'!T:T)","v":0},{"$f":"SUMIF('Equipment Options'!N:N,'MeasureTotals Lookups'!$B87,'Equipment Options'!U:U)","v":0},"Vertical Reach-in Refrigerator, <15, Electric ",0]
[null,"FREZRCHVRT1530HP",{"$f":"SUMIF('Equipment Options'!N:N,'MeasureTotals Lookups'!$B88,'Equipment Options'!O:O)","v":0},null,{"$f":"SUMIF('Equipment Options'!N:N,'MeasureTotals Lookups'!$B88,'Equipment Options'!V:V)","v":0},{"$f":"SUMIF('Equipment Options'!N:N,'MeasureTotals Lookups'!$B88,'Equipment Options'!R:R)","v":0},{"$f":"SUMIF('Equipment Options'!N:N,'MeasureTotals Lookups'!$B88,'Equipment Options'!S:S)","v":0},null,null,null,null,null,null,18067,{"$f":"SUMIF('Equipment Options'!N:N,'MeasureTotals Lookups'!$B88,'Equipment Options'!T:T)","v":0},{"$f":"SUMIF('Equipment Options'!N:N,'MeasureTotals Lookups'!$B88,'Equipment Options'!U:U)","v":0},"Vertical Reach-in Freezer, 15 to <30, Heat Pump",0]
[null,"FREZRCHVRT1530GAS",{"$f":"SUMIF('Equipment Options'!N:N,'MeasureTotals Lookups'!$B89,'Equipment Options'!O:O)","v":0},null,{"$f":"SUMIF('Equipment Options'!N:N,'MeasureTotals Lookups'!$B89,'Equipment Options'!V:V)","v":0},{"$f":"SUMIF('Equipment Options'!N:N,'MeasureTotals Lookups'!$B89,'Equipment Options'!R:R)","v":0},{"$f":"SUMIF('Equipment Options'!N:N,'MeasureTotals Lookups'!$B89,'Equipment Options'!S:S)","v":0},null,null,null,null,null,null,18068,{"$f":"SUMIF('Equipment Options'!N:N,'MeasureTotals Lookups'!$B89,'Equipment Options'!T:T)","v":0},{"$f":"SUMIF('Equipment Options'!N:N,'MeasureTotals Lookups'!$B89,'Equipment Options'!U:U)","v":0},"Vertical Reach-in Freezer, 15 to <30, Gas Heat",0]
[null,"FREZRCHVRT1530GEOT",{"$f":"SUMIF('Equipment Options'!N:N,'MeasureTotals Lookups'!$B90,'Equipment Options'!O:O)","v":0},null,{"$f":"SUMIF('Equipment Options'!N:N,'MeasureTotals Lookups'!$B90,'Equipment Options'!V:V)","v":0},{"$f":"SUMIF('Equipment Options'!N:N,'MeasureTotals Lookups'!$B90,'Equipment Options'!R:R)","v":0},{"$f":"SUMIF('Equipment Options'!N:N,'MeasureTotals Lookups'!$B90,'Equipment Options'!S:S)","v":0},null,null,null,null,null,null,18069,{"$f":"SUMIF('Equipment Options'!N:N,'MeasureTotals Lookups'!$B90,'Equipment Options'!T:T)","v":0},{"$f":"SUMIF('Equipment Options'!N:N,'MeasureTotals Lookups'!$B90,'Equipment Options'!U:U)","v":0},"Vertical Reach-in Freezer, 15 to <30, Gas Heat, EOT",0]
[null,"FREZRCHVRT1530ELE",{"$f":"SUMIF('Equipment Options'!N:N,'MeasureTotals Lookups'!$B91,'Equipment Options'!O:O)","v":0},null,{"$f":"SUMIF('Equipment Options'!N:N,'MeasureTotals Lookups'!$B91,'Equipment Options'!V:V)","v":0},{"$f":"SUMIF('Equipment Options'!N:N,'MeasureTotals Lookups'!$B91,'Equipment Options'!R:R)","v":0},{"$f":"SUMIF('Equipment Options'!N:N,'MeasureTotals Lookups'!$B91,'Equipment Options'!S:S)","v":0},null,null,null,null,null,null,18078,{"$f":"SUMIF('Equipment Options'!N:N,'MeasureTotals Lookups'!$B91,'Equipment Options'!T:T)","v":0},{"$f":"SUMIF('Equipment Options'!N:N,'MeasureTotals Lookups'!$B91,'Equipment Options'!U:U)","v":0},"Vertical Reach-in Freezer, 15 to <30, Electric ",0]
[null,"FREZRCHVRT50HP",{"$f":"SUMIF('Equipment Options'!N:N,'MeasureTotals Lookups'!$B92,'Equipment Options'!O:O)","v":0},null,{"$f":"SUMIF('Equipment Options'!N:N,'MeasureTotals Lookups'!$B92,'Equipment Options'!V:V)","v":0},{"$f":"SUMIF('Equipment Options'!N:N,'MeasureTotals Lookups'!$B92,'Equipment Options'!R:R)","v":0},{"$f":"SUMIF('Equipment Options'!N:N,'MeasureTotals Lookups'!$B92,'Equipment Options'!S:S)","v":0},null,null,null,null,null,null,18079,{"$f":"SUMIF('Equipment Options'!N:N,'MeasureTotals Lookups'!$B92,'Equipment Options'!T:T)","v":0},{"$f":"SUMIF('Equipment Options'!N:N,'MeasureTotals Lookups'!$B92,'Equipment Options'!U:U)","v":0},"Vertical Reach-in Freezer, >50, Heat Pump",0]
[null,"FREZRCHVRT50GAS",{"$f":"SUMIF('Equipment Options'!N:N,'MeasureTotals Lookups'!$B93,'Equipment Options'!O:O)","v":0},null,{"$f":"SUMIF('Equipment Options'!N:N,'MeasureTotals Lookups'!$B93,'Equipment Options'!V:V)","v":0},{"$f":"SUMIF('Equipment Options'!N:N,'MeasureTotals Lookups'!$B93,'Equipment Options'!R:R)","v":0},{"$f":"SUMIF('Equipment Options'!N:N,'MeasureTotals Lookups'!$B93,'Equipment Options'!S:S)","v":0},null,null,null,null,null,null,18080,{"$f":"SUMIF('Equipment Options'!N:N,'MeasureTotals Lookups'!$B93,'Equipment Options'!T:T)","v":0},{"$f":"SUMIF('Equipment Options'!N:N,'MeasureTotals Lookups'!$B93,'Equipment Options'!U:U)","v":0},"Vertical Reach-in Freezer, >50, Gas Heat",0]
[null,"FREZRCHVRT50ELE",{"$f":"SUMIF('Equipment Options'!N:N,'MeasureTotals Lookups'!$B94,'Equipment Options'!O:O)","v":0},null,{"$f":"SUMIF('Equipment Options'!N:N,'MeasureTotals Lookups'!$B94,'Equipment Options'!V:V)","v":0},{"$f":"SUMIF('Equipment Options'!N:N,'MeasureTotals Lookups'!$B94,'Equipment Options'!R:R)","v":0},{"$f":"SUMIF('Equipment Options'!N:N,'MeasureTotals Lookups'!$B94,'Equipment Options'!S:S)","v":0},null,null,null,null,null,null,18081,{"$f":"SUMIF('Equipment Options'!N:N,'MeasureTotals Lookups'!$B94,'Equipment Options'!T:T)","v":0},{"$f":"SUMIF('Equipment Options'!N:N,'MeasureTotals Lookups'!$B94,'Equipment Options'!U:U)","v":0},"Vertical Reach-in Freezer, >50, Electric ",0]
[null,"FREZRCHVRT50GEOT",{"$f":"SUMIF('Equipment Options'!N:N,'MeasureTotals Lookups'!$B95,'Equipment Options'!O:O)","v":0},null,{"$f":"SUMIF('Equipment Options'!N:N,'MeasureTotals Lookups'!$B95,'Equipment Options'!V:V)","v":0},{"$f":"SUMIF('Equipment Options'!N:N,'MeasureTotals Lookups'!$B95,'Equipment Options'!R:R)","v":0},{"$f":"SUMIF('Equipment Options'!N:N,'MeasureTotals Lookups'!$B95,'Equipment Options'!S:S)","v":0},null,null,null,null,null,null,18091,{"$f":"SUMIF('Equipment Options'!N:N,'MeasureTotals Lookups'!$B95,'Equipment Options'!T:T)","v":0},{"$f":"SUMIF('Equipment Options'!N:N,'MeasureTotals Lookups'!$B95,'Equipment Options'!U:U)","v":0},"Vertical Reach-in Freezer, >50, Gas Heat, EOT",0]
[null,"FREZRCHVRT3050HP",{"$f":"SUMIF('Equipment Options'!N:N,'MeasureTotals Lookups'!$B96,'Equipment Options'!O:O)","v":0},null,{"$f":"SUMIF('Equipment Options'!N:N,'MeasureTotals Lookups'!$B96,'Equipment Options'!V:V)","v":0},{"$f":"SUMIF('Equipment Options'!N:N,'MeasureTotals Lookups'!$B96,'Equipment Options'!R:R)","v":0},{"$f":"SUMIF('Equipment Options'!N:N,'MeasureTotals Lookups'!$B96,'Equipment Options'!S:S)","v":0},null,null,null,null,null,null,18092,{"$f":"SUMIF('Equipment Options'!N:N,'MeasureTotals Lookups'!$B96,'Equipment Options'!T:T)","v":0},{"$f":"SUMIF('Equipment Options'!N:N,'MeasureTotals Lookups'!$B96,'Equipment Options'!U:U)","v":0},"Vertical Reach-in Freezer, 30 to <50, Heat Pump",0]
[null,"FREZRCHVRT3050GEOT",{"$f":"SUMIF('Equipment Options'!N:N,'MeasureTotals Lookups'!$B97,'Equipment Options'!O:O)","v":0},null,{"$f":"SUMIF('Equipment Options'!N:N,'MeasureTotals Lookups'!$B97,'Equipment Options'!V:V)","v":0},{"$f":"SUMIF('Equipment Options'!N:N,'MeasureTotals Lookups'!$B97,'Equipment Options'!R:R)","v":0},{"$f":"SUMIF('Equipment Options'!N:N,'MeasureTotals Lookups'!$B97,'Equipment Options'!S:S)","v":0},null,null,null,null,null,null,18093,{"$f":"SUMIF('Equipment Options'!N:N,'MeasureTotals Lookups'!$B97,'Equipment Options'!T:T)","v":0},{"$f":"SUMIF('Equipment Options'!N:N,'MeasureTotals Lookups'!$B97,'Equipment Options'!U:U)","v":0},"Vertical Reach-in Freezer, 30 to <50, Gas Heat, EOT",0]
[null,"FREZRCHVRT3050GAS",{"$f":"SUMIF('Equipment Options'!N:N,'MeasureTotals Lookups'!$B98,'Equipment Options'!O:O)","v":0},null,{"$f":"SUMIF('Equipment Options'!N:N,'MeasureTotals Lookups'!$B98,'Equipment Options'!V:V)","v":0},{"$f":"SUMIF('Equipment Options'!N:N,'MeasureTotals Lookups'!$B98,'Equipment Options'!R:R)","v":0},{"$f":"SUMIF('Equipment Options'!N:N,'MeasureTotals Lookups'!$B98,'Equipment Options'!S:S)","v":0},null,null,null,null,null,null,18094,{"$f":"SUMIF('Equipment Options'!N:N,'MeasureTotals Lookups'!$B98,'Equipment Options'!T:T)","v":0},{"$f":"SUMIF('Equipment Options'!N:N,'MeasureTotals Lookups'!$B98,'Equipment Options'!U:U)","v":0},"Vertical Reach-in Freezer, 30 to <50, Gas Heat",0]
[null,"FREZRCHVRT3050ELE",{"$f":"SUMIF('Equipment Options'!N:N,'MeasureTotals Lookups'!$B99,'Equipment Options'!O:O)","v":0},null,{"$f":"SUMIF('Equipment Options'!N:N,'MeasureTotals Lookups'!$B99,'Equipment Options'!V:V)","v":0},{"$f":"SUMIF('Equipment Options'!N:N,'MeasureTotals Lookups'!$B99,'Equipment Options'!R:R)","v":0},{"$f":"SUMIF('Equipment Options'!N:N,'MeasureTotals Lookups'!$B99,'Equipment Options'!S:S)","v":0},null,null,null,null,null,null,18095,{"$f":"SUMIF('Equipment Options'!N:N,'MeasureTotals Lookups'!$B99,'Equipment Options'!T:T)","v":0},{"$f":"SUMIF('Equipment Options'!N:N,'MeasureTotals Lookups'!$B99,'Equipment Options'!U:U)","v":0},"Vertical Reach-in Freezer, 30 to <50, Electric ",0]
[null,"FREZRCHVRT015HP",{"$f":"SUMIF('Equipment Options'!N:N,'MeasureTotals Lookups'!$B100,'Equipment Options'!O:O)","v":0},null,{"$f":"SUMIF('Equipment Options'!N:N,'MeasureTotals Lookups'!$B100,'Equipment Options'!V:V)","v":0},{"$f":"SUMIF('Equipment Options'!N:N,'MeasureTotals Lookups'!$B100,'Equipment Options'!R:R)","v":0},{"$f":"SUMIF('Equipment Options'!N:N,'MeasureTotals Lookups'!$B100,'Equipment Options'!S:S)","v":0},null,null,null,null,null,null,{"$f":"_xlfn.XLOOKUP($B100,ProductCode,ProductVersionId,\"\",0)","v":18096},{"$f":"SUMIF('Equipment Options'!N:N,'MeasureTotals Lookups'!$B100,'Equipment Options'!T:T)","v":0},{"$f":"SUMIF('Equipment Options'!N:N,'MeasureTotals Lookups'!$B100,'Equipment Options'!U:U)","v":0},{"$f":"_xlfn.XLOOKUP($B100,ProductCode,ProductDescription,\"\",0)","v":"Vertical Reach-in Freezer, <15, Heat Pump"},0]
[null,"FREZRCHVRT015GEOT",{"$f":"SUMIF('Equipment Options'!N:N,'MeasureTotals Lookups'!$B101,'Equipment Options'!O:O)","v":0},null,{"$f":"SUMIF('Equipment Options'!N:N,'MeasureTotals Lookups'!$B101,'Equipment Options'!V:V)","v":0},{"$f":"SUMIF('Equipment Options'!N:N,'MeasureTotals Lookups'!$B101,'Equipment Options'!R:R)","v":0},{"$f":"SUMIF('Equipment Options'!N:N,'MeasureTotals Lookups'!$B101,'Equipment Options'!S:S)","v":0},null,null,null,null,null,null,18097,{"$f":"SUMIF('Equipment Options'!N:N,'MeasureTotals Lookups'!$B101,'Equipment Options'!T:T)","v":0},{"$f":"SUMIF('Equipment Options'!N:N,'MeasureTotals Lookups'!$B101,'Equipment Options'!U:U)","v":0},"Vertical Reach-in Freezer, <15, Gas Heat, EOT",0]
[null,"FREZRCHVRT015GAS",{"$f":"SUMIF('Equipment Options'!N:N,'MeasureTotals Lookups'!$B102,'Equipment Options'!O:O)","v":0},null,{"$f":"SUMIF('Equipment Options'!N:N,'MeasureTotals Lookups'!$B102,'Equipment Options'!V:V)","v":0},{"$f":"SUMIF('Equipment Options'!N:N,'MeasureTotals Lookups'!$B102,'Equipment Options'!R:R)","v":0},{"$f":"SUMIF('Equipment Options'!N:N,'MeasureTotals Lookups'!$B102,'Equipment Options'!S:S)","v":0},null,null,null,null,null,null,18098,{"$f":"SUMIF('Equipment Options'!N:N,'MeasureTotals Lookups'!$B102,'Equipment Options'!T:T)","v":0},{"$f":"SUMIF('Equipment Options'!N:N,'MeasureTotals Lookups'!$B102,'Equipment Options'!U:U)","v":0},"Vertical Reach-in Freezer, <15, Gas Heat",0]
[null,"FREZRCHVRT015ELE",{"$f":"SUMIF('Equipment Options'!N:N,'MeasureTotals Lookups'!$B103,'Equipment Options'!O:O)","v":0},null,{"$f":"SUMIF('Equipment Options'!N:N,'MeasureTotals Lookups'!$B103,'Equipment Options'!V:V)","v":0},{"$f":"SUMIF('Equipment Options'!N:N,'MeasureTotals Lookups'!$B103,'Equipment Options'!R:R)","v":0},{"$f":"SUMIF('Equipment Options'!N:N,'MeasureTotals Lookups'!$B103,'Equipment Options'!S:S)","v":0},null,null,null,null,null,null,18099,{"$f":"SUMIF('Equipment Options'!N:N,'MeasureTotals Lookups'!$B103,'Equipment Options'!T:T)","v":0},{"$f":"SUMIF('Equipment Options'!N:N,'MeasureTotals Lookups'!$B103,'Equipment Options'!U:U)","v":0},"Vertical Reach-in Freezer, <15, Electric ",0]
[null,"DHPMFNOBASE",{"$f":"SUMIF('Equipment Options'!N:N,'MeasureTotals Lookups'!$B104,'Equipment Options'!O:O)","v":0},null,{"$f":"SUMIF('Equipment Options'!N:N,'MeasureTotals Lookups'!$B104,'Equipment Options'!V:V)","v":0},{"$f":"SUMIF('Equipment Options'!N:N,'MeasureTotals Lookups'!$B104,'Equipment Options'!R:R)","v":0},{"$f":"SUMIF('Equipment Options'!N:N,'MeasureTotals Lookups'!$B104,'Equipment Options'!S:S)","v":0},null,null,null,null,null,null,18153,{"$f":"SUMIF('Equipment Options'!N:N,'MeasureTotals Lookups'!$B104,'Equipment Options'!T:T)","v":0},{"$f":"SUMIF('Equipment Options'!N:N,'MeasureTotals Lookups'!$B104,'Equipment Options'!U:U)","v":0},"Ductless heat pump, Multifamily, w/o Baseboard Heating",0]
[null,"DHPLODNOBASE",{"$f":"SUMIF('Equipment Options'!N:N,'MeasureTotals Lookups'!$B105,'Equipment Options'!O:O)","v":0},null,{"$f":"SUMIF('Equipment Options'!N:N,'MeasureTotals Lookups'!$B105,'Equipment Options'!V:V)","v":0},{"$f":"SUMIF('Equipment Options'!N:N,'MeasureTotals Lookups'!$B105,'Equipment Options'!R:R)","v":0},{"$f":"SUMIF('Equipment Options'!N:N,'MeasureTotals Lookups'!$B105,'Equipment Options'!S:S)","v":0},null,null,null,null,null,null,18154,{"$f":"SUMIF('Equipment Options'!N:N,'MeasureTotals Lookups'!$B105,'Equipment Options'!T:T)","v":0},{"$f":"SUMIF('Equipment Options'!N:N,'MeasureTotals Lookups'!$B105,'Equipment Options'!U:U)","v":0},"Ductless heat pump, Lodging, w/o Baseboard Heating",0]
[null,"DHPDORMNOBASE",{"$f":"SUMIF('Equipment Options'!N:N,'MeasureTotals Lookups'!$B106,'Equipment Options'!O:O)","v":0},null,{"$f":"SUMIF('Equipment Options'!N:N,'MeasureTotals Lookups'!$B106,'Equipment Options'!V:V)","v":0},{"$f":"SUMIF('Equipment Options'!N:N,'MeasureTotals Lookups'!$B106,'Equipment Options'!R:R)","v":0},{"$f":"SUMIF('Equipment Options'!N:N,'MeasureTotals Lookups'!$B106,'Equipment Options'!S:S)","v":0},null,null,null,null,null,null,18155,{"$f":"SUMIF('Equipment Options'!N:N,'MeasureTotals Lookups'!$B106,'Equipment Options'!T:T)","v":0},{"$f":"SUMIF('Equipment Options'!N:N,'MeasureTotals Lookups'!$B106,'Equipment Options'!U:U)","v":0},"Ductless heat pump, Dorm, w/o Baseboard Heating",0]
[null,"DHPMFBASE",{"$f":"SUMIF('Equipment Options'!N:N,'MeasureTotals Lookups'!$B107,'Equipment Options'!O:O)","v":0},null,{"$f":"SUMIF('Equipment Options'!N:N,'MeasureTotals Lookups'!$B107,'Equipment Options'!V:V)","v":0},{"$f":"SUMIF('Equipment Options'!N:N,'MeasureTotals Lookups'!$B107,'Equipment Options'!R:R)","v":0},{"$f":"SUMIF('Equipment Options'!N:N,'MeasureTotals Lookups'!$B107,'Equipment Options'!S:S)","v":0},null,null,null,null,null,null,18156,{"$f":"SUMIF('Equipment Options'!N:N,'MeasureTotals Lookups'!$B107,'Equipment Options'!T:T)","v":0},{"$f":"SUMIF('Equipment Options'!N:N,'MeasureTotals Lookups'!$B107,'Equipment Options'!U:U)","v":0},"Ductless heat pump, Multifamily, w/ Baseboard Heating",0]
[null,"DHPLODBASE",{"$f":"SUMIF('Equipment Options'!N:N,'MeasureTotals Lookups'!$B108,'Equipment Options'!O:O)","v":0},null,{"$f":"SUMIF('Equipment Options'!N:N,'MeasureTotals Lookups'!$B108,'Equipment Options'!V:V)","v":0},{"$f":"SUMIF('Equipment Options'!N:N,'MeasureTotals Lookups'!$B108,'Equipment Options'!R:R)","v":0},{"$f":"SUMIF('Equipment Options'!N:N,'MeasureTotals Lookups'!$B108,'Equipment Options'!S:S)","v":0},null,null,null,null,null,null,18157,{"$f":"SUMIF('Equipment Options'!N:N,'MeasureTotals Lookups'!$B108,'Equipment Options'!T:T)","v":0},{"$f":"SUMIF('Equipment Options'!N:N,'MeasureTotals Lookups'!$B108,'Equipment Options'!U:U)","v":0},"Ductless heat pump, Lodging, w/ Baseboard Heating",0]
[null,"DHPDORMBASE",{"$f":"SUMIF('Equipment Options'!N:N,'MeasureTotals Lookups'!$B109,'Equipment Options'!O:O)","v":0},null,{"$f":"SUMIF('Equipment Options'!N:N,'MeasureTotals Lookups'!$B109,'Equipment Options'!V:V)","v":0},{"$f":"SUMIF('Equipment Options'!N:N,'MeasureTotals Lookups'!$B109,'Equipment Options'!R:R)","v":0},{"$f":"SUMIF('Equipment Options'!N:N,'MeasureTotals Lookups'!$B109,'Equipment Options'!S:S)","v":0},null,null,null,null,null,null,18158,{"$f":"SUMIF('Equipment Options'!N:N,'MeasureTotals Lookups'!$B109,'Equipment Options'!T:T)","v":0},{"$f":"SUMIF('Equipment Options'!N:N,'MeasureTotals Lookups'!$B109,'Equipment Options'!U:U)","v":0},"Ductless heat pump, Dorm, w/ Baseboard Heating",0]
[null,"RTUCTRLVSFHPH",{"$f":"SUMIF('Equipment Options'!N:N,'MeasureTotals Lookups'!$B110,'Equipment Options'!O:O)","v":0},null,{"$f":"SUMIF('Equipment Options'!N:N,'MeasureTotals Lookups'!$B110,'Equipment Options'!V:V)","v":0},{"$f":"SUMIF('Equipment Options'!N:N,'MeasureTotals Lookups'!$B110,'Equipment Options'!R:R)","v":0},{"$f":"SUMIF('Equipment Options'!N:N,'MeasureTotals Lookups'!$B110,'Equipment Options'!S:S)","v":0},null,null,null,null,null,null,18127,{"$f":"SUMIF('Equipment Options'!N:N,'MeasureTotals Lookups'!$B110,'Equipment Options'!T:T)","v":0},{"$f":"SUMIF('Equipment Options'!N:N,'MeasureTotals Lookups'!$B110,'Equipment Options'!U:U)","v":0},"RTU Controls, Variable Supply Fan, Heat Pump Heating",0]
[null,"RTUCTRLECOHPH",{"$f":"SUMIF('Equipment Options'!N:N,'MeasureTotals Lookups'!$B111,'Equipment Options'!O:O)","v":0},null,{"$f":"SUMIF('Equipment Options'!N:N,'MeasureTotals Lookups'!$B111,'Equipment Options'!V:V)","v":0},{"$f":"SUMIF('Equipment Options'!N:N,'MeasureTotals Lookups'!$B111,'Equipment Options'!R:R)","v":0},{"$f":"SUMIF('Equipment Options'!N:N,'MeasureTotals Lookups'!$B111,'Equipment Options'!S:S)","v":0},null,null,null,null,null,null,18128,{"$f":"SUMIF('Equipment Options'!N:N,'MeasureTotals Lookups'!$B111,'Equipment Options'!T:T)","v":0},{"$f":"SUMIF('Equipment Options'!N:N,'MeasureTotals Lookups'!$B111,'Equipment Options'!U:U)","v":0},"RTU Controls, Economizer, Heat Pump Heating",0]
[null,"RTUCTRLECOGH",{"$f":"SUMIF('Equipment Options'!N:N,'MeasureTotals Lookups'!$B112,'Equipment Options'!O:O)","v":0},null,{"$f":"SUMIF('Equipment Options'!N:N,'MeasureTotals Lookups'!$B112,'Equipment Options'!V:V)","v":0},{"$f":"SUMIF('Equipment Options'!N:N,'MeasureTotals Lookups'!$B112,'Equipment Options'!R:R)","v":0},{"$f":"SUMIF('Equipment Options'!N:N,'MeasureTotals Lookups'!$B112,'Equipment Options'!S:S)","v":0},null,null,null,null,null,null,18129,{"$f":"SUMIF('Equipment Options'!N:N,'MeasureTotals Lookups'!$B112,'Equipment Options'!T:T)","v":0},{"$f":"SUMIF('Equipment Options'!N:N,'MeasureTotals Lookups'!$B112,'Equipment Options'!U:U)","v":0},"RTU Controls, Economizer, Gas Heating",0]
[null,"RTUCTRLDCVHPH",{"$f":"SUMIF('Equipment Options'!N:N,'MeasureTotals Lookups'!$B113,'Equipment Options'!O:O)","v":0},null,{"$f":"SUMIF('Equipment Options'!N:N,'MeasureTotals Lookups'!$B113,'Equipment Options'!V:V)","v":0},{"$f":"SUMIF('Equipment Options'!N:N,'MeasureTotals Lookups'!$B113,'Equipment Options'!R:R)","v":0},{"$f":"SUMIF('Equipment Options'!N:N,'MeasureTotals Lookups'!$B113,'Equipment Options'!S:S)","v":0},null,null,null,null,null,null,18130,{"$f":"SUMIF('Equipment Options'!N:N,'MeasureTotals Lookups'!$B113,'Equipment Options'!T:T)","v":0},{"$f":"SUMIF('Equipment Options'!N:N,'MeasureTotals Lookups'!$B113,'Equipment Options'!U:U)","v":0},"RTU Controls, DCV, Heat Pump Heating",0]
[null,"RTUCTRLDCVGHGOT",{"$f":"SUMIF('Equipment Options'!N:N,'MeasureTotals Lookups'!$B114,'Equipment Options'!O:O)","v":0},null,{"$f":"SUMIF('Equipment Options'!N:N,'MeasureTotals Lookups'!$B114,'Equipment Options'!V:V)","v":0},{"$f":"SUMIF('Equipment Options'!N:N,'MeasureTotals Lookups'!$B114,'Equipment Options'!R:R)","v":0},{"$f":"SUMIF('Equipment Options'!N:N,'MeasureTotals Lookups'!$B114,'Equipment Options'!S:S)","v":0},null,null,null,null,null,null,18131,{"$f":"SUMIF('Equipment Options'!N:N,'MeasureTotals Lookups'!$B114,'Equipment Options'!T:T)","v":0},{"$f":"SUMIF('Equipment Options'!N:N,'MeasureTotals Lookups'!$B114,'Equipment Options'!U:U)","v":0},"RTU Controls, DCV, Gas Heating (gas only territories)",0]
[null,"RTUCTRLDCVGH",{"$f":"SUMIF('Equipment Options'!N:N,'MeasureTotals Lookups'!$B115,'Equipment Options'!O:O)","v":0},null,{"$f":"SUMIF('Equipment Options'!N:N,'MeasureTotals Lookups'!$B115,'Equipment Options'!V:V)","v":0},{"$f":"SUMIF('Equipment Options'!N:N,'MeasureTotals Lookups'!$B115,'Equipment Options'!R:R)","v":0},{"$f":"SUMIF('Equipment Options'!N:N,'MeasureTotals Lookups'!$B115,'Equipment Options'!S:S)","v":0},null,null,null,null,null,null,18132,{"$f":"SUMIF('Equipment Options'!N:N,'MeasureTotals Lookups'!$B115,'Equipment Options'!T:T)","v":0},{"$f":"SUMIF('Equipment Options'!N:N,'MeasureTotals Lookups'!$B115,'Equipment Options'!U:U)","v":0},"RTU Controls, DCV, Gas Heating",0]
[null,"MFTANKLESS199",{"$f":"SUMIF('Equipment Options'!N:N,'MeasureTotals Lookups'!$B116,'Equipment Options'!O:O)","v":0},null,{"$f":"SUMIF('Equipment Options'!N:N,'MeasureTotals Lookups'!$B116,'Equipment Options'!V:V)","v":0},{"$f":"SUMIF('Equipment Options'!N:N,'MeasureTotals Lookups'!$B116,'Equipment Options'!R:R)","v":0},{"$f":"SUMIF('Equipment Options'!N:N,'MeasureTotals Lookups'!$B116,'Equipment Options'!S:S)","v":0},null,null,null,null,null,null,15429,{"$f":"SUMIF('Equipment Options'!N:N,'MeasureTotals Lookups'!$B116,'Equipment Options'!T:T)","v":0},{"$f":"SUMIF('Equipment Options'!N:N,'MeasureTotals Lookups'!$B116,'Equipment Options'!U:U)","v":0},"Multifamily 199 kBth/h Condensing Tankless water heater",0]
[null,"COOLCASEDRRCHZLOWGAS",{"$f":"SUMIF('Equipment Options'!N:N,'MeasureTotals Lookups'!$B117,'Equipment Options'!O:O)","v":0},null,{"$f":"SUMIF('Equipment Options'!N:N,'MeasureTotals Lookups'!$B117,'Equipment Options'!V:V)","v":0},{"$f":"SUMIF('Equipment Options'!N:N,'MeasureTotals Lookups'!$B117,'Equipment Options'!R:R)","v":0},{"$f":"SUMIF('Equipment Options'!N:N,'MeasureTotals Lookups'!$B117,'Equipment Options'!S:S)","v":0},null,null,null,null,null,null,17988,{"$f":"SUMIF('Equipment Options'!N:N,'MeasureTotals Lookups'!$B117,'Equipment Options'!T:T)","v":0},{"$f":"SUMIF('Equipment Options'!N:N,'MeasureTotals Lookups'!$B117,'Equipment Options'!U:U)","v":0},"Cooler w/ Door - Remote Condensing, Horiz Low Temp - Gas",0]
[null,"COOLCASEDRRCHZMEDGAS",{"$f":"SUMIF('Equipment Options'!N:N,'MeasureTotals Lookups'!$B118,'Equipment Options'!O:O)","v":0},null,{"$f":"SUMIF('Equipment Options'!N:N,'MeasureTotals Lookups'!$B118,'Equipment Options'!V:V)","v":0},{"$f":"SUMIF('Equipment Options'!N:N,'MeasureTotals Lookups'!$B118,'Equipment Options'!R:R)","v":0},{"$f":"SUMIF('Equipment Options'!N:N,'MeasureTotals Lookups'!$B118,'Equipment Options'!S:S)","v":0},null,null,null,null,null,null,17989,{"$f":"SUMIF('Equipment Options'!N:N,'MeasureTotals Lookups'!$B118,'Equipment Options'!T:T)","v":0},{"$f":"SUMIF('Equipment Options'!N:N,'MeasureTotals Lookups'!$B118,'Equipment Options'!U:U)","v":0},"Cooler w/ Door - Remote Condensing, Horiz Med Temp - Gas",0]
[null,"COOLCASEDRRCVTMEDGAS",{"$f":"SUMIF('Equipment Options'!N:N,'MeasureTotals Lookups'!$B119,'Equipment Options'!O:O)","v":0},null,{"$f":"SUMIF('Equipment Options'!N:N,'MeasureTotals Lookups'!$B119,'Equipment Options'!V:V)","v":0},{"$f":"SUMIF('Equipment Options'!N:N,'MeasureTotals Lookups'!$B119,'Equipment Options'!R:R)","v":0},{"$f":"SUMIF('Equipment Options'!N:N,'MeasureTotals Lookups'!$B119,'Equipment Options'!S:S)","v":0},null,null,null,null,null,null,17990,{"$f":"SUMIF('Equipment Options'!N:N,'MeasureTotals Lookups'!$B119,'Equipment Options'!T:T)","v":0},{"$f":"SUMIF('Equipment Options'!N:N,'MeasureTotals Lookups'!$B119,'Equipment Options'!U:U)","v":0},"Cooler w/ Door - Remote Condensing, Vert Med Temp - Gas",0]
[null,"COOLCASEDRRCHZLOWEOT",{"$f":"SUMIF('Equipment Options'!N:N,'MeasureTotals Lookups'!$B120,'Equipment Options'!O:O)","v":0},null,{"$f":"SUMIF('Equipment Options'!N:N,'MeasureTotals Lookups'!$B120,'Equipment Options'!V:V)","v":0},{"$f":"SUMIF('Equipment Options'!N:N,'MeasureTotals Lookups'!$B120,'Equipment Options'!R:R)","v":0},{"$f":"SUMIF('Equipment Options'!N:N,'MeasureTotals Lookups'!$B120,'Equipment Options'!S:S)","v":0},null,null,null,null,null,null,17991,{"$f":"SUMIF('Equipment Options'!N:N,'MeasureTotals Lookups'!$B120,'Equipment Options'!T:T)","v":0},{"$f":"SUMIF('Equipment Options'!N:N,'MeasureTotals Lookups'!$B120,'Equipment Options'!U:U)","v":0},"Cooler w/ Door - Remote Condensing, Horiz Low Temp - Gas EOT",0]
[null,"COOLCASEDRRCVTMEDEOT",{"$f":"SUMIF('Equipment Options'!N:N,'MeasureTotals Lookups'!$B121,'Equipment Options'!O:O)","v":0},null,{"$f":"SUMIF('Equipment Options'!N:N,'MeasureTotals Lookups'!$B121,'Equipment Options'!V:V)","v":0},{"$f":"SUMIF('Equipment Options'!N:N,'MeasureTotals Lookups'!$B121,'Equipment Options'!R:R)","v":0},{"$f":"SUMIF('Equipment Options'!N:N,'MeasureTotals Lookups'!$B121,'Equipment Options'!S:S)","v":0},null,null,null,null,null,null,17992,{"$f":"SUMIF('Equipment Options'!N:N,'MeasureTotals Lookups'!$B121,'Equipment Options'!T:T)","v":0},{"$f":"SUMIF('Equipment Options'!N:N,'MeasureTotals Lookups'!$B121,'Equipment Options'!U:U)","v":0},"Cooler w/ Door - Remote Condensing, Vert Med Temp - Gas EOT",0]
[null,"COOLCASEDRRCHZMEDEOT",{"$f":"SUMIF('Equipment Options'!N:N,'MeasureTotals Lookups'!$B122,'Equipment Options'!O:O)","v":0},null,{"$f":"SUMIF('Equipment Options'!N:N,'MeasureTotals Lookups'!$B122,'Equipment Options'!V:V)","v":0},{"$f":"SUMIF('Equipment Options'!N:N,'MeasureTotals Lookups'!$B122,'Equipment Options'!R:R)","v":0},{"$f":"SUMIF('Equipment Options'!N:N,'MeasureTotals Lookups'!$B122,'Equipment Options'!S:S)","v":0},null,null,null,null,null,null,17993,{"$f":"SUMIF('Equipment Options'!N:N,'MeasureTotals Lookups'!$B122,'Equipment Options'!T:T)","v":0},{"$f":"SUMIF('Equipment Options'!N:N,'MeasureTotals Lookups'!$B122,'Equipment Options'!U:U)","v":0},"Cooler w/ Door - Remote Condensing, Horiz Med Temp - Gas EOT",0]
[null,"COOLCASEDRRCHZLOWGOT",{"$f":"SUMIF('Equipment Options'!N:N,'MeasureTotals Lookups'!$B123,'Equipment Options'!O:O)","v":0},null,{"$f":"SUMIF('Equipment Options'!N:N,'MeasureTotals Lookups'!$B123,'Equipment Options'!V:V)","v":0},{"$f":"SUMIF('Equipment Options'!N:N,'MeasureTotals Lookups'!$B123,'Equipment Options'!R:R)","v":0},{"$f":"SUMIF('Equipment Options'!N:N,'MeasureTotals Lookups'!$B123,'Equipment Options'!S:S)","v":0},null,null,null,null,null,null,17994,{"$f":"SUMIF('Equipment Options'!N:N,'MeasureTotals Lookups'!$B123,'Equipment Options'!T:T)","v":0},{"$f":"SUMIF('Equipment Options'!N:N,'MeasureTotals Lookups'!$B123,'Equipment Options'!U:U)","v":0},"Cooler w/ Door - Remote Condensing, Horiz Low Temp - GOT",0]
[null,"COOLCASEDRRCHZMEDGOT",{"$f":"SUMIF('Equipment Options'!N:N,'MeasureTotals Lookups'!$B124,'Equipment Options'!O:O)","v":0},null,{"$f":"SUMIF('Equipment Options'!N:N,'MeasureTotals Lookups'!$B124,'Equipment Options'!V:V)","v":0},{"$f":"SUMIF('Equipment Options'!N:N,'MeasureTotals Lookups'!$B124,'Equipment Options'!R:R)","v":0},{"$f":"SUMIF('Equipment Options'!N:N,'MeasureTotals Lookups'!$B124,'Equipment Options'!S:S)","v":0},null,null,null,null,null,null,17995,{"$f":"SUMIF('Equipment Options'!N:N,'MeasureTotals Lookups'!$B124,'Equipment Options'!T:T)","v":0},{"$f":"SUMIF('Equipment Options'!N:N,'MeasureTotals Lookups'!$B124,'Equipment Options'!U:U)","v":0},"Cooler w/ Door - Remote Condensing, Horiz Med Temp - GOT",0]
[null,"COOLCASEDRRCVTMEDGOT",{"$f":"SUMIF('Equipment Options'!N:N,'MeasureTotals Lookups'!$B125,'Equipment Options'!O:O)","v":0},null,{"$f":"SUMIF('Equipment Options'!N:N,'MeasureTotals Lookups'!$B125,'Equipment Options'!V:V)","v":0},{"$f":"SUMIF('Equipment Options'!N:N,'MeasureTotals Lookups'!$B125,'Equipment Options'!R:R)","v":0},{"$f":"SUMIF('Equipment Options'!N:N,'MeasureTotals Lookups'!$B125,'Equipment Options'!S:S)","v":0},null,null,null,null,null,null,17996,{"$f":"SUMIF('Equipment Options'!N:N,'MeasureTotals Lookups'!$B125,'Equipment Options'!T:T)","v":0},{"$f":"SUMIF('Equipment Options'!N:N,'MeasureTotals Lookups'!$B125,'Equipment Options'!U:U)","v":0},"Cooler w/ Door - Remote Condensing, Vert Med Temp - GOT",0]
[null,"COOLCASEDRRCHZLOWELE",{"$f":"SUMIF('Equipment Options'!N:N,'MeasureTotals Lookups'!$B126,'Equipment Options'!O:O)","v":0},null,{"$f":"SUMIF('Equipment Options'!N:N,'MeasureTotals Lookups'!$B126,'Equipment Options'!V:V)","v":0},{"$f":"SUMIF('Equipment Options'!N:N,'MeasureTotals Lookups'!$B126,'Equipment Options'!R:R)","v":0},{"$f":"SUMIF('Equipment Options'!N:N,'MeasureTotals Lookups'!$B126,'Equipment Options'!S:S)","v":0},null,null,null,null,null,null,17997,{"$f":"SUMIF('Equipment Options'!N:N,'MeasureTotals Lookups'!$B126,'Equipment Options'!T:T)","v":0},{"$f":"SUMIF('Equipment Options'!N:N,'MeasureTotals Lookups'!$B126,'Equipment Options'!U:U)","v":0},"Cooler w/ Door - Remote Condensing, Horiz Low Temp - Elec",0]
[null,"COOLCASEDRRCHZMEDELE",{"$f":"SUMIF('Equipment Options'!N:N,'MeasureTotals Lookups'!$B127,'Equipment Options'!O:O)","v":0},null,{"$f":"SUMIF('Equipment Options'!N:N,'MeasureTotals Lookups'!$B127,'Equipment Options'!V:V)","v":0},{"$f":"SUMIF('Equipment Options'!N:N,'MeasureTotals Lookups'!$B127,'Equipment Options'!R:R)","v":0},{"$f":"SUMIF('Equipment Options'!N:N,'MeasureTotals Lookups'!$B127,'Equipment Options'!S:S)","v":0},null,null,null,null,null,null,17998,{"$f":"SUMIF('Equipment Options'!N:N,'MeasureTotals Lookups'!$B127,'Equipment Options'!T:T)","v":0},{"$f":"SUMIF('Equipment Options'!N:N,'MeasureTotals Lookups'!$B127,'Equipment Options'!U:U)","v":0},"Cooler w/ Door - Remote Condensing, Horiz Med Temp - Elec",0]
[null,"COOLCASEDRRCVTMEDELE",{"$f":"SUMIF('Equipment Options'!N:N,'MeasureTotals Lookups'!$B128,'Equipment Options'!O:O)","v":0},null,{"$f":"SUMIF('Equipment Options'!N:N,'MeasureTotals Lookups'!$B128,'Equipment Options'!V:V)","v":0},{"$f":"SUMIF('Equipment Options'!N:N,'MeasureTotals Lookups'!$B128,'Equipment Options'!R:R)","v":0},{"$f":"SUMIF('Equipment Options'!N:N,'MeasureTotals Lookups'!$B128,'Equipment Options'!S:S)","v":0},null,null,null,null,null,null,18008,{"$f":"SUMIF('Equipment Options'!N:N,'MeasureTotals Lookups'!$B128,'Equipment Options'!T:T)","v":0},{"$f":"SUMIF('Equipment Options'!N:N,'MeasureTotals Lookups'!$B128,'Equipment Options'!U:U)","v":0},"Cooler w/ Door - Remote Condensing, Vert Med Temp - Elec",0]
[null,"COOLCASEDRSCHZLOWEOT",{"$f":"SUMIF('Equipment Options'!N:N,'MeasureTotals Lookups'!$B129,'Equipment Options'!O:O)","v":0},null,{"$f":"SUMIF('Equipment Options'!N:N,'MeasureTotals Lookups'!$B129,'Equipment Options'!V:V)","v":0},{"$f":"SUMIF('Equipment Options'!N:N,'MeasureTotals Lookups'!$B129,'Equipment Options'!R:R)","v":0},{"$f":"SUMIF('Equipment Options'!N:N,'MeasureTotals Lookups'!$B129,'Equipment Options'!S:S)","v":0},null,null,null,null,null,null,18348,{"$f":"SUMIF('Equipment Options'!N:N,'MeasureTotals Lookups'!$B129,'Equipment Options'!T:T)","v":0},{"$f":"SUMIF('Equipment Options'!N:N,'MeasureTotals Lookups'!$B129,'Equipment Options'!U:U)","v":0},"Cooler w/ Door - Self-Contained, Horiz Low Temp - Gas EOT",0]
[null,"CTWH199ALLCOM",{"$f":"SUMIF('Equipment Options'!N:N,'MeasureTotals Lookups'!$B130,'Equipment Options'!O:O)","v":0},null,{"$f":"SUMIF('Equipment Options'!N:N,'MeasureTotals Lookups'!$B130,'Equipment Options'!V:V)","v":0},{"$f":"SUMIF('Equipment Options'!N:N,'MeasureTotals Lookups'!$B130,'Equipment Options'!R:R)","v":0},{"$f":"SUMIF('Equipment Options'!N:N,'MeasureTotals Lookups'!$B130,'Equipment Options'!S:S)","v":0},null,null,null,null,null,null,18365,{"$f":"SUMIF('Equipment Options'!N:N,'MeasureTotals Lookups'!$B130,'Equipment Options'!T:T)","v":0},{"$f":"SUMIF('Equipment Options'!N:N,'MeasureTotals Lookups'!$B130,'Equipment Options'!U:U)","v":0},"Commercial Tankless Water Heater <200 - All Commercial",0]
[null,"VRFNDHEDOAS",{"$f":"SUMIF('Equipment Options'!N:N,'MeasureTotals Lookups'!$B131,'Equipment Options'!O:O)","v":0},null,{"$f":"SUMIF('Equipment Options'!N:N,'MeasureTotals Lookups'!$B131,'Equipment Options'!V:V)","v":0},{"$f":"SUMIF('Equipment Options'!N:N,'MeasureTotals Lookups'!$B131,'Equipment Options'!R:R)","v":0},{"$f":"SUMIF('Equipment Options'!N:N,'MeasureTotals Lookups'!$B131,'Equipment Options'!S:S)","v":0},null,null,null,null,null,null,18006,{"$f":"SUMIF('Equipment Options'!N:N,'MeasureTotals Lookups'!$B131,'Equipment Options'!T:T)","v":0},{"$f":"SUMIF('Equipment Options'!N:N,'MeasureTotals Lookups'!$B131,'Equipment Options'!U:U)","v":0},"VRF - Ductless w/ HE DOAS (per sf)",0]
[null,"VRFND",{"$f":"SUMIF('Equipment Options'!N:N,'MeasureTotals Lookups'!$B132,'Equipment Options'!O:O)","v":0},null,{"$f":"SUMIF('Equipment Options'!N:N,'MeasureTotals Lookups'!$B132,'Equipment Options'!V:V)","v":0},{"$f":"SUMIF('Equipment Options'!N:N,'MeasureTotals Lookups'!$B132,'Equipment Options'!R:R)","v":0},{"$f":"SUMIF('Equipment Options'!N:N,'MeasureTotals Lookups'!$B132,'Equipment Options'!S:S)","v":0},null,null,null,null,null,null,{"$f":"_xlfn.XLOOKUP($B132,ProductCode,ProductVersionId,\"\",0)","v":18007},{"$f":"SUMIF('Equipment Options'!N:N,'MeasureTotals Lookups'!$B132,'Equipment Options'!T:T)","v":0},{"$f":"SUMIF('Equipment Options'!N:N,'MeasureTotals Lookups'!$B132,'Equipment Options'!U:U)","v":0},{"$f":"_xlfn.XLOOKUP($B132,ProductCode,ProductDescription,\"\",0)","v":"VRF - Ductless (per sf)"},{"$f":"(_xlfn.XLOOKUP($B132,ProductCode,IncrementalCost,\"\",0))*C132","v":0}]
[null,"OVERWRAPPER",{"$f":"SUMIF('Equipment Options'!N:N,'MeasureTotals Lookups'!$B133,'Equipment Options'!O:O)","v":0},null,{"$f":"SUMIF('Equipment Options'!N:N,'MeasureTotals Lookups'!$B133,'Equipment Options'!V:V)","v":0},{"$f":"SUMIF('Equipment Options'!N:N,'MeasureTotals Lookups'!$B133,'Equipment Options'!R:R)","v":0},{"$f":"SUMIF('Equipment Options'!N:N,'MeasureTotals Lookups'!$B133,'Equipment Options'!S:S)","v":0},null,null,null,null,null,null,18003,{"$f":"SUMIF('Equipment Options'!N:N,'MeasureTotals Lookups'!$B133,'Equipment Options'!T:T)","v":0},{"$f":"SUMIF('Equipment Options'!N:N,'MeasureTotals Lookups'!$B133,'Equipment Options'!U:U)","v":0},"On-Demand Overwrapper",0]
[null,"DRYERELE",{"$f":"SUMIF('Equipment Options'!N:N,'MeasureTotals Lookups'!$B134,'Equipment Options'!O:O)","v":0},null,{"$f":"SUMIF('Equipment Options'!N:N,'MeasureTotals Lookups'!$B134,'Equipment Options'!V:V)","v":0},{"$f":"SUMIF('Equipment Options'!N:N,'MeasureTotals Lookups'!$B134,'Equipment Options'!R:R)","v":0},{"$f":"SUMIF('Equipment Options'!N:N,'MeasureTotals Lookups'!$B134,'Equipment Options'!S:S)","v":0},null,null,null,null,null,null,13451,{"$f":"SUMIF('Equipment Options'!N:N,'MeasureTotals Lookups'!$B134,'Equipment Options'!T:T)","v":0},{"$f":"SUMIF('Equipment Options'!N:N,'MeasureTotals Lookups'!$B134,'Equipment Options'!U:U)","v":0},"Electric Clothes Dryer - In-Unit",0]
[null,"HHCECMVS050075HP",{"$f":"SUMIF('Equipment Options'!N:N,'MeasureTotals Lookups'!$B135,'Equipment Options'!O:O)","v":0},null,{"$f":"SUMIF('Equipment Options'!N:N,'MeasureTotals Lookups'!$B135,'Equipment Options'!V:V)","v":0},{"$f":"SUMIF('Equipment Options'!N:N,'MeasureTotals Lookups'!$B135,'Equipment Options'!R:R)","v":0},{"$f":"SUMIF('Equipment Options'!N:N,'MeasureTotals Lookups'!$B135,'Equipment Options'!S:S)","v":0},null,null,null,null,null,null,15933,{"$f":"SUMIF('Equipment Options'!N:N,'MeasureTotals Lookups'!$B135,'Equipment Options'!T:T)","v":0},{"$f":"SUMIF('Equipment Options'!N:N,'MeasureTotals Lookups'!$B135,'Equipment Options'!U:U)","v":0},"Hydro Heating Circulators, ECM, Variable Speed, >0.5 - = 0.75 HP",0]
[null,"HHCECMVS175250HP",{"$f":"SUMIF('Equipment Options'!N:N,'MeasureTotals Lookups'!$B136,'Equipment Options'!O:O)","v":0},null,{"$f":"SUMIF('Equipment Options'!N:N,'MeasureTotals Lookups'!$B136,'Equipment Options'!V:V)","v":0},{"$f":"SUMIF('Equipment Options'!N:N,'MeasureTotals Lookups'!$B136,'Equipment Options'!R:R)","v":0},{"$f":"SUMIF('Equipment Options'!N:N,'MeasureTotals Lookups'!$B136,'Equipment Options'!S:S)","v":0},null,null,null,null,null,null,15934,{"$f":"SUMIF('Equipment Options'!N:N,'MeasureTotals Lookups'!$B136,'Equipment Options'!T:T)","v":0},{"$f":"SUMIF('Equipment Options'!N:N,'MeasureTotals Lookups'!$B136,'Equipment Options'!U:U)","v":0},"Hydro Heating Circulators, ECM, Variable Speed, >1.75 - =2.5 HP",0]
[null,"HHCECMVS250350HP",{"$f":"SUMIF('Equipment Options'!N:N,'MeasureTotals Lookups'!$B137,'Equipment Options'!O:O)","v":0},null,{"$f":"SUMIF('Equipment Options'!N:N,'MeasureTotals Lookups'!$B137,'Equipment Options'!V:V)","v":0},{"$f":"SUMIF('Equipment Options'!N:N,'MeasureTotals Lookups'!$B137,'Equipment Options'!R:R)","v":0},{"$f":"SUMIF('Equipment Options'!N:N,'MeasureTotals Lookups'!$B137,'Equipment Options'!S:S)","v":0},null,null,null,null,null,null,15935,{"$f":"SUMIF('Equipment Options'!N:N,'MeasureTotals Lookups'!$B137,'Equipment Options'!T:T)","v":0},{"$f":"SUMIF('Equipment Options'!N:N,'MeasureTotals Lookups'!$B137,'Equipment Options'!U:U)","v":0},"Hydro Heating Circulators, ECM, Variable Speed, >2.5 - =3.5 HP",0]
[null,"HHCECMVS350450HP",{"$f":"SUMIF('Equipment Options'!N:N,'MeasureTotals Lookups'!$B138,'Equipment Options'!O:O)","v":0},null,{"$f":"SUMIF('Equipment Options'!N:N,'MeasureTotals Lookups'!$B138,'Equipment Options'!V:V)","v":0},{"$f":"SUMIF('Equipment Options'!N:N,'MeasureTotals Lookups'!$B138,'Equipment Options'!R:R)","v":0},{"$f":"SUMIF('Equipment Options'!N:N,'MeasureTotals Lookups'!$B138,'Equipment Options'!S:S)","v":0},null,null,null,null,null,null,15936,{"$f":"SUMIF('Equipment Options'!N:N,'MeasureTotals Lookups'!$B138,'Equipment Options'!T:T)","v":0},{"$f":"SUMIF('Equipment Options'!N:N,'MeasureTotals Lookups'!$B138,'Equipment Options'!U:U)","v":0},"Hydro Heating Circulators, ECM, Variable Speed, >3.5 - =4.5 HP",0]
[null,"HHCECMVS450500HP",{"$f":"SUMIF('Equipment Options'!N:N,'MeasureTotals Lookups'!$B139,'Equipment Options'!O:O)","v":0},null,{"$f":"SUMIF('Equipment Options'!N:N,'MeasureTotals Lookups'!$B139,'Equipment Options'!V:V)","v":0},{"$f":"SUMIF('Equipment Options'!N:N,'MeasureTotals Lookups'!$B139,'Equipment Options'!R:R)","v":0},{"$f":"SUMIF('Equipment Options'!N:N,'MeasureTotals Lookups'!$B139,'Equipment Options'!S:S)","v":0},null,null,null,null,null,null,15937,{"$f":"SUMIF('Equipment Options'!N:N,'MeasureTotals Lookups'!$B139,'Equipment Options'!T:T)","v":0},{"$f":"SUMIF('Equipment Options'!N:N,'MeasureTotals Lookups'!$B139,'Equipment Options'!U:U)","v":0},"Hydro Heating Circulators, ECM, Variable Speed, >4.5 - =5 HP",0]
[null,"HHCECMSS075125HP",{"$f":"SUMIF('Equipment Options'!N:N,'MeasureTotals Lookups'!$B140,'Equipment Options'!O:O)","v":0},null,{"$f":"SUMIF('Equipment Options'!N:N,'MeasureTotals Lookups'!$B140,'Equipment Options'!V:V)","v":0},{"$f":"SUMIF('Equipment Options'!N:N,'MeasureTotals Lookups'!$B140,'Equipment Options'!R:R)","v":0},{"$f":"SUMIF('Equipment Options'!N:N,'MeasureTotals Lookups'!$B140,'Equipment Options'!S:S)","v":0},null,null,null,null,null,null,15938,{"$f":"SUMIF('Equipment Options'!N:N,'MeasureTotals Lookups'!$B140,'Equipment Options'!T:T)","v":0},{"$f":"SUMIF('Equipment Options'!N:N,'MeasureTotals Lookups'!$B140,'Equipment Options'!U:U)","v":0},"Hydro Heating Circulators, ECM, Single Speed, >.75 - =1.25 HP",0]
[null,"HHCECMSS125175HP",{"$f":"SUMIF('Equipment Options'!N:N,'MeasureTotals Lookups'!$B141,'Equipment Options'!O:O)","v":0},null,{"$f":"SUMIF('Equipment Options'!N:N,'MeasureTotals Lookups'!$B141,'Equipment Options'!V:V)","v":0},{"$f":"SUMIF('Equipment Options'!N:N,'MeasureTotals Lookups'!$B141,'Equipment Options'!R:R)","v":0},{"$f":"SUMIF('Equipment Options'!N:N,'MeasureTotals Lookups'!$B141,'Equipment Options'!S:S)","v":0},null,null,null,null,null,null,15939,{"$f":"SUMIF('Equipment Options'!N:N,'MeasureTotals Lookups'!$B141,'Equipment Options'!T:T)","v":0},{"$f":"SUMIF('Equipment Options'!N:N,'MeasureTotals Lookups'!$B141,'Equipment Options'!U:U)","v":0},"Hydro Heating Circulators, ECM, Single Speed, > 1.25 - = 1.75 HP",0]
[null,"HHCECMSS450500HP",{"$f":"SUMIF('Equipment Options'!N:N,'MeasureTotals Lookups'!$B142,'Equipment Options'!O:O)","v":0},null,{"$f":"SUMIF('Equipment Options'!N:N,'MeasureTotals Lookups'!$B142,'Equipment Options'!V:V)","v":0},{"$f":"SUMIF('Equipment Options'!N:N,'MeasureTotals Lookups'!$B142,'Equipment Options'!R:R)","v":0},{"$f":"SUMIF('Equipment Options'!N:N,'MeasureTotals Lookups'!$B142,'Equipment Options'!S:S)","v":0},null,null,null,null,null,null,15942,{"$f":"SUMIF('Equipment Options'!N:N,'MeasureTotals Lookups'!$B142,'Equipment Options'!T:T)","v":0},{"$f":"SUMIF('Equipment Options'!N:N,'MeasureTotals Lookups'!$B142,'Equipment Options'!U:U)","v":0},"Hydro Heating Circulators, ECM, Single Speed, > 4.5 - = 5 HP",0]
[null,"HHCECMSS350450HP",{"$f":"SUMIF('Equipment Options'!N:N,'MeasureTotals Lookups'!$B143,'Equipment Options'!O:O)","v":0},null,{"$f":"SUMIF('Equipment Options'!N:N,'MeasureTotals Lookups'!$B143,'Equipment Options'!V:V)","v":0},{"$f":"SUMIF('Equipment Options'!N:N,'MeasureTotals Lookups'!$B143,'Equipment Options'!R:R)","v":0},{"$f":"SUMIF('Equipment Options'!N:N,'MeasureTotals Lookups'!$B143,'Equipment Options'!S:S)","v":0},null,null,null,null,null,null,15943,{"$f":"SUMIF('Equipment Options'!N:N,'MeasureTotals Lookups'!$B143,'Equipment Options'!T:T)","v":0},{"$f":"SUMIF('Equipment Options'!N:N,'MeasureTotals Lookups'!$B143,'Equipment Options'!U:U)","v":0},"Hydro Heating Circulators, ECM, Single Speed, > 3.5 - = 4.5 HP",0]
[null,"HHCECMSS175250HP",{"$f":"SUMIF('Equipment Options'!N:N,'MeasureTotals Lookups'!$B144,'Equipment Options'!O:O)","v":0},null,{"$f":"SUMIF('Equipment Options'!N:N,'MeasureTotals Lookups'!$B144,'Equipment Options'!V:V)","v":0},{"$f":"SUMIF('Equipment Options'!N:N,'MeasureTotals Lookups'!$B144,'Equipment Options'!R:R)","v":0},{"$f":"SUMIF('Equipment Options'!N:N,'MeasureTotals Lookups'!$B144,'Equipment Options'!S:S)","v":0},null,null,null,null,null,null,15944,{"$f":"SUMIF('Equipment Options'!N:N,'MeasureTotals Lookups'!$B144,'Equipment Options'!T:T)","v":0},{"$f":"SUMIF('Equipment Options'!N:N,'MeasureTotals Lookups'!$B144,'Equipment Options'!U:U)","v":0},"Hydro Heating Circulators, ECM, Single Speed, >1.75 - = 2.5 HP",0]
[null,"HHCECMVS075125HP",{"$f":"SUMIF('Equipment Options'!N:N,'MeasureTotals Lookups'!$B145,'Equipment Options'!O:O)","v":0},null,{"$f":"SUMIF('Equipment Options'!N:N,'MeasureTotals Lookups'!$B145,'Equipment Options'!V:V)","v":0},{"$f":"SUMIF('Equipment Options'!N:N,'MeasureTotals Lookups'!$B145,'Equipment Options'!R:R)","v":0},{"$f":"SUMIF('Equipment Options'!N:N,'MeasureTotals Lookups'!$B145,'Equipment Options'!S:S)","v":0},null,null,null,null,null,null,15945,{"$f":"SUMIF('Equipment Options'!N:N,'MeasureTotals Lookups'!$B145,'Equipment Options'!T:T)","v":0},{"$f":"SUMIF('Equipment Options'!N:N,'MeasureTotals Lookups'!$B145,'Equipment Options'!U:U)","v":0},"Hydro Heating Circulators, ECM, Variable Speed, >.75 - =1.25 HP",0]
[null,"HHCECMSS250350HP",{"$f":"SUMIF('Equipment Options'!N:N,'MeasureTotals Lookups'!$B146,'Equipment Options'!O:O)","v":0},null,{"$f":"SUMIF('Equipment Options'!N:N,'MeasureTotals Lookups'!$B146,'Equipment Options'!V:V)","v":0},{"$f":"SUMIF('Equipment Options'!N:N,'MeasureTotals Lookups'!$B146,'Equipment Options'!R:R)","v":0},{"$f":"SUMIF('Equipment Options'!N:N,'MeasureTotals Lookups'!$B146,'Equipment Options'!S:S)","v":0},null,null,null,null,null,null,16087,{"$f":"SUMIF('Equipment Options'!N:N,'MeasureTotals Lookups'!$B146,'Equipment Options'!T:T)","v":0},{"$f":"SUMIF('Equipment Options'!N:N,'MeasureTotals Lookups'!$B146,'Equipment Options'!U:U)","v":0},"Hydro Heating Circulators, ECM, Single Speed, >2.5 - =3.5 HP",0]
[null,"HHCECMVS125175HP",{"$f":"SUMIF('Equipment Options'!N:N,'MeasureTotals Lookups'!$B147,'Equipment Options'!O:O)","v":0},null,{"$f":"SUMIF('Equipment Options'!N:N,'MeasureTotals Lookups'!$B147,'Equipment Options'!V:V)","v":0},{"$f":"SUMIF('Equipment Options'!N:N,'MeasureTotals Lookups'!$B147,'Equipment Options'!R:R)","v":0},{"$f":"SUMIF('Equipment Options'!N:N,'MeasureTotals Lookups'!$B147,'Equipment Options'!S:S)","v":0},null,null,null,null,null,null,16094,{"$f":"SUMIF('Equipment Options'!N:N,'MeasureTotals Lookups'!$B147,'Equipment Options'!T:T)","v":0},{"$f":"SUMIF('Equipment Options'!N:N,'MeasureTotals Lookups'!$B147,'Equipment Options'!U:U)","v":0},"Hydro Heating Circulators, ECM, Variable Speed, >1.25 - =1.75 HP",0]
[null,"CHPWHT2",{"$f":"SUMIF('Equipment Options'!N:N,'MeasureTotals Lookups'!$B148,'Equipment Options'!O:O)","v":0},null,{"$f":"SUMIF('Equipment Options'!N:N,'MeasureTotals Lookups'!$B148,'Equipment Options'!V:V)","v":0},{"$f":"SUMIF('Equipment Options'!N:N,'MeasureTotals Lookups'!$B148,'Equipment Options'!R:R)","v":0},{"$f":"SUMIF('Equipment Options'!N:N,'MeasureTotals Lookups'!$B148,'Equipment Options'!S:S)","v":0},null,null,null,null,null,null,18270,{"$f":"SUMIF('Equipment Options'!N:N,'MeasureTotals Lookups'!$B148,'Equipment Options'!T:T)","v":0},{"$f":"SUMIF('Equipment Options'!N:N,'MeasureTotals Lookups'!$B148,'Equipment Options'!U:U)","v":0},"Commercial Heat Pump Water Heater - Tier 2",0]
[null,"CHPWHT2D",{"$f":"SUMIF('Equipment Options'!N:N,'MeasureTotals Lookups'!$B149,'Equipment Options'!O:O)","v":0},null,{"$f":"SUMIF('Equipment Options'!N:N,'MeasureTotals Lookups'!$B149,'Equipment Options'!V:V)","v":0},{"$f":"SUMIF('Equipment Options'!N:N,'MeasureTotals Lookups'!$B149,'Equipment Options'!R:R)","v":0},{"$f":"SUMIF('Equipment Options'!N:N,'MeasureTotals Lookups'!$B149,'Equipment Options'!S:S)","v":0},null,null,null,null,null,null,18271,{"$f":"SUMIF('Equipment Options'!N:N,'MeasureTotals Lookups'!$B149,'Equipment Options'!T:T)","v":0},{"$f":"SUMIF('Equipment Options'!N:N,'MeasureTotals Lookups'!$B149,'Equipment Options'!U:U)","v":0},"Commercial Heat Pump Water Heater - Tier 2, ducted",0]
[null,"CHPWHT3",{"$f":"SUMIF('Equipment Options'!N:N,'MeasureTotals Lookups'!$B150,'Equipment Options'!O:O)","v":0},null,{"$f":"SUMIF('Equipment Options'!N:N,'MeasureTotals Lookups'!$B150,'Equipment Options'!V:V)","v":0},{"$f":"SUMIF('Equipment Options'!N:N,'MeasureTotals Lookups'!$B150,'Equipment Options'!R:R)","v":0},{"$f":"SUMIF('Equipment Options'!N:N,'MeasureTotals Lookups'!$B150,'Equipment Options'!S:S)","v":0},null,null,null,null,null,null,18272,{"$f":"SUMIF('Equipment Options'!N:N,'MeasureTotals Lookups'!$B150,'Equipment Options'!T:T)","v":0},{"$f":"SUMIF('Equipment Options'!N:N,'MeasureTotals Lookups'!$B150,'Equipment Options'!U:U)","v":0},"Commercial Heat Pump Water Heater - Tier 3",0]
[null,"CHPWHT3D",{"$f":"SUMIF('Equipment Options'!N:N,'MeasureTotals Lookups'!$B151,'Equipment Options'!O:O)","v":0},null,{"$f":"SUMIF('Equipment Options'!N:N,'MeasureTotals Lookups'!$B151,'Equipment Options'!V:V)","v":0},{"$f":"SUMIF('Equipment Options'!N:N,'MeasureTotals Lookups'!$B151,'Equipment Options'!R:R)","v":0},{"$f":"SUMIF('Equipment Options'!N:N,'MeasureTotals Lookups'!$B151,'Equipment Options'!S:S)","v":0},null,null,null,null,null,null,18273,{"$f":"SUMIF('Equipment Options'!N:N,'MeasureTotals Lookups'!$B151,'Equipment Options'!T:T)","v":0},{"$f":"SUMIF('Equipment Options'!N:N,'MeasureTotals Lookups'!$B151,'Equipment Options'!U:U)","v":0},"Commercial Heat Pump Water Heater - Tier 3, ducted",0]
[null,"CHPWHT4UP",{"$f":"SUMIF('Equipment Options'!N:N,'MeasureTotals Lookups'!$B152,'Equipment Options'!O:O)","v":0},null,{"$f":"SUMIF('Equipment Options'!N:N,'MeasureTotals Lookups'!$B152,'Equipment Options'!V:V)","v":0},{"$f":"SUMIF('Equipment Options'!N:N,'MeasureTotals Lookups'!$B152,'Equipment Options'!R:R)","v":0},{"$f":"SUMIF('Equipment Options'!N:N,'MeasureTotals Lookups'!$B152,'Equipment Options'!S:S)","v":0},null,null,null,null,null,null,18274,{"$f":"SUMIF('Equipment Options'!N:N,'MeasureTotals Lookups'!$B152,'Equipment Options'!T:T)","v":0},{"$f":"SUMIF('Equipment Options'!N:N,'MeasureTotals Lookups'!$B152,'Equipment Options'!U:U)","v":0},"Commercial Heat Pump Water Heater - Tier 4 & up",0]
[null,"CHPWHT4UPD",{"$f":"SUMIF('Equipment Options'!N:N,'MeasureTotals Lookups'!$B153,'Equipment Options'!O:O)","v":0},null,{"$f":"SUMIF('Equipment Options'!N:N,'MeasureTotals Lookups'!$B153,'Equipment Options'!V:V)","v":0},{"$f":"SUMIF('Equipment Options'!N:N,'MeasureTotals Lookups'!$B153,'Equipment Options'!R:R)","v":0},{"$f":"SUMIF('Equipment Options'!N:N,'MeasureTotals Lookups'!$B153,'Equipment Options'!S:S)","v":0},null,null,null,null,null,null,18275,{"$f":"SUMIF('Equipment Options'!N:N,'MeasureTotals Lookups'!$B153,'Equipment Options'!T:T)","v":0},{"$f":"SUMIF('Equipment Options'!N:N,'MeasureTotals Lookups'!$B153,'Equipment Options'!U:U)","v":0},"Commercial Heat Pump Water Heater - Tier 4 & up, ducted",0]
[null,"CHPWHT1",{"$f":"SUMIF('Equipment Options'!N:N,'MeasureTotals Lookups'!$B154,'Equipment Options'!O:O)","v":0},null,{"$f":"SUMIF('Equipment Options'!N:N,'MeasureTotals Lookups'!$B154,'Equipment Options'!V:V)","v":0},{"$f":"SUMIF('Equipment Options'!N:N,'MeasureTotals Lookups'!$B154,'Equipment Options'!R:R)","v":0},{"$f":"SUMIF('Equipment Options'!N:N,'MeasureTotals Lookups'!$B154,'Equipment Options'!S:S)","v":0},null,null,null,null,null,null,18364,{"$f":"SUMIF('Equipment Options'!N:N,'MeasureTotals Lookups'!$B154,'Equipment Options'!T:T)","v":0},{"$f":"SUMIF('Equipment Options'!N:N,'MeasureTotals Lookups'!$B154,'Equipment Options'!U:U)","v":0},"Commercial Heat Pump Water Heater - Tier 1",0]
[null,"HPREPHZ23",{"$f":"SUMIF('Equipment Options'!N:N,'MeasureTotals Lookups'!$B155,'Equipment Options'!O:O)","v":0},null,{"$f":"SUMIF('Equipment Options'!N:N,'MeasureTotals Lookups'!$B155,'Equipment Options'!V:V)","v":0},{"$f":"SUMIF('Equipment Options'!N:N,'MeasureTotals Lookups'!$B155,'Equipment Options'!R:R)","v":0},{"$f":"SUMIF('Equipment Options'!N:N,'MeasureTotals Lookups'!$B155,'Equipment Options'!S:S)","v":0},null,null,null,null,null,null,18001,{"$f":"SUMIF('Equipment Options'!N:N,'MeasureTotals Lookups'!$B155,'Equipment Options'!T:T)","v":0},{"$f":"SUMIF('Equipment Options'!N:N,'MeasureTotals Lookups'!$B155,'Equipment Options'!U:U)","v":0},"DHP - Replacement or new HZ2 or HZ3",0]
[null,"HPREPHZ1",{"$f":"SUMIF('Equipment Options'!N:N,'MeasureTotals Lookups'!$B156,'Equipment Options'!O:O)","v":0},null,{"$f":"SUMIF('Equipment Options'!N:N,'MeasureTotals Lookups'!$B156,'Equipment Options'!V:V)","v":0},{"$f":"SUMIF('Equipment Options'!N:N,'MeasureTotals Lookups'!$B156,'Equipment Options'!R:R)","v":0},{"$f":"SUMIF('Equipment Options'!N:N,'MeasureTotals Lookups'!$B156,'Equipment Options'!S:S)","v":0},null,null,null,null,null,null,18002,{"$f":"SUMIF('Equipment Options'!N:N,'MeasureTotals Lookups'!$B156,'Equipment Options'!T:T)","v":0},{"$f":"SUMIF('Equipment Options'!N:N,'MeasureTotals Lookups'!$B156,'Equipment Options'!U:U)","v":0},"DHP - Replacement or new - HZ_all CZs",0]
[null,"BFSS5",{"$f":"SUMIF('Equipment Options'!N:N,'MeasureTotals Lookups'!$B157,'Equipment Options'!O:O)","v":0},null,{"$f":"SUMIF('Equipment Options'!N:N,'MeasureTotals Lookups'!$B157,'Equipment Options'!V:V)","v":0},{"$f":"SUMIF('Equipment Options'!N:N,'MeasureTotals Lookups'!$B157,'Equipment Options'!R:R)","v":0},{"$f":"SUMIF('Equipment Options'!N:N,'MeasureTotals Lookups'!$B157,'Equipment Options'!S:S)","v":0},null,null,null,null,null,null,13853,{"$f":"SUMIF('Equipment Options'!N:N,'MeasureTotals Lookups'!$B157,'Equipment Options'!T:T)","v":0},{"$f":"SUMIF('Equipment Options'!N:N,'MeasureTotals Lookups'!$B157,'Equipment Options'!U:U)","v":0},"Bath Fan - Continuous single speed, <10 cfm/W",0]
[null,"BFSS10",{"$f":"SUMIF('Equipment Options'!N:N,'MeasureTotals Lookups'!$B158,'Equipment Options'!O:O)","v":0},null,{"$f":"SUMIF('Equipment Options'!N:N,'MeasureTotals Lookups'!$B158,'Equipment Options'!V:V)","v":0},{"$f":"SUMIF('Equipment Options'!N:N,'MeasureTotals Lookups'!$B158,'Equipment Options'!R:R)","v":0},{"$f":"SUMIF('Equipment Options'!N:N,'MeasureTotals Lookups'!$B158,'Equipment Options'!S:S)","v":0},null,null,null,null,null,null,13854,{"$f":"SUMIF('Equipment Options'!N:N,'MeasureTotals Lookups'!$B158,'Equipment Options'!T:T)","v":0},{"$f":"SUMIF('Equipment Options'!N:N,'MeasureTotals Lookups'!$B158,'Equipment Options'!U:U)","v":0},"Bath Fan - Continuous single speed, >=10 cfm/W, <15 cfm/W",0]
[null,"BFSS15",{"$f":"SUMIF('Equipment Options'!N:N,'MeasureTotals Lookups'!$B159,'Equipment Options'!O:O)","v":0},null,{"$f":"SUMIF('Equipment Options'!N:N,'MeasureTotals Lookups'!$B159,'Equipment Options'!V:V)","v":0},{"$f":"SUMIF('Equipment Options'!N:N,'MeasureTotals Lookups'!$B159,'Equipment Options'!R:R)","v":0},{"$f":"SUMIF('Equipment Options'!N:N,'MeasureTotals Lookups'!$B159,'Equipment Options'!S:S)","v":0},null,null,null,null,null,null,13855,{"$f":"SUMIF('Equipment Options'!N:N,'MeasureTotals Lookups'!$B159,'Equipment Options'!T:T)","v":0},{"$f":"SUMIF('Equipment Options'!N:N,'MeasureTotals Lookups'!$B159,'Equipment Options'!U:U)","v":0},"Bath Fan - Continuous single speed, >=15 cfm/W",0]
[null,"BFTSSM5",{"$f":"SUMIF('Equipment Options'!N:N,'MeasureTotals Lookups'!$B160,'Equipment Options'!O:O)","v":0},null,{"$f":"SUMIF('Equipment Options'!N:N,'MeasureTotals Lookups'!$B160,'Equipment Options'!V:V)","v":0},{"$f":"SUMIF('Equipment Options'!N:N,'MeasureTotals Lookups'!$B160,'Equipment Options'!R:R)","v":0},{"$f":"SUMIF('Equipment Options'!N:N,'MeasureTotals Lookups'!$B160,'Equipment Options'!S:S)","v":0},null,null,null,null,null,null,13856,{"$f":"SUMIF('Equipment Options'!N:N,'MeasureTotals Lookups'!$B160,'Equipment Options'!T:T)","v":0},{"$f":"SUMIF('Equipment Options'!N:N,'MeasureTotals Lookups'!$B160,'Equipment Options'!U:U)","v":0},"Bath Fan - Continuous two-speed, <90 cfm, >=5 cfm/W, <10 cfm/W",0]
[null,"BFTSSM10",{"$f":"SUMIF('Equipment Options'!N:N,'MeasureTotals Lookups'!$B161,'Equipment Options'!O:O)","v":0},null,{"$f":"SUMIF('Equipment Options'!N:N,'MeasureTotals Lookups'!$B161,'Equipment Options'!V:V)","v":0},{"$f":"SUMIF('Equipment Options'!N:N,'MeasureTotals Lookups'!$B161,'Equipment Options'!R:R)","v":0},{"$f":"SUMIF('Equipment Options'!N:N,'MeasureTotals Lookups'!$B161,'Equipment Options'!S:S)","v":0},null,null,null,null,null,null,13857,{"$f":"SUMIF('Equipment Options'!N:N,'MeasureTotals Lookups'!$B161,'Equipment Options'!T:T)","v":0},{"$f":"SUMIF('Equipment Options'!N:N,'MeasureTotals Lookups'!$B161,'Equipment Options'!U:U)","v":0},"Bath Fan - Continuous two-speed, <90 cfm, >=10 cfm/W, <15 cfm/W",0]
[null,"BFTSSM15",{"$f":"SUMIF('Equipment Options'!N:N,'MeasureTotals Lookups'!$B162,'Equipment Options'!O:O)","v":0},null,{"$f":"SUMIF('Equipment Options'!N:N,'MeasureTotals Lookups'!$B162,'Equipment Options'!V:V)","v":0},{"$f":"SUMIF('Equipment Options'!N:N,'MeasureTotals Lookups'!$B162,'Equipment Options'!R:R)","v":0},{"$f":"SUMIF('Equipment Options'!N:N,'MeasureTotals Lookups'!$B162,'Equipment Options'!S:S)","v":0},null,null,null,null,null,null,13858,{"$f":"SUMIF('Equipment Options'!N:N,'MeasureTotals Lookups'!$B162,'Equipment Options'!T:T)","v":0},{"$f":"SUMIF('Equipment Options'!N:N,'MeasureTotals Lookups'!$B162,'Equipment Options'!U:U)","v":0},"Bath Fan - Continuous two-speed, <90 cfm,  >=15 cfm/W",0]
[null,"BFTSLG5",{"$f":"SUMIF('Equipment Options'!N:N,'MeasureTotals Lookups'!$B163,'Equipment Options'!O:O)","v":0},null,{"$f":"SUMIF('Equipment Options'!N:N,'MeasureTotals Lookups'!$B163,'Equipment Options'!V:V)","v":0},{"$f":"SUMIF('Equipment Options'!N:N,'MeasureTotals Lookups'!$B163,'Equipment Options'!R:R)","v":0},{"$f":"SUMIF('Equipment Options'!N:N,'MeasureTotals Lookups'!$B163,'Equipment Options'!S:S)","v":0},null,null,null,null,null,null,13859,{"$f":"SUMIF('Equipment Options'!N:N,'MeasureTotals Lookups'!$B163,'Equipment Options'!T:T)","v":0},{"$f":"SUMIF('Equipment Options'!N:N,'MeasureTotals Lookups'!$B163,'Equipment Options'!U:U)","v":0},"Bath Fan - two-speed, >90 cfm, >=5 cfm/W, <10 cfm/W",0]
[null,"BFTSLG10",{"$f":"SUMIF('Equipment Options'!N:N,'MeasureTotals Lookups'!$B164,'Equipment Options'!O:O)","v":0},null,{"$f":"SUMIF('Equipment Options'!N:N,'MeasureTotals Lookups'!$B164,'Equipment Options'!V:V)","v":0},{"$f":"SUMIF('Equipment Options'!N:N,'MeasureTotals Lookups'!$B164,'Equipment Options'!R:R)","v":0},{"$f":"SUMIF('Equipment Options'!N:N,'MeasureTotals Lookups'!$B164,'Equipment Options'!S:S)","v":0},null,null,null,null,null,null,{"$f":"_xlfn.XLOOKUP($B164,ProductCode,ProductVersionId,\"\",0)","v":13860},{"$f":"SUMIF('Equipment Options'!N:N,'MeasureTotals Lookups'!$B164,'Equipment Options'!T:T)","v":0},{"$f":"SUMIF('Equipment Options'!N:N,'MeasureTotals Lookups'!$B164,'Equipment Options'!U:U)","v":0},{"$f":"_xlfn.XLOOKUP($B164,ProductCode,ProductDescription,\"\",0)","v":"Bath Fan - two-speed, >90 cfm, >=5 cfm/W,  >=10 cfm/W, <15 cfm/W"},0]
[null,"BFTSLG15",{"$f":"SUMIF('Equipment Options'!N:N,'MeasureTotals Lookups'!$B165,'Equipment Options'!O:O)","v":0},null,{"$f":"SUMIF('Equipment Options'!N:N,'MeasureTotals Lookups'!$B165,'Equipment Options'!V:V)","v":0},{"$f":"SUMIF('Equipment Options'!N:N,'MeasureTotals Lookups'!$B165,'Equipment Options'!R:R)","v":0},{"$f":"SUMIF('Equipment Options'!N:N,'MeasureTotals Lookups'!$B165,'Equipment Options'!S:S)","v":0},null,null,null,null,null,null,13861,{"$f":"SUMIF('Equipment Options'!N:N,'MeasureTotals Lookups'!$B165,'Equipment Options'!T:T)","v":0},{"$f":"SUMIF('Equipment Options'!N:N,'MeasureTotals Lookups'!$B165,'Equipment Options'!U:U)","v":0},"Bath Fan - two-speed, >90 cfm, >=5 cfm/W,  >=15 cfm/W",0]
[null,"GASFURNCONNGO",{"$f":"SUMIF('Equipment Options'!N:N,'MeasureTotals Lookups'!$B166,'Equipment Options'!O:O)","v":0},null,{"$f":"SUMIF('Equipment Options'!N:N,'MeasureTotals Lookups'!$B166,'Equipment Options'!V:V)","v":0},{"$f":"SUMIF('Equipment Options'!N:N,'MeasureTotals Lookups'!$B166,'Equipment Options'!R:R)","v":0},{"$f":"SUMIF('Equipment Options'!N:N,'MeasureTotals Lookups'!$B166,'Equipment Options'!S:S)","v":0},null,null,null,null,null,null,17835,{"$f":"SUMIF('Equipment Options'!N:N,'MeasureTotals Lookups'!$B166,'Equipment Options'!T:T)","v":0},{"$f":"SUMIF('Equipment Options'!N:N,'MeasureTotals Lookups'!$B166,'Equipment Options'!U:U)","v":0},"Commercial Condensing Gas Furnace 95%+ New Site Gas Only",0]
[null,"GASFURNCONN",{"$f":"SUMIF('Equipment Options'!N:N,'MeasureTotals Lookups'!$B167,'Equipment Options'!O:O)","v":0},null,{"$f":"SUMIF('Equipment Options'!N:N,'MeasureTotals Lookups'!$B167,'Equipment Options'!V:V)","v":0},{"$f":"SUMIF('Equipment Options'!N:N,'MeasureTotals Lookups'!$B167,'Equipment Options'!R:R)","v":0},{"$f":"SUMIF('Equipment Options'!N:N,'MeasureTotals Lookups'!$B167,'Equipment Options'!S:S)","v":0},null,null,null,null,null,null,17849,{"$f":"SUMIF('Equipment Options'!N:N,'MeasureTotals Lookups'!$B167,'Equipment Options'!T:T)","v":0},{"$f":"SUMIF('Equipment Options'!N:N,'MeasureTotals Lookups'!$B167,'Equipment Options'!U:U)","v":0},"Commercial Condensing Gas Furnace 95%+ New Site",0]
[null,"VFDGARMFSM2019",{"$f":"SUMIF('Equipment Options'!N:N,'MeasureTotals Lookups'!$B168,'Equipment Options'!O:O)","v":0},null,{"$f":"SUMIF('Equipment Options'!N:N,'MeasureTotals Lookups'!$B168,'Equipment Options'!V:V)","v":0},{"$f":"SUMIF('Equipment Options'!N:N,'MeasureTotals Lookups'!$B168,'Equipment Options'!R:R)","v":0},{"$f":"SUMIF('Equipment Options'!N:N,'MeasureTotals Lookups'!$B168,'Equipment Options'!S:S)","v":0},null,null,null,null,null,null,13445,{"$f":"SUMIF('Equipment Options'!N:N,'MeasureTotals Lookups'!$B168,'Equipment Options'!T:T)","v":0},{"$f":"SUMIF('Equipment Options'!N:N,'MeasureTotals Lookups'!$B168,'Equipment Options'!U:U)","v":0},"VFD - Parking Garage MF <8,000 CFM",0]
[null,"VFDGARMFLG2019",{"$f":"SUMIF('Equipment Options'!N:N,'MeasureTotals Lookups'!$B169,'Equipment Options'!O:O)","v":0},null,{"$f":"SUMIF('Equipment Options'!N:N,'MeasureTotals Lookups'!$B169,'Equipment Options'!V:V)","v":0},{"$f":"SUMIF('Equipment Options'!N:N,'MeasureTotals Lookups'!$B169,'Equipment Options'!R:R)","v":0},{"$f":"SUMIF('Equipment Options'!N:N,'MeasureTotals Lookups'!$B169,'Equipment Options'!S:S)","v":0},null,null,null,null,null,null,13446,{"$f":"SUMIF('Equipment Options'!N:N,'MeasureTotals Lookups'!$B169,'Equipment Options'!T:T)","v":0},{"$f":"SUMIF('Equipment Options'!N:N,'MeasureTotals Lookups'!$B169,'Equipment Options'!U:U)","v":0},"VFD - Parking Garage MF >=8,000 CFM",0]
[null,"VFDGARMFSM",{"$f":"SUMIF('Equipment Options'!N:N,'MeasureTotals Lookups'!$B170,'Equipment Options'!O:O)","v":0},null,{"$f":"SUMIF('Equipment Options'!N:N,'MeasureTotals Lookups'!$B170,'Equipment Options'!V:V)","v":0},{"$f":"SUMIF('Equipment Options'!N:N,'MeasureTotals Lookups'!$B170,'Equipment Options'!R:R)","v":0},{"$f":"SUMIF('Equipment Options'!N:N,'MeasureTotals Lookups'!$B170,'Equipment Options'!S:S)","v":0},null,null,null,null,null,null,13447,{"$f":"SUMIF('Equipment Options'!N:N,'MeasureTotals Lookups'!$B170,'Equipment Options'!T:T)","v":0},{"$f":"SUMIF('Equipment Options'!N:N,'MeasureTotals Lookups'!$B170,'Equipment Options'!U:U)","v":0},"VFD - Parking Garage MF < 30,000 sq ft",0]
[null,"VFDGARMFLG",{"$f":"SUMIF('Equipment Options'!N:N,'MeasureTotals Lookups'!$B171,'Equipment Options'!O:O)","v":0},null,{"$f":"SUMIF('Equipment Options'!N:N,'MeasureTotals Lookups'!$B171,'Equipment Options'!V:V)","v":0},{"$f":"SUMIF('Equipment Options'!N:N,'MeasureTotals Lookups'!$B171,'Equipment Options'!R:R)","v":0},{"$f":"SUMIF('Equipment Options'!N:N,'MeasureTotals Lookups'!$B171,'Equipment Options'!S:S)","v":0},null,null,null,null,null,null,13448,{"$f":"SUMIF('Equipment Options'!N:N,'MeasureTotals Lookups'!$B171,'Equipment Options'!T:T)","v":0},{"$f":"SUMIF('Equipment Options'!N:N,'MeasureTotals Lookups'!$B171,'Equipment Options'!U:U)","v":0},"VFD - Parking Garage MF >= 30,000 sq ft",0]
[null,"VFDGARNMFSM",{"$f":"SUMIF('Equipment Options'!N:N,'MeasureTotals Lookups'!$B172,'Equipment Options'!O:O)","v":0},null,{"$f":"SUMIF('Equipment Options'!N:N,'MeasureTotals Lookups'!$B172,'Equipment Options'!V:V)","v":0},{"$f":"SUMIF('Equipment Options'!N:N,'MeasureTotals Lookups'!$B172,'Equipment Options'!R:R)","v":0},{"$f":"SUMIF('Equipment Options'!N:N,'MeasureTotals Lookups'!$B172,'Equipment Options'!S:S)","v":0},null,null,null,null,null,null,13449,{"$f":"SUMIF('Equipment Options'!N:N,'MeasureTotals Lookups'!$B172,'Equipment Options'!T:T)","v":0},{"$f":"SUMIF('Equipment Options'!N:N,'MeasureTotals Lookups'!$B172,'Equipment Options'!U:U)","v":0},"VFD - Parking Garage < 30,000 sq ft",0]
[null,"VFDGARNMFLG",{"$f":"SUMIF('Equipment Options'!N:N,'MeasureTotals Lookups'!$B173,'Equipment Options'!O:O)","v":0},null,{"$f":"SUMIF('Equipment Options'!N:N,'MeasureTotals Lookups'!$B173,'Equipment Options'!V:V)","v":0},{"$f":"SUMIF('Equipment Options'!N:N,'MeasureTotals Lookups'!$B173,'Equipment Options'!R:R)","v":0},{"$f":"SUMIF('Equipment Options'!N:N,'MeasureTotals Lookups'!$B173,'Equipment Options'!S:S)","v":0},null,null,null,null,null,null,13450,{"$f":"SUMIF('Equipment Options'!N:N,'MeasureTotals Lookups'!$B173,'Equipment Options'!T:T)","v":0},{"$f":"SUMIF('Equipment Options'!N:N,'MeasureTotals Lookups'!$B173,'Equipment Options'!U:U)","v":0},"VFD - Parking Garage >= 30,000 sq ft",0]
[null,"CPUMPVSDHEAT5HP",{"$f":"SUMIF('Equipment Options'!N:N,'MeasureTotals Lookups'!$B174,'Equipment Options'!O:O)","v":0},null,{"$f":"SUMIF('Equipment Options'!N:N,'MeasureTotals Lookups'!$B174,'Equipment Options'!V:V)","v":0},{"$f":"SUMIF('Equipment Options'!N:N,'MeasureTotals Lookups'!$B174,'Equipment Options'!R:R)","v":0},{"$f":"SUMIF('Equipment Options'!N:N,'MeasureTotals Lookups'!$B174,'Equipment Options'!S:S)","v":0},null,null,null,null,null,null,{"$f":"_xlfn.XLOOKUP($B174,ProductCode,ProductVersionId,\"\",0)","v":15287},{"$f":"SUMIF('Equipment Options'!N:N,'MeasureTotals Lookups'!$B174,'Equipment Options'!T:T)","v":0},{"$f":"SUMIF('Equipment Options'!N:N,'MeasureTotals Lookups'!$B174,'Equipment Options'!U:U)","v":0},{"$f":"_xlfn.XLOOKUP($B174,ProductCode,ProductDescription,\"\",0)","v":"Commercial Pump VSD_Heating_New Pump_5 HP (4.51 to 6.00 HP)"},0]
[null,"CPUMPVSDCOOL4HP",{"$f":"SUMIF('Equipment Options'!N:N,'MeasureTotals Lookups'!$B175,'Equipment Options'!O:O)","v":0},null,{"$f":"SUMIF('Equipment Options'!N:N,'MeasureTotals Lookups'!$B175,'Equipment Options'!V:V)","v":0},{"$f":"SUMIF('Equipment Options'!N:N,'MeasureTotals Lookups'!$B175,'Equipment Options'!R:R)","v":0},{"$f":"SUMIF('Equipment Options'!N:N,'MeasureTotals Lookups'!$B175,'Equipment Options'!S:S)","v":0},null,null,null,null,null,null,15288,{"$f":"SUMIF('Equipment Options'!N:N,'MeasureTotals Lookups'!$B175,'Equipment Options'!T:T)","v":0},{"$f":"SUMIF('Equipment Options'!N:N,'MeasureTotals Lookups'!$B175,'Equipment Options'!U:U)","v":0},"Comm Pump VSD_Cooling_New Pump_4 HP (3.51 to 4.50 HP)",0]
[null,"CPUMPVSDCOOL3HP",{"$f":"SUMIF('Equipment Options'!N:N,'MeasureTotals Lookups'!$B176,'Equipment Options'!O:O)","v":0},null,{"$f":"SUMIF('Equipment Options'!N:N,'MeasureTotals Lookups'!$B176,'Equipment Options'!V:V)","v":0},{"$f":"SUMIF('Equipment Options'!N:N,'MeasureTotals Lookups'!$B176,'Equipment Options'!R:R)","v":0},{"$f":"SUMIF('Equipment Options'!N:N,'MeasureTotals Lookups'!$B176,'Equipment Options'!S:S)","v":0},null,null,null,null,null,null,15289,{"$f":"SUMIF('Equipment Options'!N:N,'MeasureTotals Lookups'!$B176,'Equipment Options'!T:T)","v":0},{"$f":"SUMIF('Equipment Options'!N:N,'MeasureTotals Lookups'!$B176,'Equipment Options'!U:U)","v":0},"Comm Pump VSD_Cooling_New Pump_3 HP (2.51 to 3.50 HP)",0]
[null,"CPUMPVSDPB7P5HP",{"$f":"SUMIF('Equipment Options'!N:N,'MeasureTotals Lookups'!$B177,'Equipment Options'!O:O)","v":0},null,{"$f":"SUMIF('Equipment Options'!N:N,'MeasureTotals Lookups'!$B177,'Equipment Options'!V:V)","v":0},{"$f":"SUMIF('Equipment Options'!N:N,'MeasureTotals Lookups'!$B177,'Equipment Options'!R:R)","v":0},{"$f":"SUMIF('Equipment Options'!N:N,'MeasureTotals Lookups'!$B177,'Equipment Options'!S:S)","v":0},null,null,null,null,null,null,15290,{"$f":"SUMIF('Equipment Options'!N:N,'MeasureTotals Lookups'!$B177,'Equipment Options'!T:T)","v":0},{"$f":"SUMIF('Equipment Options'!N:N,'MeasureTotals Lookups'!$B177,'Equipment Options'!U:U)","v":0},"Comm Pump VSD_Pressure Boost_New Pump_7.5 HP (6.01 to 8.00 HP)",0]
[null,"CPUMPVSDPB4HP",{"$f":"SUMIF('Equipment Options'!N:N,'MeasureTotals Lookups'!$B178,'Equipment Options'!O:O)","v":0},null,{"$f":"SUMIF('Equipment Options'!N:N,'MeasureTotals Lookups'!$B178,'Equipment Options'!V:V)","v":0},{"$f":"SUMIF('Equipment Options'!N:N,'MeasureTotals Lookups'!$B178,'Equipment Options'!R:R)","v":0},{"$f":"SUMIF('Equipment Options'!N:N,'MeasureTotals Lookups'!$B178,'Equipment Options'!S:S)","v":0},null,null,null,null,null,null,15291,{"$f":"SUMIF('Equipment Options'!N:N,'MeasureTotals Lookups'!$B178,'Equipment Options'!T:T)","v":0},{"$f":"SUMIF('Equipment Options'!N:N,'MeasureTotals Lookups'!$B178,'Equipment Options'!U:U)","v":0},"Comm Pump VSD_Pressure Boost_New Pump_4 HP (3.51 to 4.50 HP)",0]
[null,"CPUMPVSDHEAT0P75",{"$f":"SUMIF('Equipment Options'!N:N,'MeasureTotals Lookups'!$B179,'Equipment Options'!O:O)","v":0},null,{"$f":"SUMIF('Equipment Options'!N:N,'MeasureTotals Lookups'!$B179,'Equipment Options'!V:V)","v":0},{"$f":"SUMIF('Equipment Options'!N:N,'MeasureTotals Lookups'!$B179,'Equipment Options'!R:R)","v":0},{"$f":"SUMIF('Equipment Options'!N:N,'MeasureTotals Lookups'!$B179,'Equipment Options'!S:S)","v":0},null,null,null,null,null,null,15292,{"$f":"SUMIF('Equipment Options'!N:N,'MeasureTotals Lookups'!$B179,'Equipment Options'!T:T)","v":0},{"$f":"SUMIF('Equipment Options'!N:N,'MeasureTotals Lookups'!$B179,'Equipment Options'!U:U)","v":0},"Commercial Pump VSD_Heating_New Pump_0.75 HP (0.50 to 0.75 HP)",0]
[null,"CPUMPVSDHEAT4HP",{"$f":"SUMIF('Equipment Options'!N:N,'MeasureTotals Lookups'!$B180,'Equipment Options'!O:O)","v":0},null,{"$f":"SUMIF('Equipment Options'!N:N,'MeasureTotals Lookups'!$B180,'Equipment Options'!V:V)","v":0},{"$f":"SUMIF('Equipment Options'!N:N,'MeasureTotals Lookups'!$B180,'Equipment Options'!R:R)","v":0},{"$f":"SUMIF('Equipment Options'!N:N,'MeasureTotals Lookups'!$B180,'Equipment Options'!S:S)","v":0},null,null,null,null,null,null,15293,{"$f":"SUMIF('Equipment Options'!N:N,'MeasureTotals Lookups'!$B180,'Equipment Options'!T:T)","v":0},{"$f":"SUMIF('Equipment Options'!N:N,'MeasureTotals Lookups'!$B180,'Equipment Options'!U:U)","v":0},"Commercial Pump VSD_Heating_New Pump_4 HP (3.51 to 4.50 HP)",0]
[null,"CPUMPVSDCOOLT5HP",{"$f":"SUMIF('Equipment Options'!N:N,'MeasureTotals Lookups'!$B181,'Equipment Options'!O:O)","v":0},null,{"$f":"SUMIF('Equipment Options'!N:N,'MeasureTotals Lookups'!$B181,'Equipment Options'!V:V)","v":0},{"$f":"SUMIF('Equipment Options'!N:N,'MeasureTotals Lookups'!$B181,'Equipment Options'!R:R)","v":0},{"$f":"SUMIF('Equipment Options'!N:N,'MeasureTotals Lookups'!$B181,'Equipment Options'!S:S)","v":0},null,null,null,null,null,null,15294,{"$f":"SUMIF('Equipment Options'!N:N,'MeasureTotals Lookups'!$B181,'Equipment Options'!T:T)","v":0},{"$f":"SUMIF('Equipment Options'!N:N,'MeasureTotals Lookups'!$B181,'Equipment Options'!U:U)","v":0},"Comm Pump VSD_Cooling Tower_New Pump_5 HP (4.51 to 6.00 HP)",0]
[null,"CPUMPVSDPB15HP",{"$f":"SUMIF('Equipment Options'!N:N,'MeasureTotals Lookups'!$B182,'Equipment Options'!O:O)","v":0},null,{"$f":"SUMIF('Equipment Options'!N:N,'MeasureTotals Lookups'!$B182,'Equipment Options'!V:V)","v":0},{"$f":"SUMIF('Equipment Options'!N:N,'MeasureTotals Lookups'!$B182,'Equipment Options'!R:R)","v":0},{"$f":"SUMIF('Equipment Options'!N:N,'MeasureTotals Lookups'!$B182,'Equipment Options'!S:S)","v":0},null,null,null,null,null,null,15295,{"$f":"SUMIF('Equipment Options'!N:N,'MeasureTotals Lookups'!$B182,'Equipment Options'!T:T)","v":0},{"$f":"SUMIF('Equipment Options'!N:N,'MeasureTotals Lookups'!$B182,'Equipment Options'!U:U)","v":0},"Comm Pump VSD_Pressure Boost_New Pump_15 HP (12.51 to 17.50 HP)",0]
[null,"CPUMPVSDPB3HP",{"$f":"SUMIF('Equipment Options'!N:N,'MeasureTotals Lookups'!$B183,'Equipment Options'!O:O)","v":0},null,{"$f":"SUMIF('Equipment Options'!N:N,'MeasureTotals Lookups'!$B183,'Equipment Options'!V:V)","v":0},{"$f":"SUMIF('Equipment Options'!N:N,'MeasureTotals Lookups'!$B183,'Equipment Options'!R:R)","v":0},{"$f":"SUMIF('Equipment Options'!N:N,'MeasureTotals Lookups'!$B183,'Equipment Options'!S:S)","v":0},null,null,null,null,null,null,15296,{"$f":"SUMIF('Equipment Options'!N:N,'MeasureTotals Lookups'!$B183,'Equipment Options'!T:T)","v":0},{"$f":"SUMIF('Equipment Options'!N:N,'MeasureTotals Lookups'!$B183,'Equipment Options'!U:U)","v":0},"Comm Pump VSD_Pressure Boost_New Pump_3 HP (2.51 to 3.50 HP)",0]
[null,"CPUMPVSDPB10HP",{"$f":"SUMIF('Equipment Options'!N:N,'MeasureTotals Lookups'!$B184,'Equipment Options'!O:O)","v":0},null,{"$f":"SUMIF('Equipment Options'!N:N,'MeasureTotals Lookups'!$B184,'Equipment Options'!V:V)","v":0},{"$f":"SUMIF('Equipment Options'!N:N,'MeasureTotals Lookups'!$B184,'Equipment Options'!R:R)","v":0},{"$f":"SUMIF('Equipment Options'!N:N,'MeasureTotals Lookups'!$B184,'Equipment Options'!S:S)","v":0},null,null,null,null,null,null,15297,{"$f":"SUMIF('Equipment Options'!N:N,'MeasureTotals Lookups'!$B184,'Equipment Options'!T:T)","v":0},{"$f":"SUMIF('Equipment Options'!N:N,'MeasureTotals Lookups'!$B184,'Equipment Options'!U:U)","v":0},"Comm Pump VSD_Pressure Boost_New Pump_10 HP (8.01 to 12.50 HP)",0]
[null,"CPUMPVSDCOOLT7P5HP",{"$f":"SUMIF('Equipment Options'!N:N,'MeasureTotals Lookups'!$B185,'Equipment Options'!O:O)","v":0},null,{"$f":"SUMIF('Equipment Options'!N:N,'MeasureTotals Lookups'!$B185,'Equipment Options'!V:V)","v":0},{"$f":"SUMIF('Equipment Options'!N:N,'MeasureTotals Lookups'!$B185,'Equipment Options'!R:R)","v":0},{"$f":"SUMIF('Equipment Options'!N:N,'MeasureTotals Lookups'!$B185,'Equipment Options'!S:S)","v":0},null,null,null,null,null,null,15298,{"$f":"SUMIF('Equipment Options'!N:N,'MeasureTotals Lookups'!$B185,'Equipment Options'!T:T)","v":0},{"$f":"SUMIF('Equipment Options'!N:N,'MeasureTotals Lookups'!$B185,'Equipment Options'!U:U)","v":0},"Comm Pump VSD_Cooling Tower_New Pump_7.5 HP (6.01 to 8.00 HP)",0]
[null,"CPUMPVSDHEAT2HP",{"$f":"SUMIF('Equipment Options'!N:N,'MeasureTotals Lookups'!$B186,'Equipment Options'!O:O)","v":0},null,{"$f":"SUMIF('Equipment Options'!N:N,'MeasureTotals Lookups'!$B186,'Equipment Options'!V:V)","v":0},{"$f":"SUMIF('Equipment Options'!N:N,'MeasureTotals Lookups'!$B186,'Equipment Options'!R:R)","v":0},{"$f":"SUMIF('Equipment Options'!N:N,'MeasureTotals Lookups'!$B186,'Equipment Options'!S:S)","v":0},null,null,null,null,null,null,15299,{"$f":"SUMIF('Equipment Options'!N:N,'MeasureTotals Lookups'!$B186,'Equipment Options'!T:T)","v":0},{"$f":"SUMIF('Equipment Options'!N:N,'MeasureTotals Lookups'!$B186,'Equipment Options'!U:U)","v":0},"Commercial Pump VSD_Heating_New Pump_2 HP (1.76 to 2.50 HP)",0]
[null,"CPUMPVSDCOOL1HP",{"$f":"SUMIF('Equipment Options'!N:N,'MeasureTotals Lookups'!$B187,'Equipment Options'!O:O)","v":0},null,{"$f":"SUMIF('Equipment Options'!N:N,'MeasureTotals Lookups'!$B187,'Equipment Options'!V:V)","v":0},{"$f":"SUMIF('Equipment Options'!N:N,'MeasureTotals Lookups'!$B187,'Equipment Options'!R:R)","v":0},{"$f":"SUMIF('Equipment Options'!N:N,'MeasureTotals Lookups'!$B187,'Equipment Options'!S:S)","v":0},null,null,null,null,null,null,15300,{"$f":"SUMIF('Equipment Options'!N:N,'MeasureTotals Lookups'!$B187,'Equipment Options'!T:T)","v":0},{"$f":"SUMIF('Equipment Options'!N:N,'MeasureTotals Lookups'!$B187,'Equipment Options'!U:U)","v":0},"Comm Pump VSD_Cooling_New Pump_1 HP (0.76 to 1.25 HP)",0]
[null,"CPUMPVSDCOOL2HP",{"$f":"SUMIF('Equipment Options'!N:N,'MeasureTotals Lookups'!$B188,'Equipment Options'!O:O)","v":0},null,{"$f":"SUMIF('Equipment Options'!N:N,'MeasureTotals Lookups'!$B188,'Equipment Options'!V:V)","v":0},{"$f":"SUMIF('Equipment Options'!N:N,'MeasureTotals Lookups'!$B188,'Equipment Options'!R:R)","v":0},{"$f":"SUMIF('Equipment Options'!N:N,'MeasureTotals Lookups'!$B188,'Equipment Options'!S:S)","v":0},null,null,null,null,null,null,15301,{"$f":"SUMIF('Equipment Options'!N:N,'MeasureTotals Lookups'!$B188,'Equipment Options'!T:T)","v":0},{"$f":"SUMIF('Equipment Options'!N:N,'MeasureTotals Lookups'!$B188,'Equipment Options'!U:U)","v":0},"Comm Pump VSD_Cooling_New Pump_2 HP (1.76 to 2.50 HP)",0]
[null,"CPUMPVSDPB2HP",{"$f":"SUMIF('Equipment Options'!N:N,'MeasureTotals Lookups'!$B189,'Equipment Options'!O:O)","v":0},null,{"$f":"SUMIF('Equipment Options'!N:N,'MeasureTotals Lookups'!$B189,'Equipment Options'!V:V)","v":0},{"$f":"SUMIF('Equipment Options'!N:N,'MeasureTotals Lookups'!$B189,'Equipment Options'!R:R)","v":0},{"$f":"SUMIF('Equipment Options'!N:N,'MeasureTotals Lookups'!$B189,'Equipment Options'!S:S)","v":0},null,null,null,null,null,null,15303,{"$f":"SUMIF('Equipment Options'!N:N,'MeasureTotals Lookups'!$B189,'Equipment Options'!T:T)","v":0},{"$f":"SUMIF('Equipment Options'!N:N,'MeasureTotals Lookups'!$B189,'Equipment Options'!U:U)","v":0},"Comm Pump VSD_Pressure Boost_New Pump_2 HP (1.76 to 2.50 HP)",0]
[null,"CPUMPVSDCOOLT15HP",{"$f":"SUMIF('Equipment Options'!N:N,'MeasureTotals Lookups'!$B190,'Equipment Options'!O:O)","v":0},null,{"$f":"SUMIF('Equipment Options'!N:N,'MeasureTotals Lookups'!$B190,'Equipment Options'!V:V)","v":0},{"$f":"SUMIF('Equipment Options'!N:N,'MeasureTotals Lookups'!$B190,'Equipment Options'!R:R)","v":0},{"$f":"SUMIF('Equipment Options'!N:N,'MeasureTotals Lookups'!$B190,'Equipment Options'!S:S)","v":0},null,null,null,null,null,null,15304,{"$f":"SUMIF('Equipment Options'!N:N,'MeasureTotals Lookups'!$B190,'Equipment Options'!T:T)","v":0},{"$f":"SUMIF('Equipment Options'!N:N,'MeasureTotals Lookups'!$B190,'Equipment Options'!U:U)","v":0},"Comm Pump VSD_Cooling Tower_New Pump_15 HP (12.51 to 17.50 HP)",0]
[null,"CPUMPVSDPB20HP",{"$f":"SUMIF('Equipment Options'!N:N,'MeasureTotals Lookups'!$B191,'Equipment Options'!O:O)","v":0},null,{"$f":"SUMIF('Equipment Options'!N:N,'MeasureTotals Lookups'!$B191,'Equipment Options'!V:V)","v":0},{"$f":"SUMIF('Equipment Options'!N:N,'MeasureTotals Lookups'!$B191,'Equipment Options'!R:R)","v":0},{"$f":"SUMIF('Equipment Options'!N:N,'MeasureTotals Lookups'!$B191,'Equipment Options'!S:S)","v":0},null,null,null,null,null,null,15305,{"$f":"SUMIF('Equipment Options'!N:N,'MeasureTotals Lookups'!$B191,'Equipment Options'!T:T)","v":0},{"$f":"SUMIF('Equipment Options'!N:N,'MeasureTotals Lookups'!$B191,'Equipment Options'!U:U)","v":0},"Comm Pump VSD_Pressure Boost_New Pump_20 HP (17.51 to 22.50 HP)",0]
[null,"CPUMPVSDPB5HP",{"$f":"SUMIF('Equipment Options'!N:N,'MeasureTotals Lookups'!$B192,'Equipment Options'!O:O)","v":0},null,{"$f":"SUMIF('Equipment Options'!N:N,'MeasureTotals Lookups'!$B192,'Equipment Options'!V:V)","v":0},{"$f":"SUMIF('Equipment Options'!N:N,'MeasureTotals Lookups'!$B192,'Equipment Options'!R:R)","v":0},{"$f":"SUMIF('Equipment Options'!N:N,'MeasureTotals Lookups'!$B192,'Equipment Options'!S:S)","v":0},null,null,null,null,null,null,15306,{"$f":"SUMIF('Equipment Options'!N:N,'MeasureTotals Lookups'!$B192,'Equipment Options'!T:T)","v":0},{"$f":"SUMIF('Equipment Options'!N:N,'MeasureTotals Lookups'!$B192,'Equipment Options'!U:U)","v":0},"Comm Pump VSD_Pressure Boost_New Pump_5 HP (4.51 to 6.00 HP)",0]
[null,"CPUMPVSDCOOL0P75HP",{"$f":"SUMIF('Equipment Options'!N:N,'MeasureTotals Lookups'!$B193,'Equipment Options'!O:O)","v":0},null,{"$f":"SUMIF('Equipment Options'!N:N,'MeasureTotals Lookups'!$B193,'Equipment Options'!V:V)","v":0},{"$f":"SUMIF('Equipment Options'!N:N,'MeasureTotals Lookups'!$B193,'Equipment Options'!R:R)","v":0},{"$f":"SUMIF('Equipment Options'!N:N,'MeasureTotals Lookups'!$B193,'Equipment Options'!S:S)","v":0},null,null,null,null,null,null,15307,{"$f":"SUMIF('Equipment Options'!N:N,'MeasureTotals Lookups'!$B193,'Equipment Options'!T:T)","v":0},{"$f":"SUMIF('Equipment Options'!N:N,'MeasureTotals Lookups'!$B193,'Equipment Options'!U:U)","v":0},"Comm Pump VSD_Cooling_New Pump_0.75 HP (0.50 to 0.75 HP)",0]
[null,"CPUMPVSDCOOL1P5HP",{"$f":"SUMIF('Equipment Options'!N:N,'MeasureTotals Lookups'!$B194,'Equipment Options'!O:O)","v":0},null,{"$f":"SUMIF('Equipment Options'!N:N,'MeasureTotals Lookups'!$B194,'Equipment Options'!V:V)","v":0},{"$f":"SUMIF('Equipment Options'!N:N,'MeasureTotals Lookups'!$B194,'Equipment Options'!R:R)","v":0},{"$f":"SUMIF('Equipment Options'!N:N,'MeasureTotals Lookups'!$B194,'Equipment Options'!S:S)","v":0},null,null,null,null,null,null,15308,{"$f":"SUMIF('Equipment Options'!N:N,'MeasureTotals Lookups'!$B194,'Equipment Options'!T:T)","v":0},{"$f":"SUMIF('Equipment Options'!N:N,'MeasureTotals Lookups'!$B194,'Equipment Options'!U:U)","v":0},"Comm Pump VSD_Cooling_New Pump_1.5 HP (1.26 to 1.75 HP)",0]
[null,"CPUMPVSDHEAT7P5HP",{"$f":"SUMIF('Equipment Options'!N:N,'MeasureTotals Lookups'!$B195,'Equipment Options'!O:O)","v":0},null,{"$f":"SUMIF('Equipment Options'!N:N,'MeasureTotals Lookups'!$B195,'Equipment Options'!V:V)","v":0},{"$f":"SUMIF('Equipment Options'!N:N,'MeasureTotals Lookups'!$B195,'Equipment Options'!R:R)","v":0},{"$f":"SUMIF('Equipment Options'!N:N,'MeasureTotals Lookups'!$B195,'Equipment Options'!S:S)","v":0},null,null,null,null,null,null,15309,{"$f":"SUMIF('Equipment Options'!N:N,'MeasureTotals Lookups'!$B195,'Equipment Options'!T:T)","v":0},{"$f":"SUMIF('Equipment Options'!N:N,'MeasureTotals Lookups'!$B195,'Equipment Options'!U:U)","v":0},"Commercial Pump VSD_Heating_New Pump_7.5 HP (6.01 to 8.00 HP)",0]
[null,"CPUMPVSDCOOL5HP",{"$f":"SUMIF('Equipment Options'!N:N,'MeasureTotals Lookups'!$B196,'Equipment Options'!O:O)","v":0},null,{"$f":"SUMIF('Equipment Options'!N:N,'MeasureTotals Lookups'!$B196,'Equipment Options'!V:V)","v":0},{"$f":"SUMIF('Equipment Options'!N:N,'MeasureTotals Lookups'!$B196,'Equipment Options'!R:R)","v":0},{"$f":"SUMIF('Equipment Options'!N:N,'MeasureTotals Lookups'!$B196,'Equipment Options'!S:S)","v":0},null,null,null,null,null,null,15310,{"$f":"SUMIF('Equipment Options'!N:N,'MeasureTotals Lookups'!$B196,'Equipment Options'!T:T)","v":0},{"$f":"SUMIF('Equipment Options'!N:N,'MeasureTotals Lookups'!$B196,'Equipment Options'!U:U)","v":0},"Comm Pump VSD_Cooling_New Pump_5 HP (4.51 to 6.00 HP)",{"$f":"(_xlfn.XLOOKUP($B196,ProductCode,IncrementalCost,\"\",0))*C196","v":0}]
[null,"CPUMPVSDHEAT3HP",{"$f":"SUMIF('Equipment Options'!N:N,'MeasureTotals Lookups'!$B197,'Equipment Options'!O:O)","v":0},null,{"$f":"SUMIF('Equipment Options'!N:N,'MeasureTotals Lookups'!$B197,'Equipment Options'!V:V)","v":0},{"$f":"SUMIF('Equipment Options'!N:N,'MeasureTotals Lookups'!$B197,'Equipment Options'!R:R)","v":0},{"$f":"SUMIF('Equipment Options'!N:N,'MeasureTotals Lookups'!$B197,'Equipment Options'!S:S)","v":0},null,null,null,null,null,null,15311,{"$f":"SUMIF('Equipment Options'!N:N,'MeasureTotals Lookups'!$B197,'Equipment Options'!T:T)","v":0},{"$f":"SUMIF('Equipment Options'!N:N,'MeasureTotals Lookups'!$B197,'Equipment Options'!U:U)","v":0},"Commercial Pump VSD_Heating_New Pump_3 HP (2.51 to 3.50 HP)",0]
[null,"CPUMPVSDHEAT1P5HP",{"$f":"SUMIF('Equipment Options'!N:N,'MeasureTotals Lookups'!$B198,'Equipment Options'!O:O)","v":0},null,{"$f":"SUMIF('Equipment Options'!N:N,'MeasureTotals Lookups'!$B198,'Equipment Options'!V:V)","v":0},{"$f":"SUMIF('Equipment Options'!N:N,'MeasureTotals Lookups'!$B198,'Equipment Options'!R:R)","v":0},{"$f":"SUMIF('Equipment Options'!N:N,'MeasureTotals Lookups'!$B198,'Equipment Options'!S:S)","v":0},null,null,null,null,null,null,15312,{"$f":"SUMIF('Equipment Options'!N:N,'MeasureTotals Lookups'!$B198,'Equipment Options'!T:T)","v":0},{"$f":"SUMIF('Equipment Options'!N:N,'MeasureTotals Lookups'!$B198,'Equipment Options'!U:U)","v":0},"Commercial Pump VSD_Heating_New Pump_1.5 HP (1.26 to 1.75 HP)",0]
[null,"CPUMPVSDHEAT1HP",{"$f":"SUMIF('Equipment Options'!N:N,'MeasureTotals Lookups'!$B199,'Equipment Options'!O:O)","v":0},null,{"$f":"SUMIF('Equipment Options'!N:N,'MeasureTotals Lookups'!$B199,'Equipment Options'!V:V)","v":0},{"$f":"SUMIF('Equipment Options'!N:N,'MeasureTotals Lookups'!$B199,'Equipment Options'!R:R)","v":0},{"$f":"SUMIF('Equipment Options'!N:N,'MeasureTotals Lookups'!$B199,'Equipment Options'!S:S)","v":0},null,null,null,null,null,null,15313,{"$f":"SUMIF('Equipment Options'!N:N,'MeasureTotals Lookups'!$B199,'Equipment Options'!T:T)","v":0},{"$f":"SUMIF('Equipment Options'!N:N,'MeasureTotals Lookups'!$B199,'Equipment Options'!U:U)","v":0},"Commercial Pump VSD_Heating_New Pump_1 HP (0.76 to 1.25 HP)",0]
[null,"CPUMPVSDPB1P5HP",{"$f":"SUMIF('Equipment Options'!N:N,'MeasureTotals Lookups'!$B200,'Equipment Options'!O:O)","v":0},null,{"$f":"SUMIF('Equipment Options'!N:N,'MeasureTotals Lookups'!$B200,'Equipment Options'!V:V)","v":0},{"$f":"SUMIF('Equipment Options'!N:N,'MeasureTotals Lookups'!$B200,'Equipment Options'!R:R)","v":0},{"$f":"SUMIF('Equipment Options'!N:N,'MeasureTotals Lookups'!$B200,'Equipment Options'!S:S)","v":0},null,null,null,null,null,null,15314,{"$f":"SUMIF('Equipment Options'!N:N,'MeasureTotals Lookups'!$B200,'Equipment Options'!T:T)","v":0},{"$f":"SUMIF('Equipment Options'!N:N,'MeasureTotals Lookups'!$B200,'Equipment Options'!U:U)","v":0},"Comm Pump VSD_Pressure Boost_New Pump_1.5 HP (1.26 to 1.75 HP)",0]
[null,"CPUMPVSDCOOLT20HP",{"$f":"SUMIF('Equipment Options'!N:N,'MeasureTotals Lookups'!$B201,'Equipment Options'!O:O)","v":0},null,{"$f":"SUMIF('Equipment Options'!N:N,'MeasureTotals Lookups'!$B201,'Equipment Options'!V:V)","v":0},{"$f":"SUMIF('Equipment Options'!N:N,'MeasureTotals Lookups'!$B201,'Equipment Options'!R:R)","v":0},{"$f":"SUMIF('Equipment Options'!N:N,'MeasureTotals Lookups'!$B201,'Equipment Options'!S:S)","v":0},null,null,null,null,null,null,15315,{"$f":"SUMIF('Equipment Options'!N:N,'MeasureTotals Lookups'!$B201,'Equipment Options'!T:T)","v":0},{"$f":"SUMIF('Equipment Options'!N:N,'MeasureTotals Lookups'!$B201,'Equipment Options'!U:U)","v":0},"Comm Pump VSD_Cooling Tower_New Pump_20 HP (17.51 to 22.50 HP)",0]
[null,"CPUMPVSDCOOLT10HP",{"$f":"SUMIF('Equipment Options'!N:N,'MeasureTotals Lookups'!$B202,'Equipment Options'!O:O)","v":0},null,{"$f":"SUMIF('Equipment Options'!N:N,'MeasureTotals Lookups'!$B202,'Equipment Options'!V:V)","v":0},{"$f":"SUMIF('Equipment Options'!N:N,'MeasureTotals Lookups'!$B202,'Equipment Options'!R:R)","v":0},{"$f":"SUMIF('Equipment Options'!N:N,'MeasureTotals Lookups'!$B202,'Equipment Options'!S:S)","v":0},null,null,null,null,null,null,15316,{"$f":"SUMIF('Equipment Options'!N:N,'MeasureTotals Lookups'!$B202,'Equipment Options'!T:T)","v":0},{"$f":"SUMIF('Equipment Options'!N:N,'MeasureTotals Lookups'!$B202,'Equipment Options'!U:U)","v":0},"Comm Pump VSD_Cooling Tower_New Pump_10 HP (8.01 to 12.50 HP)",0]
[null,"CPUMPVSDCOOLT4HP",{"$f":"SUMIF('Equipment Options'!N:N,'MeasureTotals Lookups'!$B203,'Equipment Options'!O:O)","v":0},null,{"$f":"SUMIF('Equipment Options'!N:N,'MeasureTotals Lookups'!$B203,'Equipment Options'!V:V)","v":0},{"$f":"SUMIF('Equipment Options'!N:N,'MeasureTotals Lookups'!$B203,'Equipment Options'!R:R)","v":0},{"$f":"SUMIF('Equipment Options'!N:N,'MeasureTotals Lookups'!$B203,'Equipment Options'!S:S)","v":0},null,null,null,null,null,null,15317,{"$f":"SUMIF('Equipment Options'!N:N,'MeasureTotals Lookups'!$B203,'Equipment Options'!T:T)","v":0},{"$f":"SUMIF('Equipment Options'!N:N,'MeasureTotals Lookups'!$B203,'Equipment Options'!U:U)","v":0},"Comm Pump VSD_Cooling Tower_New Pump_4 HP (3.51 to 4.50 HP)",0]
[null,"CPUMPVSDCOOLT3HP",{"$f":"SUMIF('Equipment Options'!N:N,'MeasureTotals Lookups'!$B204,'Equipment Options'!O:O)","v":0},null,{"$f":"SUMIF('Equipment Options'!N:N,'MeasureTotals Lookups'!$B204,'Equipment Options'!V:V)","v":0},{"$f":"SUMIF('Equipment Options'!N:N,'MeasureTotals Lookups'!$B204,'Equipment Options'!R:R)","v":0},{"$f":"SUMIF('Equipment Options'!N:N,'MeasureTotals Lookups'!$B204,'Equipment Options'!S:S)","v":0},null,null,null,null,null,null,15318,{"$f":"SUMIF('Equipment Options'!N:N,'MeasureTotals Lookups'!$B204,'Equipment Options'!T:T)","v":0},{"$f":"SUMIF('Equipment Options'!N:N,'MeasureTotals Lookups'!$B204,'Equipment Options'!U:U)","v":0},"Comm Pump VSD_Cooling Tower_New Pump_3 HP (2.51 to 3.50 HP)",0]
[null,"CPUMPVSDCOOLT2HP",{"$f":"SUMIF('Equipment Options'!N:N,'MeasureTotals Lookups'!$B205,'Equipment Options'!O:O)","v":0},null,{"$f":"SUMIF('Equipment Options'!N:N,'MeasureTotals Lookups'!$B205,'Equipment Options'!V:V)","v":0},{"$f":"SUMIF('Equipment Options'!N:N,'MeasureTotals Lookups'!$B205,'Equipment Options'!R:R)","v":0},{"$f":"SUMIF('Equipment Options'!N:N,'MeasureTotals Lookups'!$B205,'Equipment Options'!S:S)","v":0},null,null,null,null,null,null,15319,{"$f":"SUMIF('Equipment Options'!N:N,'MeasureTotals Lookups'!$B205,'Equipment Options'!T:T)","v":0},{"$f":"SUMIF('Equipment Options'!N:N,'MeasureTotals Lookups'!$B205,'Equipment Options'!U:U)","v":0},"Comm Pump VSD_Cooling Tower_New Pump_2 HP (1.76 to 2.50 HP)",0]
[null,"CPUMPVSDCOOLT1P5HP",{"$f":"SUMIF('Equipment Options'!N:N,'MeasureTotals Lookups'!$B206,'Equipment Options'!O:O)","v":0},null,{"$f":"SUMIF('Equipment Options'!N:N,'MeasureTotals Lookups'!$B206,'Equipment Options'!V:V)","v":0},{"$f":"SUMIF('Equipment Options'!N:N,'MeasureTotals Lookups'!$B206,'Equipment Options'!R:R)","v":0},{"$f":"SUMIF('Equipment Options'!N:N,'MeasureTotals Lookups'!$B206,'Equipment Options'!S:S)","v":0},null,null,null,null,null,null,15320,{"$f":"SUMIF('Equipment Options'!N:N,'MeasureTotals Lookups'!$B206,'Equipment Options'!T:T)","v":0},{"$f":"SUMIF('Equipment Options'!N:N,'MeasureTotals Lookups'!$B206,'Equipment Options'!U:U)","v":0},"Comm Pump VSD_Cooling Tower_New Pump_1.5 HP (1.26 to 1.75 HP)",0]
[null,"2STAGASGVALVEOPLDRY",{"$f":"SUMIF('Equipment Options'!N:N,'MeasureTotals Lookups'!$B207,'Equipment Options'!O:O)","v":0},null,{"$f":"SUMIF('Equipment Options'!N:N,'MeasureTotals Lookups'!$B207,'Equipment Options'!V:V)","v":0},{"$f":"SUMIF('Equipment Options'!N:N,'MeasureTotals Lookups'!$B207,'Equipment Options'!R:R)","v":0},{"$f":"SUMIF('Equipment Options'!N:N,'MeasureTotals Lookups'!$B207,'Equipment Options'!S:S)","v":0},null,null,null,null,null,null,18010,{"$f":"SUMIF('Equipment Options'!N:N,'MeasureTotals Lookups'!$B207,'Equipment Options'!T:T)","v":0},{"$f":"SUMIF('Equipment Options'!N:N,'MeasureTotals Lookups'!$B207,'Equipment Options'!U:U)","v":0},"Two-stage Gas Valve on Clothes Dryers in On-Premises Laundry",0]

{"sheet":"Active Measures","index":6,"n_rows":205,"n_cols":159,"rows_kept":205,"cut":false,"hidden":true,"merged":[]}
["ProductVersionId","IsActive","ProductPath","ProductCode","ProductDescription","EvaluationDescription","BusinessCustomerReportsDescription","SavingsPotential","SystemType","MADHeaderId","MADId","MADVersion","CECRowId","MADState","ProgramCode","ProgramDescription","StartDate","EndDate","QtyUnitType","PilotFlag","OPUCExceptionFlag","DefaultKwh","DefaultTherms","NEBAnnual","DefaultOverrideSavingsAndNEBs","DefaultLoadProfileEle","DefaultLoadProfileGas","DefaultOverrideProfiles","DefaultIncentive","DefaultOverrideIncentive","DefaultLifeYears","DefaultOverrideLife","UnitIncrementalCost","AddInteractiveKwh","AddInteractiveTherms","UnitCost","UnitSave","UnitIncentive","CustomAllocation","AVI","PGE","PAC","CNG","NWN","NWNF","NWNI","NWNWA","NWNTLM","PGELMI","PGEFF","PACLMI","OCOOL","AVIINT","AVITRP","AttributeCategory","Attribute1","Attribute1Description","Attribute1Required","Attribute1Type","Attribute1Length","Attribute1Entry","Attribute2","Attribute2Description","Attribute2Required","Attribute2Type","Attribute2Length","Attribute2Entry","Attribute3","Attribute3Description","Attribute3Required","Attribute3Type","Attribute3Length","Attribute3Entry","Attribute4","Attribute4Description","Attribute4Required","Attribute4Type","Attribute4Length","Attribute4Entry","Attribute5","Attribute5Description","Attribute5Required","Attribute5Type","Attribute5Length","Attribute5Entry","Attribute6","Attribute6Description","Attribute6Required","Attribute6Type","Attribute6Length","Attribute6Entry","Attribute7","Attribute7Description","Attribute7Required","Attribute7Type","Attribute7Length","Attribute7Entry","Attribute8","Attribute8Description","Attribute8Required","Attribute8Type","Attribute8Length","Attribute8Entry","Attribute9","Attribute9Description","Attribute9Required","Attribute9Type","Attribute9Length","Attribute9Entry","Attribute10","Attribute10Description","Attribute10Required","Attribute10Type","Attribute10Length","Attribute10Entry","Attribute11","Attribute11Description","Attribute11Required","Attribute11Type","Attribute11Length","Attribute11Entry","Attribute12","Attribute12Description","Attribute12Required","Attribute12Type","Attribute12Length","Attribute12Entry","Attribute13","Attribute13Description","Attribute13Required","Attribute13Type","Attribute13Length","Attribute13Entry","Attribute14","Attribute14Description","Attribute14Required","Attribute14Type","Attribute14Length","Attribute14Entry","Attribute15","Attribute15Description","Attribute15Required","Attribute15Type","Attribute15Length","Attribute15Entry","Attribute16","Attribute16Description","Attribute16Required","Attribute16Type","Attribute16Length","Attribute16Entry","Attribute17","Attribute17Description","Attribute17Required","Attribute17Type","Attribute17Length","Attribute17Entry","CreatedDatetime","RevisedDatetime"]
[17692,"Yes","Prescriptive","MINISPLITAC","Server Closet/Telecom Room Mini-Split Air Conditioner","Server Closet Mini-split AC units","HVAC","ELE","N/A",804,3,3,4326,"OR","NBE","New Buildings","2024-01-01","2025-12-31","Tons",0,0,417.14,0,0,0,"Large Office Ventilation","None - gas",0,250,0,15,0,264.14999999999998,0,0,0,1,1,0,"NULL",100,100,"NULL","NULL","NULL","NULL","NULL","NULL","NULL","NULL","NULL","NULL","NULL","NULL","Server Closet Mini-split AC units","DESIGNLOAD","Design Load (in kW)","F","Alphanumeric",64,"ED","SEER","SEER","F","Decimal",20,"ED","SEER2","SEER 2","F","ALPHANUMERIC",20,"ED","NULL","NULL","F","NULL","NULL","NULL","NULL","NULL","F","NULL","NULL","NULL","NULL","NULL","F","NULL","NULL","NULL","NULL","NULL","F","NULL","NULL","NULL","NULL","NULL","F","NULL","NULL","NULL","NULL","NULL","F","NULL","NULL","NULL","NULL","NULL","F","NULL","NULL","NULL","NULL","NULL","F","NULL","NULL","NULL","NULL","NULL","F","NULL","NULL","NULL","NULL","NULL","F","NULL","NULL","NULL","NULL","NULL","F","NULL","NULL","NULL","NULL","NULL","F","NULL","NULL","NULL","NULL","NULL","F","NULL","NULL","NULL","NULL","NULL","F","NULL","NULL","NULL",45244.118961805558,45244.118961805558]
[17693,"Yes","Prescriptive","MINISPLITHP","Server Closet/Telecom Room Mini-Split Heat Pumps","Server Closet Mini-split AC units","HVAC","ELE","N/A",804,3,3,4327,"OR","NBE","New Buildings","2024-01-01","2025-12-31","Tons",0,0,417.14,0,0,0,"Large Office Ventilation","None - gas",0,250,0,15,0,272.89999999999998,0,0,0,1,1,0,"NULL",100,100,"NULL","NULL","NULL","NULL","NULL","NULL","NULL","NULL","NULL","NULL","NULL","NULL","Server Closet Mini-split AC units","DESIGNLOAD","Design Load (in kW)","F","Alphanumeric",64,"ED","SEER","SEER","F","Decimal",20,"ED","SEER2","SEER 2","F","ALPHANUMERIC",20,"ED","NULL","NULL","F","NULL","NULL","NULL","NULL","NULL","F","NULL","NULL","NULL","NULL","NULL","F","NULL","NULL","NULL","NULL","NULL","F","NULL","NULL","NULL","NULL","NULL","F","NULL","NULL","NULL","NULL","NULL","F","NULL","NULL","NULL","NULL","NULL","F","NULL","NULL","NULL","NULL","NULL","F","NULL","NULL","NULL","NULL","NULL","F","NULL","NULL","NULL","NULL","NULL","F","NULL","NULL","NULL","NULL","NULL","F","NULL","NULL","NULL","NULL","NULL","F","NULL","NULL","NULL","NULL","NULL","F","NULL","NULL","NULL","NULL","NULL","F","NULL","NULL","NULL",45244.118961805558,45244.118961805558]
[18351,"Yes","Prescriptive","DHWCONDTANKMF","Condensing Tank Water Heater, Multifamily","Tanked water heater","Water Heating","GAS","DHW",939,21,6,5794,"OR","NBE","New Buildings","2024-01-01","2025-12-31","kBtu/hr",0,0,0,1.44,0,0,"None - ele","DHW",0,3.5,0,15,0,3.79,0,0,0,1,1,0,100,"NULL","NULL",100,100,100,100,"NULL","NULL","NULL","NULL","NULL","NULL",100,"NULL","Tanked water heater","KBTUHINPUT","kBtuh input per unit","T","Decimal",10,"ED","MANUFACTURER","Manufacturer Name","T","Alphanumeric",64,"ED","MODEL","Model","T","Alphanumeric",64,"ED","UNITS","Number of units","T","Integer",20,"ED","NULL","NULL","F","NULL","NULL","NULL","NULL","NULL","F","NULL","NULL","NULL","NULL","NULL","F","NULL","NULL","NULL","NULL","NULL","F","NULL","NULL","NULL","NULL","NULL","F","NULL","NULL","NULL","NULL","NULL","F","NULL","NULL","NULL","NULL","NULL","F","NULL","NULL","NULL","NULL","NULL","F","NULL","NULL","NULL","NULL","NULL","F","NULL","NULL","NULL","NULL","NULL","F","NULL","NULL","NULL","NULL","NULL","F","NULL","NULL","NULL","NULL","NULL","F","NULL","NULL","NULL","NULL","NULL","F","NULL","NULL","NULL",45282.122242824073,45282.122242824073]
[18353,"Yes","Prescriptive","DHWCONDNMF","Condensing Tank Water Heater, All Except MF","Tanked water heater","Water Heating","GAS","DHW",939,21,6,5797,"OR","NBE","New Buildings","2024-01-01","2025-12-31","kBtu/hr",0,0,0,1.1100000000000001,0,0,"None - ele","DHW",0,3.5,0,15,0,3.76,0,0,0,1,1,0,100,"NULL","NULL",100,100,100,100,"NULL","NULL","NULL","NULL","NULL","NULL",100,"NULL","Tanked water heater","KBTUHINPUT","kBtuh input per unit","T","Decimal",10,"ED","MANUFACTURER","Manufacturer Name","T","Alphanumeric",64,"ED","MODEL","Model","T","Alphanumeric",64,"ED","UNITS","Number of units","T","Integer",20,"ED","NULL","NULL","F","NULL","NULL","NULL","NULL","NULL","F","NULL","NULL","NULL","NULL","NULL","F","NULL","NULL","NULL","NULL","NULL","F","NULL","NULL","NULL","NULL","NULL","F","NULL","NULL","NULL","NULL","NULL","F","NULL","NULL","NULL","NULL","NULL","F","NULL","NULL","NULL","NULL","NULL","F","NULL","NULL","NULL","NULL","NULL","F","NULL","NULL","NULL","NULL","NULL","F","NULL","NULL","NULL","NULL","NULL","F","NULL","NULL","NULL","NULL","NULL","F","NULL","NULL","NULL","NULL","NULL","F","NULL","NULL","NULL",45282.122242824073,45282.122242824073]
[13323,"Yes","Prescriptive","DWSTCONHTEMPE","Dishwasher - Single Tank Conveyor- High Temp - Ele WH","Dishwasher","Appliance","ELE","DHW",764,35,3,3938,"OR","NBE","New Buildings",44562,"2024-12-31","Units",0,0,9402.4,0,0,0,"Restaurant Hot Water","Flat - gas",0,900,0,20,0,919.52,0,0,0,1,1,0,"NULL",100,100,"NULL","NULL","NULL","NULL","NULL","NULL","NULL","NULL","NULL","NULL","NULL","NULL","No Attributes ","NULL","NULL","F","NULL","NULL","NULL","NULL","NULL","F","NULL","NULL","NULL","NULL","NULL","F","NULL","NULL","NULL","NULL","NULL","F","NULL","NULL","NULL","NULL","NULL","F","NULL","NULL","NULL","NULL","NULL","F","NULL","NULL","NULL","NULL","NULL","F","NULL","NULL","NULL","NULL","NULL","F","NULL","NULL","NULL","NULL","NULL","F","NULL","NULL","NULL","NULL","NULL","F","NULL","NULL","NULL","NULL","NULL","F","NULL","NULL","NULL","NULL","NULL","F","NULL","NULL","NULL","NULL","NULL","F","NULL","NULL","NULL","NULL","NULL","F","NULL","NULL","NULL","NULL","NULL","F","NULL","NULL","NULL","NULL","NULL","F","NULL","NULL","NULL","NULL","NULL","F","NULL","NULL","NULL",44952.607310150466,44952.607310150466]
[13324,"Yes","Prescriptive","DWSTCONLDTEMPE","Dishwasher - Single Tank Conveyor - Low or Dual temp - Ele WH","Dishwasher","Appliance","ELE","DHW",764,35,3,3937,"OR","NBE","New Buildings",44562,"2024-12-31","Units",0,0,5335.72,0,0,0,"Restaurant Hot Water","Flat - gas",0,900,0,20,0,1,0,0,0,1,1,0,"NULL",100,100,"NULL","NULL","NULL","NULL","NULL","NULL","NULL","NULL","NULL","NULL","NULL","NULL","No Attributes ","NULL","NULL","F","NULL","NULL","NULL","NULL","NULL","F","NULL","NULL","NULL","NULL","NULL","F","NULL","NULL","NULL","NULL","NULL","F","NULL","NULL","NULL","NULL","NULL","F","NULL","NULL","NULL","NULL","NULL","F","NULL","NULL","NULL","NULL","NULL","F","NULL","NULL","NULL","NULL","NULL","F","NULL","NULL","NULL","NULL","NULL","F","NULL","NULL","NULL","NULL","NULL","F","NULL","NULL","NULL","NULL","NULL","F","NULL","NULL","NULL","NULL","NULL","F","NULL","NULL","NULL","NULL","NULL","F","NULL","NULL","NULL","NULL","NULL","F","NULL","NULL","NULL","NULL","NULL","F","NULL","NULL","NULL","NULL","NULL","F","NULL","NULL","NULL","NULL","NULL","F","NULL","NULL","NULL",44952.607310150466,44952.607310150466]
[13325,"Yes","Prescriptive","DWMTCONHDTEMPE","Dishwasher - Multi Tank Conveyor - High or Dual Temp - Elec WH","Dishwasher","Appliance","ELE","DHW",764,35,3,3939,"OR","NBE","New Buildings","2022-01-01","2024-12-31","Units",0,0,4197.5,0,0,0,"Restaurant Hot Water","Flat - gas",0,900,0,20,0,1,0,0,0,1,1,0,"NULL",100,100,"NULL","NULL","NULL","NULL","NULL","NULL","NULL","NULL","NULL","NULL","NULL","NULL","No Attributes ","NULL","NULL","F","NULL","NULL","NULL","NULL","NULL","F","NULL","NULL","NULL","NULL","NULL","F","NULL","NULL","NULL","NULL","NULL","F","NULL","NULL","NULL","NULL","NULL","F","NULL","NULL","NULL","NULL","NULL","F","NULL","NULL","NULL","NULL","NULL","F","NULL","NULL","NULL","NULL","NULL","F","NULL","NULL","NULL","NULL","NULL","F","NULL","NULL","NULL","NULL","NULL","F","NULL","NULL","NULL","NULL","NULL","F","NULL","NULL","NULL","NULL","NULL","F","NULL","NULL","NULL","NULL","NULL","F","NULL","NULL","NULL","NULL","NULL","F","NULL","NULL","NULL","NULL","NULL","F","NULL","NULL","NULL","NULL","NULL","F","NULL","NULL","NULL","NULL","NULL","F","NULL","NULL","NULL",44952.607310150466,44952.607310150466]
[18356,"Yes","Prescriptive","COMHPWHT3","Comm Heat Pump Water Heater Tier 3+ Any Building Type","Heat pump water heater","Water Heating","ELE","DHW",857,52,4,5045,"OR","NBE","New Buildings","2024-01-01","2025-12-31","Units",0,0,1422.4,0,0,0,"Res HP Water Heat Convert","Res Heating",0,800,0,13,0,968.21,0,-5.79,0,1,1,0,"NULL",100,100,"NULL","NULL","NULL","NULL","NULL","NULL","NULL","NULL","NULL","NULL","NULL","NULL","Heat pump water heater","MANUFACTURER","Manufacturer Name","T","Alphanumeric",64,"ED","MODEL","Model","T","Alphanumeric",64,"ED","SN","Serial Number","T","Alphanumeric",64,"ED","TANKSIZE","Tank Size in gallons","T","Alphanumeric",64,"ED","NULL","NULL","F","NULL","NULL","NULL","NULL","NULL","F","NULL","NULL","NULL","NULL","NULL","F","NULL","NULL","NULL","NULL","NULL","F","NULL","NULL","NULL","NULL","NULL","F","NULL","NULL","NULL","NULL","NULL","F","NULL","NULL","NULL","NULL","NULL","F","NULL","NULL","NULL","NULL","NULL","F","NULL","NULL","NULL","NULL","NULL","F","NULL","NULL","NULL","NULL","NULL","F","NULL","NULL","NULL","NULL","NULL","F","NULL","NULL","NULL","NULL","NULL","F","NULL","NULL","NULL","NULL","NULL","F","NULL","NULL","NULL",45294.118139317128,45294.118139317128]
[18357,"Yes","Prescriptive","CTWH200COMMF","Tankless Water Heater >= 200 kBtu/h, MF","Tankless water heater","Water Heating","GAS","DHW",826,72,4,4679,"OR","NBE","New Buildings","2024-01-01","2025-12-31","kBtu/hr",0,0,0,0.42,0,0,"None - ele","DHW",0,1.4,0,20,0,1.43,0,0,0,1,1,0,100,"NULL","NULL",100,100,100,100,"NULL","NULL","NULL","NULL","NULL","NULL",100,100,"Tankless water heater","THERMALEFF","Thermal Efficiency","T","Alphanumeric",64,"ED","NULL","NULL","F","NULL","NULL","NULL","NULL","NULL","F","NULL","NULL","NULL","NULL","NULL","F","NULL","NULL","NULL","NULL","NULL","F","NULL","NULL","NULL","NULL","NULL","F","NULL","NULL","NULL","NULL","NULL","F","NULL","NULL","NULL","NULL","NULL","F","NULL","NULL","NULL","NULL","NULL","F","NULL","NULL","NULL","NULL","NULL","F","NULL","NULL","NULL","NULL","NULL","F","NULL","NULL","NULL","NULL","NULL","F","NULL","NULL","NULL","NULL","NULL","F","NULL","NULL","NULL","NULL","NULL","F","NULL","NULL","NULL","NULL","NULL","F","NULL","NULL","NULL","NULL","NULL","F","NULL","NULL","NULL","NULL","NULL","F","NULL","NULL","NULL",45294.118139317128,45294.118139317128]
[18358,"Yes","Prescriptive","CTWH200COMNONMF","Tankless Water Heaters >= 200 kBtu/h, All Except MF","Tankless water heater","Water Heating","GAS","DHW",826,72,4,4682,"OR","NBE","New Buildings","2024-01-01","2025-12-31","kBtu/hr",0,0,0,0.28000000000000003,0,0,"None - ele","DHW",0,1.4,0,20,0,1.43,0,0,0,1,1,0,100,"NULL","NULL",100,100,100,100,"NULL","NULL","NULL","NULL","NULL","NULL",100,100,"Tankless water heater","THERMALEFF","Thermal Efficiency","T","Alphanumeric",64,"ED","NULL","NULL","F","NULL","NULL","NULL","NULL","NULL","F","NULL","NULL","NULL","NULL","NULL","F","NULL","NULL","NULL","NULL","NULL","F","NULL","NULL","NULL","NULL","NULL","F","NULL","NULL","NULL","NULL","NULL","F","NULL","NULL","NULL","NULL","NULL","F","NULL","NULL","NULL","NULL","NULL","F","NULL","NULL","NULL","NULL","NULL","F","NULL","NULL","NULL","NULL","NULL","F","NULL","NULL","NULL","NULL","NULL","F","NULL","NULL","NULL","NULL","NULL","F","NULL","NULL","NULL","NULL","NULL","F","NULL","NULL","NULL","NULL","NULL","F","NULL","NULL","NULL","NULL","NULL","F","NULL","NULL","NULL","NULL","NULL","F","NULL","NULL","NULL",45294.118139317128,45294.118139317128]
[17926,"Yes","Prescriptive","OZONSYS126400EWH","Ozone Laundry System 126-400 Lbs Capacity - Ele WH","Clothes washer","Appliance","ELE","DHW",918,80,2,5653,"OR","NBE","New Buildings","2024-01-01","2026-12-31","Other",0,0,271970.52,0,14427.32,0,"Lodging Hot Water","Clotheswasher",0,15000,0,10,0,25433.87,0,0,0,1,1,0,"NULL",100,100,"NULL","NULL","NULL","NULL","NULL","NULL","NULL","NULL","NULL","NULL","NULL","NULL","Clothes Washer","MANUFACTURER","Manufacturer Name","T","Alphanumeric",40,"ED","MODEL","Model","T","Alphanumeric",20,"ED","CAPACITY","Capacity (lbs)","T","Alphanumeric",10,"ED","NULL","NULL","F","NULL","NULL","NULL","NULL","NULL","F","NULL","NULL","NULL","NULL","NULL","F","NULL","NULL","NULL","NULL","NULL","F","NULL","NULL","NULL","NULL","NULL","F","NULL","NULL","NULL","NULL","NULL","F","NULL","NULL","NULL","NULL","NULL","F","NULL","NULL","NULL","NULL","NULL","F","NULL","NULL","NULL","NULL","NULL","F","NULL","NULL","NULL","NULL","NULL","F","NULL","NULL","NULL","NULL","NULL","F","NULL","NULL","NULL","NULL","NULL","F","NULL","NULL","NULL","NULL","NULL","F","NULL","NULL","NULL","NULL","NULL","F","NULL","NULL","NULL",45253.110922256943,45253.110922256943]
[17927,"Yes","Prescriptive","OZONSYS401600GWHGOT","Ozone Laundry System 401-600 Lbs Capacity - Gas WH GOT","Clothes washer","Appliance","GAS","DHW",918,80,2,5644,"OR","NBE","New Buildings","2024-01-01","2026-12-31","Other",0,0,0,22322.85,28596.85,0,"Lodging Hot Water","Clotheswasher",0,25000,0,10,0,39816.22,0,0,0,1,1,0,100,"NULL","NULL",100,100,100,100,"NULL","NULL","NULL","NULL","NULL","NULL",100,"NULL","Clothes Washer","MANUFACTURER","Manufacturer Name","T","Alphanumeric",40,"ED","MODEL","Model","T","Alphanumeric",20,"ED","CAPACITY","Capacity (lbs)","F","Alphanumeric",10,"ED","NULL","NULL","F","NULL","NULL","NULL","NULL","NULL","F","NULL","NULL","NULL","NULL","NULL","F","NULL","NULL","NULL","NULL","NULL","F","NULL","NULL","NULL","NULL","NULL","F","NULL","NULL","NULL","NULL","NULL","F","NULL","NULL","NULL","NULL","NULL","F","NULL","NULL","NULL","NULL","NULL","F","NULL","NULL","NULL","NULL","NULL","F","NULL","NULL","NULL","NULL","NULL","F","NULL","NULL","NULL","NULL","NULL","F","NULL","NULL","NULL","NULL","NULL","F","NULL","NULL","NULL","NULL","NULL","F","NULL","NULL","NULL","NULL","NULL","F","NULL","NULL","NULL",45253.110922256943,45253.110922256943]
[17928,"Yes","Prescriptive","OZONSYS401600GWHFULL","Ozone Laundry System 401-600 Lbs Capacity - Gas WH Full Terr","Clothes washer","Appliance","BOTH","N/A",918,80,2,5639,"OR","NBE","New Buildings","2024-01-01","2026-12-31","Other",0,0,5131.7700000000004,22322.85,27480.6,0,"Lodging Hot Water","Clotheswasher",0,25000,0,10,0,39816.22,0,0,0,1,1,0,99,1,1,99,99,99,99,"NULL","NULL","NULL","NULL","NULL","NULL",99,"NULL","Clothes Washer","MANUFACTURER","Manufacturer Name","T","Alphanumeric",40,"ED","MODEL","Model","T","Alphanumeric",20,"ED","CAPACITY","Capacity (lbs)","F","Alphanumeric",10,"ED","NULL","NULL","F","NULL","NULL","NULL","NULL","NULL","F","NULL","NULL","NULL","NULL","NULL","F","NULL","NULL","NULL","NULL","NULL","F","NULL","NULL","NULL","NULL","NULL","F","NULL","NULL","NULL","NULL","NULL","F","NULL","NULL","NULL","NULL","NULL","F","NULL","NULL","NULL","NULL","NULL","F","NULL","NULL","NULL","NULL","NULL","F","NULL","NULL","NULL","NULL","NULL","F","NULL","NULL","NULL","NULL","NULL","F","NULL","NULL","NULL","NULL","NULL","F","NULL","NULL","NULL","NULL","NULL","F","NULL","NULL","NULL","NULL","NULL","F","NULL","NULL","NULL",45253.110922256943,45253.110922256943]
[17929,"Yes","Prescriptive","OZONSYS401600EWH","Ozone Laundry System 401-600 Lbs Capacity - Ele WH","Clothes washer","Appliance","ELE","DHW",918,80,2,5654,"OR","NBE","New Buildings","2024-01-01","2026-12-31","Other",0,0,518039.09,0,27480.6,0,"Lodging Hot Water","Clotheswasher",0,25000,0,10,0,39816.22,0,0,0,1,1,0,"NULL",100,100,"NULL","NULL","NULL","NULL","NULL","NULL","NULL","NULL","NULL","NULL","NULL","NULL","Clothes Washer","MANUFACTURER","Manufacturer Name","T","Alphanumeric",40,"ED","MODEL","Model","T","Alphanumeric",20,"ED","CAPACITY","Capacity (lbs)","T","Alphanumeric",10,"ED","NULL","NULL","F","NULL","NULL","NULL","NULL","NULL","F","NULL","NULL","NULL","NULL","NULL","F","NULL","NULL","NULL","NULL","NULL","F","NULL","NULL","NULL","NULL","NULL","F","NULL","NULL","NULL","NULL","NULL","F","NULL","NULL","NULL","NULL","NULL","F","NULL","NULL","NULL","NULL","NULL","F","NULL","NULL","NULL","NULL","NULL","F","NULL","NULL","NULL","NULL","NULL","F","NULL","NULL","NULL","NULL","NULL","F","NULL","NULL","NULL","NULL","NULL","F","NULL","NULL","NULL","NULL","NULL","F","NULL","NULL","NULL","NULL","NULL","F","NULL","NULL","NULL",45253.110922256943,45253.110922256943]
[17930,"Yes","Prescriptive","OZONSYS600GWHGOT","Ozone Laundry System > 600 Lbs Capacity - Gas WH GOT","Clothes washer","Appliance","GAS","DHW",918,80,2,5645,"OR","NBE","New Buildings","2024-01-01","2026-12-31","Other",0,0,0,31251.99,39924.01,0,"Lodging Hot Water","Clotheswasher",0,30000,0,10,0,47957.66,0,0,0,1,1,0,100,"NULL","NULL",100,100,100,100,"NULL","NULL","NULL","NULL","NULL","NULL",100,"NULL","Clothes Washer","MANUFACTURER","Manufacturer Name","T","Alphanumeric",40,"ED","MODEL","Model","T","Alphanumeric",20,"ED","CAPACITY","Capacity (lbs)","F","Alphanumeric",10,"ED","NULL","NULL","F","NULL","NULL","NULL","NULL","NULL","F","NULL","NULL","NULL","NULL","NULL","F","NULL","NULL","NULL","NULL","NULL","F","NULL","NULL","NULL","NULL","NULL","F","NULL","NULL","NULL","NULL","NULL","F","NULL","NULL","NULL","NULL","NULL","F","NULL","NULL","NULL","NULL","NULL","F","NULL","NULL","NULL","NULL","NULL","F","NULL","NULL","NULL","NULL","NULL","F","NULL","NULL","NULL","NULL","NULL","F","NULL","NULL","NULL","NULL","NULL","F","NULL","NULL","NULL","NULL","NULL","F","NULL","NULL","NULL","NULL","NULL","F","NULL","NULL","NULL",45253.110922256943,45253.110922256943]
[17931,"Yes","Prescriptive","OZONSYS600GWHFULL","Ozone Laundry System > 600 Lbs Capacity - Gas WH Full Terr","Clothes washer","Appliance","BOTH","N/A",918,80,2,5640,"OR","NBE","New Buildings","2024-01-01","2026-12-31","Other",0,0,7184.48,31251.99,38472.839999999997,0,"Lodging Hot Water","Clotheswasher",0,30000,0,10,0,47957.66,0,0,0,1,1,0,99,1,1,99,99,99,99,"NULL","NULL","NULL","NULL","NULL","NULL",99,"NULL","Clothes Washer","MANUFACTURER","Manufacturer Name","T","Alphanumeric",40,"ED","MODEL","Model","T","Alphanumeric",20,"ED","CAPACITY","Capacity (lbs)","F","Alphanumeric",10,"ED","NULL","NULL","F","NULL","NULL","NULL","NULL","NULL","F","NULL","NULL","NULL","NULL","NULL","F","NULL","NULL","NULL","NULL","NULL","F","NULL","NULL","NULL","NULL","NULL","F","NULL","NULL","NULL","NULL","NULL","F","NULL","NULL","NULL","NULL","NULL","F","NULL","NULL","NULL","NULL","NULL","F","NULL","NULL","NULL","NULL","NULL","F","NULL","NULL","NULL","NULL","NULL","F","NULL","NULL","NULL","NULL","NULL","F","NULL","NULL","NULL","NULL","NULL","F","NULL","NULL","NULL","NULL","NULL","F","NULL","NULL","NULL","NULL","NULL","F","NULL","NULL","NULL",45253.110922256943,45253.110922256943]
[17932,"Yes","Prescriptive","OZONSYS600EWH","Ozone Laundry System > 600 Lbs Capacity - Ele WH","Clothes washer","Appliance","ELE","DHW",918,80,2,5655,"OR","NBE","New Buildings","2024-01-01","2026-12-31","Other",0,0,725254.73,0,38472.839999999997,0,"Lodging Hot Water","Clotheswasher",0,30000,0,10,0,47957.66,0,0,0,1,1,0,"NULL",100,100,"NULL","NULL","NULL","NULL","NULL","NULL","NULL","NULL","NULL","NULL","NULL","NULL","Clothes Washer","MANUFACTURER","Manufacturer Name","T","Alphanumeric",40,"ED","MODEL","Model","T","Alphanumeric",20,"ED","CAPACITY","Capacity (lbs)","T","Alphanumeric",10,"ED","NULL","NULL","F","NULL","NULL","NULL","NULL","NULL","F","NULL","NULL","NULL","NULL","NULL","F","NULL","NULL","NULL","NULL","NULL","F","NULL","NULL","NULL","NULL","NULL","F","NULL","NULL","NULL","NULL","NULL","F","NULL","NULL","NULL","NULL","NULL","F","NULL","NULL","NULL","NULL","NULL","F","NULL","NULL","NULL","NULL","NULL","F","NULL","NULL","NULL","NULL","NULL","F","NULL","NULL","NULL","NULL","NULL","F","NULL","NULL","NULL","NULL","NULL","F","NULL","NULL","NULL","NULL","NULL","F","NULL","NULL","NULL","NULL","NULL","F","NULL","NULL","NULL",45253.110922256943,45253.110922256943]
[17933,"Yes","Prescriptive","OZONSYS75GWHFULL","Ozone Laundry System < 75 Lbs Capacity - Gas WH Full Terr","Clothes washer","Appliance","BOTH","N/A",918,80,2,5636,"OR","NBE","New Buildings","2024-01-01","2026-12-31","Other",0,0,513.17999999999995,2232.29,2748.06,0,"Lodging Hot Water","Clotheswasher",0,5000,0,10,0,10092.68,0,0,0,1,1,0,99,1,1,99,99,99,99,"NULL","NULL","NULL","NULL","NULL","NULL",99,"NULL","Clothes Washer","MANUFACTURER","Manufacturer Name","T","Alphanumeric",40,"ED","MODEL","Model","T","Alphanumeric",20,"ED","CAPACITY","Capacity (lbs)","F","Alphanumeric",10,"ED","NULL","NULL","F","NULL","NULL","NULL","NULL","NULL","F","NULL","NULL","NULL","NULL","NULL","F","NULL","NULL","NULL","NULL","NULL","F","NULL","NULL","NULL","NULL","NULL","F","NULL","NULL","NULL","NULL","NULL","F","NULL","NULL","NULL","NULL","NULL","F","NULL","NULL","NULL","NULL","NULL","F","NULL","NULL","NULL","NULL","NULL","F","NULL","NULL","NULL","NULL","NULL","F","NULL","NULL","NULL","NULL","NULL","F","NULL","NULL","NULL","NULL","NULL","F","NULL","NULL","NULL","NULL","NULL","F","NULL","NULL","NULL","NULL","NULL","F","NULL","NULL","NULL",45253.110922256943,45253.110922256943]
[17934,"Yes","Prescriptive","OZONSYS75EWH","Ozone Laundry System < 75 Lbs Capacity - Ele WH","Clothes washer","Appliance","ELE","DHW",918,80,2,5651,"OR","NBE","New Buildings","2024-01-01","2026-12-31","Other",0,0,51803.91,0,2748.06,0,"Lodging Hot Water","Clotheswasher",0,5000,0,10,0,10092.68,0,0,0,1,1,0,"NULL",100,100,"NULL","NULL","NULL","NULL","NULL","NULL","NULL","NULL","NULL","NULL","NULL","NULL","Clothes Washer","MANUFACTURER","Manufacturer Name","T","Alphanumeric",40,"ED","MODEL","Model","T","Alphanumeric",20,"ED","CAPACITY","Capacity (lbs)","T","Alphanumeric",10,"ED","NULL","NULL","F","NULL","NULL","NULL","NULL","NULL","F","NULL","NULL","NULL","NULL","NULL","F","NULL","NULL","NULL","NULL","NULL","F","NULL","NULL","NULL","NULL","NULL","F","NULL","NULL","NULL","NULL","NULL","F","NULL","NULL","NULL","NULL","NULL","F","NULL","NULL","NULL","NULL","NULL","F","NULL","NULL","NULL","NULL","NULL","F","NULL","NULL","NULL","NULL","NULL","F","NULL","NULL","NULL","NULL","NULL","F","NULL","NULL","NULL","NULL","NULL","F","NULL","NULL","NULL","NULL","NULL","F","NULL","NULL","NULL","NULL","NULL","F","NULL","NULL","NULL",45253.110922256943,45253.110922256943]
[17935,"Yes","Prescriptive","OZONSYS75125GWHGOT","Ozone Laundry System 75-125 Lbs Capacity - Gas WH GOT","Clothes washer","Appliance","GAS","DHW",918,80,2,5642,"OR","NBE","New Buildings","2024-01-01","2026-12-31","Other",0,0,0,4464.57,5703.43,0,"Lodging Hot Water","Clotheswasher",0,7500,0,10,0,13479.48,0,0,0,1,1,0,100,"NULL","NULL",100,100,100,100,"NULL","NULL","NULL","NULL","NULL","NULL",100,"NULL","Clothes Washer","MANUFACTURER","Manufacturer Name","T","Alphanumeric",40,"ED","MODEL","Model","T","Alphanumeric",20,"ED","CAPACITY","Capacity (lbs)","F","Alphanumeric",10,"ED","NULL","NULL","F","NULL","NULL","NULL","NULL","NULL","F","NULL","NULL","NULL","NULL","NULL","F","NULL","NULL","NULL","NULL","NULL","F","NULL","NULL","NULL","NULL","NULL","F","NULL","NULL","NULL","NULL","NULL","F","NULL","NULL","NULL","NULL","NULL","F","NULL","NULL","NULL","NULL","NULL","F","NULL","NULL","NULL","NULL","NULL","F","NULL","NULL","NULL","NULL","NULL","F","NULL","NULL","NULL","NULL","NULL","F","NULL","NULL","NULL","NULL","NULL","F","NULL","NULL","NULL","NULL","NULL","F","NULL","NULL","NULL","NULL","NULL","F","NULL","NULL","NULL",45253.110922256943,45253.110922256943]
[17936,"Yes","Prescriptive","OZONSYS75125GWHFULL","Ozone Laundry System 75-125 Lbs Capacity - Gas WH Full Terr","Clothes washer","Appliance","BOTH","N/A",918,80,2,5637,"OR","NBE","New Buildings","2024-01-01","2026-12-31","Other",0,0,1026.3499999999999,4464.57,5496.12,0,"Lodging Hot Water","Clotheswasher",0,7500,0,10,0,13479.48,0,0,0,1,1,0,99,1,1,99,99,99,99,"NULL","NULL","NULL","NULL","NULL","NULL",99,"NULL","Clothes Washer","MANUFACTURER","Manufacturer Name","T","Alphanumeric",40,"ED","MODEL","Model","T","Alphanumeric",20,"ED","CAPACITY","Capacity (lbs)","F","Alphanumeric",10,"ED","NULL","NULL","F","NULL","NULL","NULL","NULL","NULL","F","NULL","NULL","NULL","NULL","NULL","F","NULL","NULL","NULL","NULL","NULL","F","NULL","NULL","NULL","NULL","NULL","F","NULL","NULL","NULL","NULL","NULL","F","NULL","NULL","NULL","NULL","NULL","F","NULL","NULL","NULL","NULL","NULL","F","NULL","NULL","NULL","NULL","NULL","F","NULL","NULL","NULL","NULL","NULL","F","NULL","NULL","NULL","NULL","NULL","F","NULL","NULL","NULL","NULL","NULL","F","NULL","NULL","NULL","NULL","NULL","F","NULL","NULL","NULL","NULL","NULL","F","NULL","NULL","NULL",45253.110922256943,45253.110922256943]
[17937,"Yes","Prescriptive","OZONSYS75125EWH","Ozone Laundry System 75-125 Lbs Capacity - Ele WH","Clothes washer","Appliance","ELE","DHW",918,80,2,5652,"OR","NBE","New Buildings","2024-01-01","2026-12-31","Other",0,0,103607.82,0,5496.12,0,"Lodging Hot Water","Clotheswasher",0,7500,0,10,0,13479.48,0,0,0,1,1,0,"NULL",100,100,"NULL","NULL","NULL","NULL","NULL","NULL","NULL","NULL","NULL","NULL","NULL","NULL","Clothes Washer","MANUFACTURER","Manufacturer Name","T","Alphanumeric",40,"ED","MODEL","Model","T","Alphanumeric",20,"ED","CAPACITY","Capacity (lbs)","T","Alphanumeric",10,"ED","NULL","NULL","F","NULL","NULL","NULL","NULL","NULL","F","NULL","NULL","NULL","NULL","NULL","F","NULL","NULL","NULL","NULL","NULL","F","NULL","NULL","NULL","NULL","NULL","F","NULL","NULL","NULL","NULL","NULL","F","NULL","NULL","NULL","NULL","NULL","F","NULL","NULL","NULL","NULL","NULL","F","NULL","NULL","NULL","NULL","NULL","F","NULL","NULL","NULL","NULL","NULL","F","NULL","NULL","NULL","NULL","NULL","F","NULL","NULL","NULL","NULL","NULL","F","NULL","NULL","NULL","NULL","NULL","F","NULL","NULL","NULL","NULL","NULL","F","NULL","NULL","NULL",45253.110922256943,45253.110922256943]
[17938,"Yes","Prescriptive","OZONSYS126400GWHGOT","Ozone Laundry System 126-400 Lbs Capacity - Gas WH GOT","Clothes washer","Appliance","GAS","DHW",918,80,2,5643,"OR","NBE","New Buildings","2024-01-01","2026-12-31","Other",0,0,0,11719.5,14971.5,0,"Lodging Hot Water","Clotheswasher",0,15000,0,10,0,25433.87,0,0,0,1,1,0,100,"NULL","NULL",100,100,100,100,"NULL","NULL","NULL","NULL","NULL","NULL",100,"NULL","Clothes Washer","MANUFACTURER","Manufacturer Name","T","Alphanumeric",40,"ED","MODEL","Model","T","Alphanumeric",20,"ED","CAPACITY","Capacity (lbs)","F","Alphanumeric",10,"ED","NULL","NULL","F","NULL","NULL","NULL","NULL","NULL","F","NULL","NULL","NULL","NULL","NULL","F","NULL","NULL","NULL","NULL","NULL","F","NULL","NULL","NULL","NULL","NULL","F","NULL","NULL","NULL","NULL","NULL","F","NULL","NULL","NULL","NULL","NULL","F","NULL","NULL","NULL","NULL","NULL","F","NULL","NULL","NULL","NULL","NULL","F","NULL","NULL","NULL","NULL","NULL","F","NULL","NULL","NULL","NULL","NULL","F","NULL","NULL","NULL","NULL","NULL","F","NULL","NULL","NULL","NULL","NULL","F","NULL","NULL","NULL","NULL","NULL","F","NULL","NULL","NULL",45253.110922256943,45253.110922256943]
[17939,"Yes","Prescriptive","OZONSYS126400GWHFULL","Ozone Laundry System 126-400 Lbs Capacity - Gas WH Full Terr","Clothes washer","Appliance","BOTH","N/A",918,80,2,5638,"OR","NBE","New Buildings","2024-01-01","2026-12-31","Other",0,0,2694.18,11719.5,14427.32,0,"Lodging Hot Water","Clotheswasher",0,15000,0,10,0,25433.87,0,0,0,1,1,0,99,1,1,99,99,99,99,"NULL","NULL","NULL","NULL","NULL","NULL",99,"NULL","Clothes Washer","MANUFACTURER","Manufacturer Name","T","Alphanumeric",40,"ED","MODEL","Model","T","Alphanumeric",20,"ED","CAPACITY","Capacity (lbs)","F","Alphanumeric",10,"ED","NULL","NULL","F","NULL","NULL","NULL","NULL","NULL","F","NULL","NULL","NULL","NULL","NULL","F","NULL","NULL","NULL","NULL","NULL","F","NULL","NULL","NULL","NULL","NULL","F","NULL","NULL","NULL","NULL","NULL","F","NULL","NULL","NULL","NULL","NULL","F","NULL","NULL","NULL","NULL","NULL","F","NULL","NULL","NULL","NULL","NULL","F","NULL","NULL","NULL","NULL","NULL","F","NULL","NULL","NULL","NULL","NULL","F","NULL","NULL","NULL","NULL","NULL","F","NULL","NULL","NULL","NULL","NULL","F","NULL","NULL","NULL","NULL","NULL","F","NULL","NULL","NULL",45253.110922256943,45253.110922256943]
[17947,"Yes","Prescriptive","OZONSYS75GWHGOT","Ozone Laundry System < 75 Lbs Capacity - Gas WH GOT","Clothes washer","Appliance","GAS","DHW",918,80,2,5641,"OR","NBE","New Buildings","2024-01-01","2026-12-31","Other",0,0,0,2232.29,2851.71,0,"Lodging Hot Water","Clotheswasher",0,5000,0,10,0,10092.68,0,0,0,1,1,0,100,"NULL","NULL",100,100,100,100,"NULL","NULL","NULL","NULL","NULL","NULL",100,"NULL","Clothes Washer","MANUFACTURER","Manufacturer Name","T","Alphanumeric",40,"ED","MODEL","Model","T","Alphanumeric",20,"ED","CAPACITY","Capacity (lbs)","F","Alphanumeric",10,"ED","NULL","NULL","F","NULL","NULL","NULL","NULL","NULL","F","NULL","NULL","NULL","NULL","NULL","F","NULL","NULL","NULL","NULL","NULL","F","NULL","NULL","NULL","NULL","NULL","F","NULL","NULL","NULL","NULL","NULL","F","NULL","NULL","NULL","NULL","NULL","F","NULL","NULL","NULL","NULL","NULL","F","NULL","NULL","NULL","NULL","NULL","F","NULL","NULL","NULL","NULL","NULL","F","NULL","NULL","NULL","NULL","NULL","F","NULL","NULL","NULL","NULL","NULL","F","NULL","NULL","NULL","NULL","NULL","F","NULL","NULL","NULL","NULL","NULL","F","NULL","NULL","NULL",45253.110922256943,45253.110922256943]
[17948,"Yes","Prescriptive","COMWASHEDRYGET","Commercial Washer Gas/Other Dryer Ele WH, Energy Star, EOT","Clothes washer","Appliance","ELE","N/A",935,89,5,5760,"OR","NBE","New Buildings","2024-01-01","2026-12-31","Units",0,0,427.56,0,340.44,0,"Other Process","None - gas",0,150,0,7,0,531.15,0,0,0,1,1,0,"NULL",100,100,"NULL","NULL","NULL","NULL","NULL","NULL","NULL","NULL","NULL","NULL","NULL","NULL","Clothes Washer","MEF","MEF","T","Alphanumeric",5,"ED","WATERFACTOR","Water Factor","F","Alphanumeric",10,"ED","NULL","NULL","F","NULL","NULL","NULL","NULL","NULL","F","NULL","NULL","NULL","NULL","NULL","F","NULL","NULL","NULL","NULL","NULL","F","NULL","NULL","NULL","NULL","NULL","F","NULL","NULL","NULL","NULL","NULL","F","NULL","NULL","NULL","NULL","NULL","F","NULL","NULL","NULL","NULL","NULL","F","NULL","NULL","NULL","NULL","NULL","F","NULL","NULL","NULL","NULL","NULL","F","NULL","NULL","NULL","NULL","NULL","F","NULL","NULL","NULL","NULL","NULL","F","NULL","NULL","NULL","NULL","NULL","F","NULL","NULL","NULL","NULL","NULL","F","NULL","NULL","NULL","NULL","NULL","F","NULL","NULL","NULL",45253.110922256943,45253.110922256943]
[17949,"Yes","Prescriptive","COMWASHGDRYEET","Commercial Washer Ele Dryer Gas/Other WH, Energy Star, EOT","Clothes washer","Appliance","ELE","N/A",935,89,5,5758,"OR","NBE","New Buildings","2024-01-01","2026-12-31","Units",0,0,804.37,0,326.56,0,"Other Process","None - gas",0,150,0,7,0,531.15,0,0,0,1,1,0,"NULL",100,100,"NULL","NULL","NULL","NULL","NULL","NULL","NULL","NULL","NULL","NULL","NULL","NULL","Clothes Washer","MEF","MEF","T","Alphanumeric",5,"ED","WATERFACTOR","Water Factor","F","Alphanumeric",10,"ED","NULL","NULL","F","NULL","NULL","NULL","NULL","NULL","F","NULL","NULL","NULL","NULL","NULL","F","NULL","NULL","NULL","NULL","NULL","F","NULL","NULL","NULL","NULL","NULL","F","NULL","NULL","NULL","NULL","NULL","F","NULL","NULL","NULL","NULL","NULL","F","NULL","NULL","NULL","NULL","NULL","F","NULL","NULL","NULL","NULL","NULL","F","NULL","NULL","NULL","NULL","NULL","F","NULL","NULL","NULL","NULL","NULL","F","NULL","NULL","NULL","NULL","NULL","F","NULL","NULL","NULL","NULL","NULL","F","NULL","NULL","NULL","NULL","NULL","F","NULL","NULL","NULL","NULL","NULL","F","NULL","NULL","NULL",45253.110922256943,45253.110922256943]
[17950,"Yes","Prescriptive","COMWASHEDRYGMFET","MF Commercial Washer Gas/Other Dryer Ele WH, Energy Star, EOT","Clothes washer","Appliance","ELE","N/A",935,89,5,5756,"OR","NBE","New Buildings","2024-01-01","2026-12-31","Units",0,0,312.74,0,252.42,0,"Res Clotheswasher","None - gas",0,150,0,11,0,531.15,0,0,0,1,1,0,"NULL",100,100,"NULL","NULL","NULL","NULL","NULL","NULL","NULL","NULL","NULL","NULL","NULL","NULL","Clothes Washer","MEF","MEF","T","Alphanumeric",5,"ED","WATERFACTOR","Water Factor","F","Alphanumeric",10,"ED","NULL","NULL","F","NULL","NULL","NULL","NULL","NULL","F","NULL","NULL","NULL","NULL","NULL","F","NULL","NULL","NULL","NULL","NULL","F","NULL","NULL","NULL","NULL","NULL","F","NULL","NULL","NULL","NULL","NULL","F","NULL","NULL","NULL","NULL","NULL","F","NULL","NULL","NULL","NULL","NULL","F","NULL","NULL","NULL","NULL","NULL","F","NULL","NULL","NULL","NULL","NULL","F","NULL","NULL","NULL","NULL","NULL","F","NULL","NULL","NULL","NULL","NULL","F","NULL","NULL","NULL","NULL","NULL","F","NULL","NULL","NULL","NULL","NULL","F","NULL","NULL","NULL","NULL","NULL","F","NULL","NULL","NULL",45253.110922256943,45253.110922256943]
[17951,"Yes","Prescriptive","COMWASHGDRYEMFET","MF Commercial Washer Ele Dryer Gas/Other WH, Energy Star, EOT","Clothes washer","Appliance","ELE","N/A",935,89,5,5754,"OR","NBE","New Buildings","2024-01-01","2026-12-31","Units",0,0,588.37,0,242.27,0,"Res Clotheswasher","None - gas",0,150,0,11,0,531.15,0,0,0,1,1,0,"NULL",100,100,"NULL","NULL","NULL","NULL","NULL","NULL","NULL","NULL","NULL","NULL","NULL","NULL","Clothes Washer","MEF","MEF","T","Alphanumeric",5,"ED","WATERFACTOR","Water Factor","F","Alphanumeric",10,"ED","NULL","NULL","F","NULL","NULL","NULL","NULL","NULL","F","NULL","NULL","NULL","NULL","NULL","F","NULL","NULL","NULL","NULL","NULL","F","NULL","NULL","NULL","NULL","NULL","F","NULL","NULL","NULL","NULL","NULL","F","NULL","NULL","NULL","NULL","NULL","F","NULL","NULL","NULL","NULL","NULL","F","NULL","NULL","NULL","NULL","NULL","F","NULL","NULL","NULL","NULL","NULL","F","NULL","NULL","NULL","NULL","NULL","F","NULL","NULL","NULL","NULL","NULL","F","NULL","NULL","NULL","NULL","NULL","F","NULL","NULL","NULL","NULL","NULL","F","NULL","NULL","NULL","NULL","NULL","F","NULL","NULL","NULL",45253.110922256943,45253.110922256943]
[17952,"Yes","Prescriptive","COMWASHGDRYGFT","Commercial Washer Gas Dryer Gas WH, Energy Star","Clothes washer","Appliance","BOTH","N/A",935,89,5,5740,"OR","NBE","New Buildings","2024-01-01","2026-12-31","Units",0,0,64.09,44.86,307.05,0,"Other Process","Clotheswasher",0,350,0,7,0,531.15,0,0,0,1,1,0,92,8,8,92,92,92,92,"NULL","NULL","NULL","NULL","NULL","NULL",92,"NULL","Clothes Washer","MEF","MEF","T","Alphanumeric",5,"ED","WATERFACTOR","Water Factor","F","Alphanumeric",10,"ED","NULL","NULL","F","NULL","NULL","NULL","NULL","NULL","F","NULL","NULL","NULL","NULL","NULL","F","NULL","NULL","NULL","NULL","NULL","F","NULL","NULL","NULL","NULL","NULL","F","NULL","NULL","NULL","NULL","NULL","F","NULL","NULL","NULL","NULL","NULL","F","NULL","NULL","NULL","NULL","NULL","F","NULL","NULL","NULL","NULL","NULL","F","NULL","NULL","NULL","NULL","NULL","F","NULL","NULL","NULL","NULL","NULL","F","NULL","NULL","NULL","NULL","NULL","F","NULL","NULL","NULL","NULL","NULL","F","NULL","NULL","NULL","NULL","NULL","F","NULL","NULL","NULL","NULL","NULL","F","NULL","NULL","NULL",45253.110922256943,45253.110922256943]
[17953,"Yes","Prescriptive","COMWASHEDRYGFT","Commercial Washer Gas Dryer Ele WH, Energy Star","Clothes washer","Appliance","BOTH","N/A",935,89,5,5738,"OR","NBE","New Buildings","2024-01-01","2026-12-31","Units",0,0,427.56,28.31,307.05,0,"Other Process","Clotheswasher",0,350,0,7,0,531.15,0,0,0,1,1,0,53,47,47,53,53,53,53,"NULL","NULL","NULL","NULL","NULL","NULL",53,"NULL","Clothes Washer","MEF","MEF","T","Alphanumeric",5,"ED","WATERFACTOR","Water Factor","F","Alphanumeric",10,"ED","NULL","NULL","F","NULL","NULL","NULL","NULL","NULL","F","NULL","NULL","NULL","NULL","NULL","F","NULL","NULL","NULL","NULL","NULL","F","NULL","NULL","NULL","NULL","NULL","F","NULL","NULL","NULL","NULL","NULL","F","NULL","NULL","NULL","NULL","NULL","F","NULL","NULL","NULL","NULL","NULL","F","NULL","NULL","NULL","NULL","NULL","F","NULL","NULL","NULL","NULL","NULL","F","NULL","NULL","NULL","NULL","NULL","F","NULL","NULL","NULL","NULL","NULL","F","NULL","NULL","NULL","NULL","NULL","F","NULL","NULL","NULL","NULL","NULL","F","NULL","NULL","NULL","NULL","NULL","F","NULL","NULL","NULL",45253.110922256943,45253.110922256943]
[17954,"Yes","Prescriptive","COMWASHGDRYEFT","Commercial Washer Ele Dryer Gas WH, Energy Star","Clothes washer","Appliance","BOTH","N/A",935,89,5,5736,"OR","NBE","New Buildings","2024-01-01","2026-12-31","Units",0,0,804.37,16.55,307.05,0,"Other Process","Clotheswasher",0,400,0,7,0,531.15,0,0,0,1,1,0,26,74,74,26,26,26,26,"NULL","NULL","NULL","NULL","NULL","NULL",26,"NULL","Clothes Washer","MEF","MEF","T","Alphanumeric",5,"ED","WATERFACTOR","Water Factor","F","Alphanumeric",10,"ED","NULL","NULL","F","NULL","NULL","NULL","NULL","NULL","F","NULL","NULL","NULL","NULL","NULL","F","NULL","NULL","NULL","NULL","NULL","F","NULL","NULL","NULL","NULL","NULL","F","NULL","NULL","NULL","NULL","NULL","F","NULL","NULL","NULL","NULL","NULL","F","NULL","NULL","NULL","NULL","NULL","F","NULL","NULL","NULL","NULL","NULL","F","NULL","NULL","NULL","NULL","NULL","F","NULL","NULL","NULL","NULL","NULL","F","NULL","NULL","NULL","NULL","NULL","F","NULL","NULL","NULL","NULL","NULL","F","NULL","NULL","NULL","NULL","NULL","F","NULL","NULL","NULL","NULL","NULL","F","NULL","NULL","NULL",45253.110922256943,45253.110922256943]
[17955,"Yes","Prescriptive","COMWASHEDRYEFT","Commercial Washer Ele Dryer Ele WH, Energy Star","Clothes washer","Appliance","ELE","N/A",935,89,5,5734,"OR","NBE","New Buildings","2024-01-01","2026-12-31","Units",0,0,1167.8399999999999,0,307.05,0,"Other Process","None - gas",0,400,0,7,0,531.15,0,0,0,1,1,0,"NULL",100,100,"NULL","NULL","NULL","NULL","NULL","NULL","NULL","NULL","NULL","NULL","NULL","NULL","Clothes Washer","MEF","MEF","T","Alphanumeric",5,"ED","WATERFACTOR","Water Factor","F","Alphanumeric",10,"ED","NULL","NULL","F","NULL","NULL","NULL","NULL","NULL","F","NULL","NULL","NULL","NULL","NULL","F","NULL","NULL","NULL","NULL","NULL","F","NULL","NULL","NULL","NULL","NULL","F","NULL","NULL","NULL","NULL","NULL","F","NULL","NULL","NULL","NULL","NULL","F","NULL","NULL","NULL","NULL","NULL","F","NULL","NULL","NULL","NULL","NULL","F","NULL","NULL","NULL","NULL","NULL","F","NULL","NULL","NULL","NULL","NULL","F","NULL","NULL","NULL","NULL","NULL","F","NULL","NULL","NULL","NULL","NULL","F","NULL","NULL","NULL","NULL","NULL","F","NULL","NULL","NULL","NULL","NULL","F","NULL","NULL","NULL",45253.110922256943,45253.110922256943]
[17956,"Yes","Prescriptive","COMWASHGDRYGMFFT","MF Commercial Washer Gas Dryer Gas WH, Energy Star","Clothes washer","Appliance","BOTH","N/A",935,89,5,5732,"OR","NBE","New Buildings","2024-01-01","2026-12-31","Units",0,0,46.88,32.81,228,0,"Res Clotheswasher","Clotheswasher",0,350,0,11,0,531.15,0,0,0,1,1,0,92,8,8,92,92,92,92,"NULL","NULL","NULL","NULL","NULL","NULL",92,"NULL","Clothes Washer","MEF","MEF","T","Alphanumeric",5,"ED","WATERFACTOR","Water Factor","F","Alphanumeric",10,"ED","NULL","NULL","F","NULL","NULL","NULL","NULL","NULL","F","NULL","NULL","NULL","NULL","NULL","F","NULL","NULL","NULL","NULL","NULL","F","NULL","NULL","NULL","NULL","NULL","F","NULL","NULL","NULL","NULL","NULL","F","NULL","NULL","NULL","NULL","NULL","F","NULL","NULL","NULL","NULL","NULL","F","NULL","NULL","NULL","NULL","NULL","F","NULL","NULL","NULL","NULL","NULL","F","NULL","NULL","NULL","NULL","NULL","F","NULL","NULL","NULL","NULL","NULL","F","NULL","NULL","NULL","NULL","NULL","F","NULL","NULL","NULL","NULL","NULL","F","NULL","NULL","NULL","NULL","NULL","F","NULL","NULL","NULL",45253.110922256943,45253.110922256943]
[17957,"Yes","Prescriptive","COMWASHEDRYGMFFT","MF Commercial Washer Gas Dryer Ele WH, Energy Star","Clothes washer","Appliance","BOTH","N/A",935,89,5,5730,"OR","NBE","New Buildings","2024-01-01","2026-12-31","Units",0,0,312.74,20.71,228,0,"Res Clotheswasher","Clotheswasher",0,350,0,11,0,531.15,0,0,0,1,1,0,52,48,48,52,52,52,52,"NULL","NULL","NULL","NULL","NULL","NULL",52,"NULL","Clothes Washer","MEF","MEF","T","Alphanumeric",5,"ED","WATERFACTOR","Water Factor","F","Alphanumeric",10,"ED","NULL","NULL","F","NULL","NULL","NULL","NULL","NULL","F","NULL","NULL","NULL","NULL","NULL","F","NULL","NULL","NULL","NULL","NULL","F","NULL","NULL","NULL","NULL","NULL","F","NULL","NULL","NULL","NULL","NULL","F","NULL","NULL","NULL","NULL","NULL","F","NULL","NULL","NULL","NULL","NULL","F","NULL","NULL","NULL","NULL","NULL","F","NULL","NULL","NULL","NULL","NULL","F","NULL","NULL","NULL","NULL","NULL","F","NULL","NULL","NULL","NULL","NULL","F","NULL","NULL","NULL","NULL","NULL","F","NULL","NULL","NULL","NULL","NULL","F","NULL","NULL","NULL","NULL","NULL","F","NULL","NULL","NULL",45253.110922256943,45253.110922256943]
[17958,"Yes","Prescriptive","COMWASHGDRYEMFFT","MF Commercial Washer Ele Dryer Gas WH, Energy Star","Clothes washer","Appliance","BOTH","N/A",935,89,5,5728,"OR","NBE","New Buildings","2024-01-01","2026-12-31","Units",0,0,588.37,12.1,228,0,"Res Clotheswasher","Clotheswasher",0,400,0,11,0,531.15,0,0,0,1,1,0,25,75,75,25,25,25,25,"NULL","NULL","NULL","NULL","NULL","NULL",25,"NULL","Clothes Washer","MEF","MEF","T","Alphanumeric",5,"ED","WATERFACTOR","Water Factor","F","Alphanumeric",10,"ED","NULL","NULL","F","NULL","NULL","NULL","NULL","NULL","F","NULL","NULL","NULL","NULL","NULL","F","NULL","NULL","NULL","NULL","NULL","F","NULL","NULL","NULL","NULL","NULL","F","NULL","NULL","NULL","NULL","NULL","F","NULL","NULL","NULL","NULL","NULL","F","NULL","NULL","NULL","NULL","NULL","F","NULL","NULL","NULL","NULL","NULL","F","NULL","NULL","NULL","NULL","NULL","F","NULL","NULL","NULL","NULL","NULL","F","NULL","NULL","NULL","NULL","NULL","F","NULL","NULL","NULL","NULL","NULL","F","NULL","NULL","NULL","NULL","NULL","F","NULL","NULL","NULL","NULL","NULL","F","NULL","NULL","NULL",45253.110922256943,45253.110922256943]
[17959,"Yes","Prescriptive","COMWASHEDRYEMFFT","MF Commercial Washer Ele Dryer Ele WH, Energy Star","Clothes washer","Appliance","ELE","N/A",935,89,5,5726,"OR","NBE","New Buildings","2024-01-01","2026-12-31","Units",0,0,854.23,0,228,0,"Res Clotheswasher","None - gas",0,400,0,11,0,531.15,0,0,0,1,1,0,"NULL",100,100,"NULL","NULL","NULL","NULL","NULL","NULL","NULL","NULL","NULL","NULL","NULL","NULL","Clothes Washer","MEF","MEF","T","Alphanumeric",5,"ED","WATERFACTOR","Water Factor","F","Alphanumeric",10,"ED","NULL","NULL","F","NULL","NULL","NULL","NULL","NULL","F","NULL","NULL","NULL","NULL","NULL","F","NULL","NULL","NULL","NULL","NULL","F","NULL","NULL","NULL","NULL","NULL","F","NULL","NULL","NULL","NULL","NULL","F","NULL","NULL","NULL","NULL","NULL","F","NULL","NULL","NULL","NULL","NULL","F","NULL","NULL","NULL","NULL","NULL","F","NULL","NULL","NULL","NULL","NULL","F","NULL","NULL","NULL","NULL","NULL","F","NULL","NULL","NULL","NULL","NULL","F","NULL","NULL","NULL","NULL","NULL","F","NULL","NULL","NULL","NULL","NULL","F","NULL","NULL","NULL","NULL","NULL","F","NULL","NULL","NULL",45253.110922256943,45253.110922256943]
[17960,"Yes","Prescriptive","COMWASHGDRYGGT","Commercial Washer Gas Dryer Gas WH, Energy Star, GOT","Clothes washer","Appliance","GAS","N/A",935,89,5,5752,"OR","NBE","New Buildings","2024-01-01","2026-12-31","Units",0,0,0,44.86,314.91000000000003,0,"None - ele","Clotheswasher",0,100,0,7,0,531.15,0,0,0,1,1,0,100,"NULL","NULL",100,100,100,100,"NULL","NULL","NULL","NULL","NULL","NULL",100,"NULL","Clothes Washer","MEF","MEF","T","Alphanumeric",5,"ED","WATERFACTOR","Water Factor","F","Alphanumeric",10,"ED","NULL","NULL","F","NULL","NULL","NULL","NULL","NULL","F","NULL","NULL","NULL","NULL","NULL","F","NULL","NULL","NULL","NULL","NULL","F","NULL","NULL","NULL","NULL","NULL","F","NULL","NULL","NULL","NULL","NULL","F","NULL","NULL","NULL","NULL","NULL","F","NULL","NULL","NULL","NULL","NULL","F","NULL","NULL","NULL","NULL","NULL","F","NULL","NULL","NULL","NULL","NULL","F","NULL","NULL","NULL","NULL","NULL","F","NULL","NULL","NULL","NULL","NULL","F","NULL","NULL","NULL","NULL","NULL","F","NULL","NULL","NULL","NULL","NULL","F","NULL","NULL","NULL","NULL","NULL","F","NULL","NULL","NULL",45253.110922256943,45253.110922256943]
[17961,"Yes","Prescriptive","COMWASHEDRYGGT","Commercial Washer Gas Dryer Ele WH, Energy Star, GOT","Clothes washer","Appliance","GAS","N/A",935,89,5,5750,"OR","NBE","New Buildings","2024-01-01","2026-12-31","Units",0,0,0,28.31,343.88,0,"None - ele","Clotheswasher",0,100,0,7,0,531.15,0,0,0,1,1,0,100,"NULL","NULL",100,100,100,100,"NULL","NULL","NULL","NULL","NULL","NULL",100,"NULL","Clothes Washer","MEF","MEF","T","Alphanumeric",5,"ED","WATERFACTOR","Water Factor","F","Alphanumeric",10,"ED","NULL","NULL","F","NULL","NULL","NULL","NULL","NULL","F","NULL","NULL","NULL","NULL","NULL","F","NULL","NULL","NULL","NULL","NULL","F","NULL","NULL","NULL","NULL","NULL","F","NULL","NULL","NULL","NULL","NULL","F","NULL","NULL","NULL","NULL","NULL","F","NULL","NULL","NULL","NULL","NULL","F","NULL","NULL","NULL","NULL","NULL","F","NULL","NULL","NULL","NULL","NULL","F","NULL","NULL","NULL","NULL","NULL","F","NULL","NULL","NULL","NULL","NULL","F","NULL","NULL","NULL","NULL","NULL","F","NULL","NULL","NULL","NULL","NULL","F","NULL","NULL","NULL","NULL","NULL","F","NULL","NULL","NULL",45253.110922256943,45253.110922256943]
[17962,"Yes","Prescriptive","COMWASHGDRYEGT","Commercial Washer Ele Dryer Gas WH, Energy Star, GOT","Clothes washer","Appliance","GAS","N/A",935,89,5,5748,"OR","NBE","New Buildings","2024-01-01","2026-12-31","Units",0,0,0,16.55,373.92,0,"None - ele","Clotheswasher",0,100,0,7,0,531.15,0,0,0,1,1,0,100,"NULL","NULL",100,100,100,100,"NULL","NULL","NULL","NULL","NULL","NULL",100,"NULL","Clothes Washer","MEF","MEF","T","Alphanumeric",5,"ED","WATERFACTOR","Water Factor","F","Alphanumeric",10,"ED","NULL","NULL","F","NULL","NULL","NULL","NULL","NULL","F","NULL","NULL","NULL","NULL","NULL","F","NULL","NULL","NULL","NULL","NULL","F","NULL","NULL","NULL","NULL","NULL","F","NULL","NULL","NULL","NULL","NULL","F","NULL","NULL","NULL","NULL","NULL","F","NULL","NULL","NULL","NULL","NULL","F","NULL","NULL","NULL","NULL","NULL","F","NULL","NULL","NULL","NULL","NULL","F","NULL","NULL","NULL","NULL","NULL","F","NULL","NULL","NULL","NULL","NULL","F","NULL","NULL","NULL","NULL","NULL","F","NULL","NULL","NULL","NULL","NULL","F","NULL","NULL","NULL","NULL","NULL","F","NULL","NULL","NULL",45253.110922256943,45253.110922256943]
[17963,"Yes","Prescriptive","COMWASHGDRYGMFGT","MF Commercial Washer Gas Dryer Gas WH, Energy Star, GOT","Clothes washer","Appliance","GAS","N/A",935,89,5,5746,"OR","NBE","New Buildings","2024-01-01","2026-12-31","Units",0,0,0,32.81,233.75,0,"None - ele","Clotheswasher",0,100,0,11,0,531.15,0,0,0,1,1,0,100,"NULL","NULL",100,100,100,100,"NULL","NULL","NULL","NULL","NULL","NULL",100,"NULL","Clothes Washer","MEF","MEF","T","Alphanumeric",5,"ED","WATERFACTOR","Water Factor","F","Alphanumeric",10,"ED","NULL","NULL","F","NULL","NULL","NULL","NULL","NULL","F","NULL","NULL","NULL","NULL","NULL","F","NULL","NULL","NULL","NULL","NULL","F","NULL","NULL","NULL","NULL","NULL","F","NULL","NULL","NULL","NULL","NULL","F","NULL","NULL","NULL","NULL","NULL","F","NULL","NULL","NULL","NULL","NULL","F","NULL","NULL","NULL","NULL","NULL","F","NULL","NULL","NULL","NULL","NULL","F","NULL","NULL","NULL","NULL","NULL","F","NULL","NULL","NULL","NULL","NULL","F","NULL","NULL","NULL","NULL","NULL","F","NULL","NULL","NULL","NULL","NULL","F","NULL","NULL","NULL","NULL","NULL","F","NULL","NULL","NULL",45253.110922256943,45253.110922256943]
[17964,"Yes","Prescriptive","COMWASHEDRYGMFGT","MF Commercial Washer Gas Dryer Ele WH, Energy Star, GOT","Clothes washer","Appliance","GAS","N/A",935,89,5,5744,"OR","NBE","New Buildings","2024-01-01","2026-12-31","Units",0,0,0,20.71,254.94,0,"None - ele","Clotheswasher",0,100,0,11,0,531.15,0,0,0,1,1,0,100,"NULL","NULL",100,100,100,100,"NULL","NULL","NULL","NULL","NULL","NULL",100,"NULL","Clothes Washer","MEF","MEF","T","Alphanumeric",5,"ED","WATERFACTOR","Water Factor","F","Alphanumeric",10,"ED","NULL","NULL","F","NULL","NULL","NULL","NULL","NULL","F","NULL","NULL","NULL","NULL","NULL","F","NULL","NULL","NULL","NULL","NULL","F","NULL","NULL","NULL","NULL","NULL","F","NULL","NULL","NULL","NULL","NULL","F","NULL","NULL","NULL","NULL","NULL","F","NULL","NULL","NULL","NULL","NULL","F","NULL","NULL","NULL","NULL","NULL","F","NULL","NULL","NULL","NULL","NULL","F","NULL","NULL","NULL","NULL","NULL","F","NULL","NULL","NULL","NULL","NULL","F","NULL","NULL","NULL","NULL","NULL","F","NULL","NULL","NULL","NULL","NULL","F","NULL","NULL","NULL","NULL","NULL","F","NULL","NULL","NULL",45253.110922256943,45253.110922256943]
[17965,"Yes","Prescriptive","COMWASHGDRYEMFGT","MF Commercial Washer Ele Dryer Gas WH, Energy Star, GOT","Clothes washer","Appliance","GAS","N/A",935,89,5,5742,"OR","NBE","New Buildings","2024-01-01","2026-12-31","Units",0,0,0,12.1,276.91000000000003,0,"None - ele","Clotheswasher",0,100,0,11,0,531.15,0,0,0,1,1,0,100,"NULL","NULL",100,100,100,100,"NULL","NULL","NULL","NULL","NULL","NULL",100,"NULL","Clothes Washer","MEF","MEF","T","Alphanumeric",5,"ED","WATERFACTOR","Water Factor","F","Alphanumeric",10,"ED","NULL","NULL","F","NULL","NULL","NULL","NULL","NULL","F","NULL","NULL","NULL","NULL","NULL","F","NULL","NULL","NULL","NULL","NULL","F","NULL","NULL","NULL","NULL","NULL","F","NULL","NULL","NULL","NULL","NULL","F","NULL","NULL","NULL","NULL","NULL","F","NULL","NULL","NULL","NULL","NULL","F","NULL","NULL","NULL","NULL","NULL","F","NULL","NULL","NULL","NULL","NULL","F","NULL","NULL","NULL","NULL","NULL","F","NULL","NULL","NULL","NULL","NULL","F","NULL","NULL","NULL","NULL","NULL","F","NULL","NULL","NULL","NULL","NULL","F","NULL","NULL","NULL","NULL","NULL","F","NULL","NULL","NULL",45253.110922256943,45253.110922256943]
[17966,"Yes","Prescriptive","ICESCUBATCH","Commercial Ice Maker, Enrgy Str, Batch SCU, 200-4,000 lb/day","Icemaker","Food Service","ELE","N/A",905,90,3,5603,"OR","NBE","New Buildings","2024-01-01","2026-12-31","Units",0,0,559.25,0,17,0,"Restaurant Refrigeration","None - gas",0,180,0,8,0,188.22,0,0,0,1,1,0,"NULL",100,100,"NULL","NULL","NULL","NULL","NULL","NULL","NULL","NULL","NULL","NULL","NULL","NULL","Icemaker","MANUFACTURER","Manufacturer Name","F","Alphanumeric",64,"ED","MODEL","Model","F","Alphanumeric",64,"ED","NULL","NULL","F","NULL","NULL","NULL","NULL","NULL","F","NULL","NULL","NULL","NULL","NULL","F","NULL","NULL","NULL","NULL","NULL","F","NULL","NULL","NULL","NULL","NULL","F","NULL","NULL","NULL","NULL","NULL","F","NULL","NULL","NULL","NULL","NULL","F","NULL","NULL","NULL","NULL","NULL","F","NULL","NULL","NULL","NULL","NULL","F","NULL","NULL","NULL","NULL","NULL","F","NULL","NULL","NULL","NULL","NULL","F","NULL","NULL","NULL","NULL","NULL","F","NULL","NULL","NULL","NULL","NULL","F","NULL","NULL","NULL","NULL","NULL","F","NULL","NULL","NULL","NULL","NULL","F","NULL","NULL","NULL",45253.110922256943,45253.110922256943]
[17967,"Yes","Prescriptive","ICERCUBATCH","Commercial Ice Maker, Enrgy Str, Batch RCU, 988-4,000 lb/day","Icemaker","Food Service","ELE","N/A",905,90,3,5602,"OR","NBE","New Buildings","2024-01-01","2026-12-31","Units",0,0,1244.53,0,141.11000000000001,0,"Restaurant Refrigeration","None - gas",0,400,0,8,0,420.41,0,0,0,1,1,0,"NULL",100,100,"NULL","NULL","NULL","NULL","NULL","NULL","NULL","NULL","NULL","NULL","NULL","NULL","Icemaker","MANUFACTURER","Manufacturer Name","F","Alphanumeric",64,"ED","MODEL","Model","F","Alphanumeric",64,"ED","NULL","NULL","F","NULL","NULL","NULL","NULL","NULL","F","NULL","NULL","NULL","NULL","NULL","F","NULL","NULL","NULL","NULL","NULL","F","NULL","NULL","NULL","NULL","NULL","F","NULL","NULL","NULL","NULL","NULL","F","NULL","NULL","NULL","NULL","NULL","F","NULL","NULL","NULL","NULL","NULL","F","NULL","NULL","NULL","NULL","NULL","F","NULL","NULL","NULL","NULL","NULL","F","NULL","NULL","NULL","NULL","NULL","F","NULL","NULL","NULL","NULL","NULL","F","NULL","NULL","NULL","NULL","NULL","F","NULL","NULL","NULL","NULL","NULL","F","NULL","NULL","NULL","NULL","NULL","F","NULL","NULL","NULL",45253.110922256943,45253.110922256943]
[17968,"Yes","Prescriptive","ICERCUCONT","Commercial Ice Maker, Enrgy Str, Cont RCU, 800-4,000 lb/day","Icemaker","Food Service","ELE","N/A",905,90,3,5605,"OR","NBE","New Buildings","2024-01-01","2026-12-31","Units",0,0,4207.47,0,0,0,"Restaurant Refrigeration","None - gas",0,400,0,8,0,427.15,0,0,0,1,1,0,"NULL",100,100,"NULL","NULL","NULL","NULL","NULL","NULL","NULL","NULL","NULL","NULL","NULL","NULL","Icemaker","MANUFACTURER","Manufacturer Name","F","Alphanumeric",64,"ED","MODEL","Model","F","Alphanumeric",64,"ED","NULL","NULL","F","NULL","NULL","NULL","NULL","NULL","F","NULL","NULL","NULL","NULL","NULL","F","NULL","NULL","NULL","NULL","NULL","F","NULL","NULL","NULL","NULL","NULL","F","NULL","NULL","NULL","NULL","NULL","F","NULL","NULL","NULL","NULL","NULL","F","NULL","NULL","NULL","NULL","NULL","F","NULL","NULL","NULL","NULL","NULL","F","NULL","NULL","NULL","NULL","NULL","F","NULL","NULL","NULL","NULL","NULL","F","NULL","NULL","NULL","NULL","NULL","F","NULL","NULL","NULL","NULL","NULL","F","NULL","NULL","NULL","NULL","NULL","F","NULL","NULL","NULL","NULL","NULL","F","NULL","NULL","NULL",45253.110922256943,45253.110922256943]
[17969,"Yes","Prescriptive","ICEIMHCONT","Commercial Ice Maker, Enrgy Str, Cont IMH, 820-4,000 lb/day","Icemaker","Food Service","ELE","N/A",905,90,3,5604,"OR","NBE","New Buildings","2024-01-01","2026-12-31","Units",0,0,1138.52,0,0,0,"Restaurant Refrigeration","None - gas",0,400,0,8,0,436.86,0,0,0,1,1,0,"NULL",100,100,"NULL","NULL","NULL","NULL","NULL","NULL","NULL","NULL","NULL","NULL","NULL","NULL","Icemaker","MANUFACTURER","Manufacturer Name","F","Alphanumeric",64,"ED","MODEL","Model","F","Alphanumeric",64,"ED","NULL","NULL","F","NULL","NULL","NULL","NULL","NULL","F","NULL","NULL","NULL","NULL","NULL","F","NULL","NULL","NULL","NULL","NULL","F","NULL","NULL","NULL","NULL","NULL","F","NULL","NULL","NULL","NULL","NULL","F","NULL","NULL","NULL","NULL","NULL","F","NULL","NULL","NULL","NULL","NULL","F","NULL","NULL","NULL","NULL","NULL","F","NULL","NULL","NULL","NULL","NULL","F","NULL","NULL","NULL","NULL","NULL","F","NULL","NULL","NULL","NULL","NULL","F","NULL","NULL","NULL","NULL","NULL","F","NULL","NULL","NULL","NULL","NULL","F","NULL","NULL","NULL","NULL","NULL","F","NULL","NULL","NULL",45253.110922256943,45253.110922256943]
[17970,"Yes","Prescriptive","ICEIMHBATCH","Commercial Ice Maker, Energy Star, Batch IMH, 1,500-4,000 lb/day","Icemaker","Food Service","ELE","N/A",905,90,3,5601,"OR","NBE","New Buildings","2024-01-01","2026-12-31","Units",0,0,1831.57,0,51.29,0,"Restaurant Refrigeration","None - gas",0,400,0,8,0,552.29999999999995,0,0,0,1,1,0,"NULL",100,100,"NULL","NULL","NULL","NULL","NULL","NULL","NULL","NULL","NULL","NULL","NULL","NULL","Icemaker","MANUFACTURER","Manufacturer Name","F","Alphanumeric",64,"ED","MODEL","Model","F","Alphanumeric",64,"ED","NULL","NULL","F","NULL","NULL","NULL","NULL","NULL","F","NULL","NULL","NULL","NULL","NULL","F","NULL","NULL","NULL","NULL","NULL","F","NULL","NULL","NULL","NULL","NULL","F","NULL","NULL","NULL","NULL","NULL","F","NULL","NULL","NULL","NULL","NULL","F","NULL","NULL","NULL","NULL","NULL","F","NULL","NULL","NULL","NULL","NULL","F","NULL","NULL","NULL","NULL","NULL","F","NULL","NULL","NULL","NULL","NULL","F","NULL","NULL","NULL","NULL","NULL","F","NULL","NULL","NULL","NULL","NULL","F","NULL","NULL","NULL","NULL","NULL","F","NULL","NULL","NULL","NULL","NULL","F","NULL","NULL","NULL",45253.110922256943,45253.110922256943]
[13300,"Yes","Prescriptive","HOTCABINETHALF","Electric Hot Food Holding Cabinet, Half Size","Food equipment","Food Service","ELE","N/A",762,101,4,3908,"OR","NBE","New Buildings","2022-01-01","2024-12-31","Units",0,0,736.04,0,0,0,"Restaurant Cooking","None - gas",0,450,0,12,0,498.74,0,0,0,1,1,0,"NULL",100,100,"NULL","NULL","NULL","NULL","NULL","NULL","NULL","NULL","NULL","NULL","NULL","NULL","Food equipment","MODEL","Model","T","ALPHANUMERIC",64,"ED","NULL","NULL","F","NULL","NULL","NULL","NULL","NULL","F","NULL","NULL","NULL","NULL","NULL","F","NULL","NULL","NULL","NULL","NULL","F","NULL","NULL","NULL","NULL","NULL","F","NULL","NULL","NULL","NULL","NULL","F","NULL","NULL","NULL","NULL","NULL","F","NULL","NULL","NULL","NULL","NULL","F","NULL","NULL","NULL","NULL","NULL","F","NULL","NULL","NULL","NULL","NULL","F","NULL","NULL","NULL","NULL","NULL","F","NULL","NULL","NULL","NULL","NULL","F","NULL","NULL","NULL","NULL","NULL","F","NULL","NULL","NULL","NULL","NULL","F","NULL","NULL","NULL","NULL","NULL","F","NULL","NULL","NULL","NULL","NULL","F","NULL","NULL","NULL",44952.607310150466,44952.607310150466]
[13309,"Yes","Prescriptive","ELESTEAM","Electric Steam Cooker","Food equipment","Food Service","ELE","N/A",762,101,4,3916,"OR","NBE","New Buildings","2022-01-01","2024-12-31","Units",0,0,13612.88,0,74.83,0,"Restaurant Cooking","None - gas",0,2500,0,12,0,1,0,0,0,1,1,0,"NULL",100,100,"NULL","NULL","NULL","NULL","NULL","NULL","NULL","NULL","NULL","NULL","NULL","NULL","Food equipment","MODEL","Model","T","ALPHANUMERIC",64,"ED","NULL","NULL","F","NULL","NULL","NULL","NULL","NULL","F","NULL","NULL","NULL","NULL","NULL","F","NULL","NULL","NULL","NULL","NULL","F","NULL","NULL","NULL","NULL","NULL","F","NULL","NULL","NULL","NULL","NULL","F","NULL","NULL","NULL","NULL","NULL","F","NULL","NULL","NULL","NULL","NULL","F","NULL","NULL","NULL","NULL","NULL","F","NULL","NULL","NULL","NULL","NULL","F","NULL","NULL","NULL","NULL","NULL","F","NULL","NULL","NULL","NULL","NULL","F","NULL","NULL","NULL","NULL","NULL","F","NULL","NULL","NULL","NULL","NULL","F","NULL","NULL","NULL","NULL","NULL","F","NULL","NULL","NULL","NULL","NULL","F","NULL","NULL","NULL",44952.607310150466,44952.607310150466]
[16354,"Yes","Prescriptive","ELECONVOVES3FULL","Electric Convection Oven - Full Size - Energy Star 3.0","Food equipment","Food Service","ELE","N/A",762,101,4,3910,"OR","NBE","New Buildings","2023-01-01","2024-12-31","Units",0,0,989.16,0,0,0,"Restaurant Cooking","None - gas",0,500,0,12,0,703.11,0,0,0,1,1,0,"NULL",100,100,"NULL","NULL","NULL","NULL","NULL","NULL","NULL","NULL","NULL","NULL","NULL","NULL","Food equipment","MODEL","Model","T","ALPHANUMERIC",64,"ED","NULL","NULL","F","NULL","NULL","NULL","NULL","NULL","F","NULL","NULL","NULL","NULL","NULL","F","NULL","NULL","NULL","NULL","NULL","F","NULL","NULL","NULL","NULL","NULL","F","NULL","NULL","NULL","NULL","NULL","F","NULL","NULL","NULL","NULL","NULL","F","NULL","NULL","NULL","NULL","NULL","F","NULL","NULL","NULL","NULL","NULL","F","NULL","NULL","NULL","NULL","NULL","F","NULL","NULL","NULL","NULL","NULL","F","NULL","NULL","NULL","NULL","NULL","F","NULL","NULL","NULL","NULL","NULL","F","NULL","NULL","NULL","NULL","NULL","F","NULL","NULL","NULL","NULL","NULL","F","NULL","NULL","NULL","NULL","NULL","F","NULL","NULL","NULL",44996.132606481478,44996.132606481478]
[16355,"Yes","Prescriptive","ELECONVOVES3HALF","Electric Convection Oven - Half Size - Energy Star 3.0","Food equipment","Food Service","ELE","N/A",762,101,4,3909,"OR","NBE","New Buildings","2023-01-01","2024-12-31","Units",0,0,912.22,0,0,0,"Restaurant Cooking","None - gas",0,300,0,12,0,359.75,0,0,0,1,1,0,"NULL",100,100,"NULL","NULL","NULL","NULL","NULL","NULL","NULL","NULL","NULL","NULL","NULL","NULL","Food equipment","MODEL","Model","T","ALPHANUMERIC",64,"ED","NULL","NULL","F","NULL","NULL","NULL","NULL","NULL","F","NULL","NULL","NULL","NULL","NULL","F","NULL","NULL","NULL","NULL","NULL","F","NULL","NULL","NULL","NULL","NULL","F","NULL","NULL","NULL","NULL","NULL","F","NULL","NULL","NULL","NULL","NULL","F","NULL","NULL","NULL","NULL","NULL","F","NULL","NULL","NULL","NULL","NULL","F","NULL","NULL","NULL","NULL","NULL","F","NULL","NULL","NULL","NULL","NULL","F","NULL","NULL","NULL","NULL","NULL","F","NULL","NULL","NULL","NULL","NULL","F","NULL","NULL","NULL","NULL","NULL","F","NULL","NULL","NULL","NULL","NULL","F","NULL","NULL","NULL","NULL","NULL","F","NULL","NULL","NULL",44996.132606481478,44996.132606481478]
[16759,"Yes","Prescriptive","COMBOOVES334PANELE","Electric Combination Ovens 3-4 Pan Capacity ESTAR 3.0","Food equipment","Food Service","ELE","N/A",762,101,4,3913,"OR","NBE","New Buildings","2023-04-01","2024-12-31","Units",0,0,973.78,0,0,0,"Restaurant Cooking","None - gas",0,500,0,12,0,1,0,0,0,1,1,0,"NULL",100,100,"NULL","NULL","NULL","NULL","NULL","NULL","NULL","NULL","NULL","NULL","NULL","NULL","Food equipment","MODEL","Model","T","ALPHANUMERIC",64,"ED","NULL","NULL","F","NULL","NULL","NULL","NULL","NULL","F","NULL","NULL","NULL","NULL","NULL","F","NULL","NULL","NULL","NULL","NULL","F","NULL","NULL","NULL","NULL","NULL","F","NULL","NULL","NULL","NULL","NULL","F","NULL","NULL","NULL","NULL","NULL","F","NULL","NULL","NULL","NULL","NULL","F","NULL","NULL","NULL","NULL","NULL","F","NULL","NULL","NULL","NULL","NULL","F","NULL","NULL","NULL","NULL","NULL","F","NULL","NULL","NULL","NULL","NULL","F","NULL","NULL","NULL","NULL","NULL","F","NULL","NULL","NULL","NULL","NULL","F","NULL","NULL","NULL","NULL","NULL","F","NULL","NULL","NULL","NULL","NULL","F","NULL","NULL","NULL",45051.11887179398,45051.11887179398]
[16760,"Yes","Prescriptive","COMBOOVES3540PANELE","Electric Combination Ovens 5-40 Pan Capacity ESTAR 3.0","Food equipment","Food Service","ELE","N/A",762,101,4,3914,"OR","NBE","New Buildings","2023-04-01","2024-12-31","Units",0,0,3303.27,0,0,0,"Restaurant Cooking","None - gas",0,1000,0,12,0,1,0,0,0,1,1,0,"NULL",100,100,"NULL","NULL","NULL","NULL","NULL","NULL","NULL","NULL","NULL","NULL","NULL","NULL","Food equipment","MODEL","Model","T","ALPHANUMERIC",64,"ED","NULL","NULL","F","NULL","NULL","NULL","NULL","NULL","F","NULL","NULL","NULL","NULL","NULL","F","NULL","NULL","NULL","NULL","NULL","F","NULL","NULL","NULL","NULL","NULL","F","NULL","NULL","NULL","NULL","NULL","F","NULL","NULL","NULL","NULL","NULL","F","NULL","NULL","NULL","NULL","NULL","F","NULL","NULL","NULL","NULL","NULL","F","NULL","NULL","NULL","NULL","NULL","F","NULL","NULL","NULL","NULL","NULL","F","NULL","NULL","NULL","NULL","NULL","F","NULL","NULL","NULL","NULL","NULL","F","NULL","NULL","NULL","NULL","NULL","F","NULL","NULL","NULL","NULL","NULL","F","NULL","NULL","NULL","NULL","NULL","F","NULL","NULL","NULL",45051.11887179398,45051.11887179398]
[18152,"Yes","Prescriptive","RACKOVENDOUB","Rack Oven - Double Rack","Food equipment","Food Service","GAS","N/A",886,101,5,5432,"OR","NBE","New Buildings","2024-01-01","2024-12-31","Units",0,0,0,218.44,0,0,"None - ele","Flat - gas",0,2000,0,12,0,2079.7800000000002,0,0,0,1,1,0,100,"NULL","NULL",100,100,100,100,"NULL","NULL","NULL","NULL","NULL","NULL",100,"NULL","Food equipment","MODEL","Model","T","Alphanumeric",64,"ED","NULL","NULL","F","NULL","NULL","NULL","NULL","NULL","F","NULL","NULL","NULL","NULL","NULL","F","NULL","NULL","NULL","NULL","NULL","F","NULL","NULL","NULL","NULL","NULL","F","NULL","NULL","NULL","NULL","NULL","F","NULL","NULL","NULL","NULL","NULL","F","NULL","NULL","NULL","NULL","NULL","F","NULL","NULL","NULL","NULL","NULL","F","NULL","NULL","NULL","NULL","NULL","F","NULL","NULL","NULL","NULL","NULL","F","NULL","NULL","NULL","NULL","NULL","F","NULL","NULL","NULL","NULL","NULL","F","NULL","NULL","NULL","NULL","NULL","F","NULL","NULL","NULL","NULL","NULL","F","NULL","NULL","NULL","NULL","NULL","F","NULL","NULL","NULL",45266.124619872688,45266.124619872688]
[18181,"Yes","Prescriptive","GASSTEAMCOOK","Gas Steam Cooker","Food equipment","Food Service","GAS","N/A",886,101,5,5438,"OR","NBE","New Buildings","2024-01-01","2024-12-31","Units",0,0,0,555.32000000000005,263.45999999999998,0,"None - ele","Flat - gas",0,3400,0,12,0,1,0,0,0,1,1,0,100,"NULL","NULL",100,100,100,100,"NULL","NULL","NULL","NULL","NULL","NULL",100,"NULL","Food equipment","MODEL","Model","T","Alphanumeric",64,"ED","NULL","NULL","F","NULL","NULL","NULL","NULL","NULL","F","NULL","NULL","NULL","NULL","NULL","F","NULL","NULL","NULL","NULL","NULL","F","NULL","NULL","NULL","NULL","NULL","F","NULL","NULL","NULL","NULL","NULL","F","NULL","NULL","NULL","NULL","NULL","F","NULL","NULL","NULL","NULL","NULL","F","NULL","NULL","NULL","NULL","NULL","F","NULL","NULL","NULL","NULL","NULL","F","NULL","NULL","NULL","NULL","NULL","F","NULL","NULL","NULL","NULL","NULL","F","NULL","NULL","NULL","NULL","NULL","F","NULL","NULL","NULL","NULL","NULL","F","NULL","NULL","NULL","NULL","NULL","F","NULL","NULL","NULL","NULL","NULL","F","NULL","NULL","NULL",45266.124619872688,45266.124619872688]
[18182,"Yes","Prescriptive","BROILER2026E","Gas-fired Conveyor Broilers 20-26\", Elec Only Territory","Food equipment","Food Service","ELE","N/A",886,101,5,5443,"OR","NBE","New Buildings","2024-01-01","2024-12-31","Units",0,0,6403.32,0,2279.58,0,"Restaurant Cooking","None - gas",0,3000,0,12,0,3145.87,0,0,0,1,1,0,"NULL",100,100,"NULL","NULL","NULL","NULL","NULL","NULL","NULL","NULL","NULL","NULL","NULL","NULL","No Attributes ","NULL","NULL","F","NULL","NULL","NULL","NULL","NULL","F","NULL","NULL","NULL","NULL","NULL","F","NULL","NULL","NULL","NULL","NULL","F","NULL","NULL","NULL","NULL","NULL","F","NULL","NULL","NULL","NULL","NULL","F","NULL","NULL","NULL","NULL","NULL","F","NULL","NULL","NULL","NULL","NULL","F","NULL","NULL","NULL","NULL","NULL","F","NULL","NULL","NULL","NULL","NULL","F","NULL","NULL","NULL","NULL","NULL","F","NULL","NULL","NULL","NULL","NULL","F","NULL","NULL","NULL","NULL","NULL","F","NULL","NULL","NULL","NULL","NULL","F","NULL","NULL","NULL","NULL","NULL","F","NULL","NULL","NULL","NULL","NULL","F","NULL","NULL","NULL","NULL","NULL","F","NULL","NULL","NULL",45266.124619872688,45266.124619872688]
[18183,"Yes","Prescriptive","BROILER20E","Gas-fired Conveyor Broilers <20\", Elec Only Territory","Food equipment","Food Service","ELE","N/A",886,101,5,5442,"OR","NBE","New Buildings","2024-01-01","2024-12-31","Units",0,0,7143.84,0,1350.75,0,"Restaurant Cooking","None - gas",0,2500,0,12,0,2523.0300000000002,0,0,0,1,1,0,"NULL",100,100,"NULL","NULL","NULL","NULL","NULL","NULL","NULL","NULL","NULL","NULL","NULL","NULL","No Attributes ","NULL","NULL","F","NULL","NULL","NULL","NULL","NULL","F","NULL","NULL","NULL","NULL","NULL","F","NULL","NULL","NULL","NULL","NULL","F","NULL","NULL","NULL","NULL","NULL","F","NULL","NULL","NULL","NULL","NULL","F","NULL","NULL","NULL","NULL","NULL","F","NULL","NULL","NULL","NULL","NULL","F","NULL","NULL","NULL","NULL","NULL","F","NULL","NULL","NULL","NULL","NULL","F","NULL","NULL","NULL","NULL","NULL","F","NULL","NULL","NULL","NULL","NULL","F","NULL","NULL","NULL","NULL","NULL","F","NULL","NULL","NULL","NULL","NULL","F","NULL","NULL","NULL","NULL","NULL","F","NULL","NULL","NULL","NULL","NULL","F","NULL","NULL","NULL","NULL","NULL","F","NULL","NULL","NULL",45266.124619872688,45266.124619872688]
[18184,"Yes","Prescriptive","BROILER26F","Gas-fired Conveyor Broilers >26\", Full Territory","Food equipment","Food Service","BOTH","N/A",886,101,5,5441,"OR","NBE","New Buildings","2024-01-01","2024-12-31","Units",0,0,23849.1,3161.26,0,0,"Restaurant Cooking","Flat - gas",0,3500,0,12,0,3658.65,0,0,0,1,1,0,66,34,34,66,66,66,66,"NULL","NULL","NULL","NULL","NULL","NULL",66,"NULL","No Attributes ","NULL","NULL","F","NULL","NULL","NULL","NULL","NULL","F","NULL","NULL","NULL","NULL","NULL","F","NULL","NULL","NULL","NULL","NULL","F","NULL","NULL","NULL","NULL","NULL","F","NULL","NULL","NULL","NULL","NULL","F","NULL","NULL","NULL","NULL","NULL","F","NULL","NULL","NULL","NULL","NULL","F","NULL","NULL","NULL","NULL","NULL","F","NULL","NULL","NULL","NULL","NULL","F","NULL","NULL","NULL","NULL","NULL","F","NULL","NULL","NULL","NULL","NULL","F","NULL","NULL","NULL","NULL","NULL","F","NULL","NULL","NULL","NULL","NULL","F","NULL","NULL","NULL","NULL","NULL","F","NULL","NULL","NULL","NULL","NULL","F","NULL","NULL","NULL","NULL","NULL","F","NULL","NULL","NULL",45266.124619872688,45266.124619872688]
[18185,"Yes","Prescriptive","BROILER2026F","Gas-fired Conveyor Broilers, 20-26\", Full Territory","Food equipment","Food Service","BOTH","N/A",886,101,5,5440,"OR","NBE","New Buildings","2024-01-01","2024-12-31","Units",0,0,6403.32,1932.84,0,0,"Restaurant Cooking","Flat - gas",0,3000,0,12,0,3145.87,0,0,0,1,1,0,82,18,18,82,82,82,82,"NULL","NULL","NULL","NULL","NULL","NULL",82,"NULL","No Attributes ","NULL","NULL","F","NULL","NULL","NULL","NULL","NULL","F","NULL","NULL","NULL","NULL","NULL","F","NULL","NULL","NULL","NULL","NULL","F","NULL","NULL","NULL","NULL","NULL","F","NULL","NULL","NULL","NULL","NULL","F","NULL","NULL","NULL","NULL","NULL","F","NULL","NULL","NULL","NULL","NULL","F","NULL","NULL","NULL","NULL","NULL","F","NULL","NULL","NULL","NULL","NULL","F","NULL","NULL","NULL","NULL","NULL","F","NULL","NULL","NULL","NULL","NULL","F","NULL","NULL","NULL","NULL","NULL","F","NULL","NULL","NULL","NULL","NULL","F","NULL","NULL","NULL","NULL","NULL","F","NULL","NULL","NULL","NULL","NULL","F","NULL","NULL","NULL","NULL","NULL","F","NULL","NULL","NULL",45266.124619872688,45266.124619872688]
[18186,"Yes","Prescriptive","BROILER20F","Gas-fired Conveyor Broilers <20\", Full Territory","Food equipment","Food Service","BOTH","N/A",886,101,5,5439,"OR","NBE","New Buildings","2024-01-01","2024-12-31","Units",0,0,7143.84,1145.29,0,0,"Restaurant Cooking","Flat - gas",0,2500,0,12,0,2523.0300000000002,0,0,0,1,1,0,71,29,29,71,71,71,71,"NULL","NULL","NULL","NULL","NULL","NULL",71,"NULL","No Attributes ","NULL","NULL","F","NULL","NULL","NULL","NULL","NULL","F","NULL","NULL","NULL","NULL","NULL","F","NULL","NULL","NULL","NULL","NULL","F","NULL","NULL","NULL","NULL","NULL","F","NULL","NULL","NULL","NULL","NULL","F","NULL","NULL","NULL","NULL","NULL","F","NULL","NULL","NULL","NULL","NULL","F","NULL","NULL","NULL","NULL","NULL","F","NULL","NULL","NULL","NULL","NULL","F","NULL","NULL","NULL","NULL","NULL","F","NULL","NULL","NULL","NULL","NULL","F","NULL","NULL","NULL","NULL","NULL","F","NULL","NULL","NULL","NULL","NULL","F","NULL","NULL","NULL","NULL","NULL","F","NULL","NULL","NULL","NULL","NULL","F","NULL","NULL","NULL","NULL","NULL","F","NULL","NULL","NULL",45266.124619872688,45266.124619872688]
[18187,"Yes","Prescriptive","BROILER26GO","Gas-fired Conveyor Broilers >26\", Gas Only Territory","Food equipment","Food Service","GAS","N/A",886,101,5,5447,"OR","NBE","New Buildings","2024-01-01","2024-12-31","Units",0,0,0,3161.26,1900.94,0,"None - ele","Flat - gas",0,3500,0,12,0,3658.65,0,0,0,1,1,0,100,"NULL","NULL",100,100,100,100,"NULL","NULL","NULL","NULL","NULL","NULL",100,"NULL","No Attributes ","NULL","NULL","F","NULL","NULL","NULL","NULL","NULL","F","NULL","NULL","NULL","NULL","NULL","F","NULL","NULL","NULL","NULL","NULL","F","NULL","NULL","NULL","NULL","NULL","F","NULL","NULL","NULL","NULL","NULL","F","NULL","NULL","NULL","NULL","NULL","F","NULL","NULL","NULL","NULL","NULL","F","NULL","NULL","NULL","NULL","NULL","F","NULL","NULL","NULL","NULL","NULL","F","NULL","NULL","NULL","NULL","NULL","F","NULL","NULL","NULL","NULL","NULL","F","NULL","NULL","NULL","NULL","NULL","F","NULL","NULL","NULL","NULL","NULL","F","NULL","NULL","NULL","NULL","NULL","F","NULL","NULL","NULL","NULL","NULL","F","NULL","NULL","NULL","NULL","NULL","F","NULL","NULL","NULL",45266.124619872688,45266.124619872688]
[18188,"Yes","Prescriptive","BROILER2026GO","Gas-fired Conveyor Broilers 20-26\", Gas Only Territory","Food equipment","Food Service","GAS","N/A",886,101,5,5446,"OR","NBE","New Buildings","2024-01-01","2024-12-31","Units",0,0,0,1932.84,510.39,0,"None - ele","Flat - gas",0,3000,0,12,0,3145.87,0,0,0,1,1,0,100,"NULL","NULL",100,100,100,100,"NULL","NULL","NULL","NULL","NULL","NULL",100,"NULL","No Attributes ","NULL","NULL","F","NULL","NULL","NULL","NULL","NULL","F","NULL","NULL","NULL","NULL","NULL","F","NULL","NULL","NULL","NULL","NULL","F","NULL","NULL","NULL","NULL","NULL","F","NULL","NULL","NULL","NULL","NULL","F","NULL","NULL","NULL","NULL","NULL","F","NULL","NULL","NULL","NULL","NULL","F","NULL","NULL","NULL","NULL","NULL","F","NULL","NULL","NULL","NULL","NULL","F","NULL","NULL","NULL","NULL","NULL","F","NULL","NULL","NULL","NULL","NULL","F","NULL","NULL","NULL","NULL","NULL","F","NULL","NULL","NULL","NULL","NULL","F","NULL","NULL","NULL","NULL","NULL","F","NULL","NULL","NULL","NULL","NULL","F","NULL","NULL","NULL","NULL","NULL","F","NULL","NULL","NULL",45266.124619872688,45266.124619872688]
[18189,"Yes","Prescriptive","BROILER20GO","Gas-fired Conveyor Broilers <20\", Gas Only Territory","Food equipment","Food Service","GAS","N/A",762,101,4,3924,"OR","NBE","New Buildings","2024-01-01","2024-12-31","Units",0,0,0,1145.29,556,0,"None - ele","Flat - gas",0,2500,0,12,0,2523.0300000000002,0,0,0,1,1,0,100,"NULL","NULL",100,100,100,100,"NULL","NULL","NULL","NULL","NULL","NULL",100,"NULL","No Attributes ","NULL","NULL","F","NULL","NULL","NULL","NULL","NULL","F","NULL","NULL","NULL","NULL","NULL","F","NULL","NULL","NULL","NULL","NULL","F","NULL","NULL","NULL","NULL","NULL","F","NULL","NULL","NULL","NULL","NULL","F","NULL","NULL","NULL","NULL","NULL","F","NULL","NULL","NULL","NULL","NULL","F","NULL","NULL","NULL","NULL","NULL","F","NULL","NULL","NULL","NULL","NULL","F","NULL","NULL","NULL","NULL","NULL","F","NULL","NULL","NULL","NULL","NULL","F","NULL","NULL","NULL","NULL","NULL","F","NULL","NULL","NULL","NULL","NULL","F","NULL","NULL","NULL","NULL","NULL","F","NULL","NULL","NULL","NULL","NULL","F","NULL","NULL","NULL","NULL","NULL","F","NULL","NULL","NULL",45266.124619872688,45266.124619872688]
[18213,"Yes","Prescriptive","BROILER26E","Gas-fired Conveyor Broilers >26\", Elec Only Territory","Food equipment","Food Service","ELE","N/A",762,101,4,3923,"OR","NBE","New Buildings","2024-01-01","2024-12-31","Units",0,0,23849.1,0,2493,0,"Restaurant Cooking","None - gas",0,3500,0,12,0,3658.65,0,0,0,1,1,0,"NULL",100,100,"NULL","NULL","NULL","NULL","NULL","NULL","NULL","NULL","NULL","NULL","NULL","NULL","No Attributes ","NULL","NULL","F","NULL","NULL","NULL","NULL","NULL","F","NULL","NULL","NULL","NULL","NULL","F","NULL","NULL","NULL","NULL","NULL","F","NULL","NULL","NULL","NULL","NULL","F","NULL","NULL","NULL","NULL","NULL","F","NULL","NULL","NULL","NULL","NULL","F","NULL","NULL","NULL","NULL","NULL","F","NULL","NULL","NULL","NULL","NULL","F","NULL","NULL","NULL","NULL","NULL","F","NULL","NULL","NULL","NULL","NULL","F","NULL","NULL","NULL","NULL","NULL","F","NULL","NULL","NULL","NULL","NULL","F","NULL","NULL","NULL","NULL","NULL","F","NULL","NULL","NULL","NULL","NULL","F","NULL","NULL","NULL","NULL","NULL","F","NULL","NULL","NULL","NULL","NULL","F","NULL","NULL","NULL",45267.13832928241,45267.13832928241]
[17915,"Yes","Prescriptive","ESTARFRIDGE","Multifamily Refrigerator","Refrigerator","Appliance","ELE","N/A",913,112,6,5623,"OR","NBE","New Buildings","2024-01-01","2026-12-31","Units",0,0,75.77,0,0,0,"Res Refrigerator","None - gas",0,70,0,17,0,75.41,0,0,0,1,1,0,"NULL",100,100,"NULL","NULL","NULL","NULL","NULL","NULL","NULL","NULL","NULL","NULL","NULL","NULL","Residential Energy Star Refrigerator ","MANUFACTURER","Manufacturer","T","Alphanumeric",64,"CB","MODEL","Model","T","Alphanumeric",63,"CB","VOLUME","Volume (cubic feet)","T","Decimal",20,"CB","NULL","NULL","F","NULL","NULL","NULL","NULL","NULL","F","NULL","NULL","NULL","NULL","NULL","F","NULL","NULL","NULL","NULL","NULL","F","NULL","NULL","NULL","NULL","NULL","F","NULL","NULL","NULL","NULL","NULL","F","NULL","NULL","NULL","NULL","NULL","F","NULL","NULL","NULL","NULL","NULL","F","NULL","NULL","NULL","NULL","NULL","F","NULL","NULL","NULL","NULL","NULL","F","NULL","NULL","NULL","NULL","NULL","F","NULL","NULL","NULL","NULL","NULL","F","NULL","NULL","NULL","NULL","NULL","F","NULL","NULL","NULL","NULL","NULL","F","NULL","NULL","NULL",45253.110922256943,45253.110922256943]
[17916,"Yes","Prescriptive","ESMEFRIDGE","Energy Star Most Efficient (ESME) Multifamily Refrigerator","Refrigerator","Appliance","ELE","N/A",913,112,6,5624,"OR","NBE","New Buildings","2024-01-01","2026-12-31","Units",0,0,95.8,0,0,0,"Res Refrigerator","None - gas",0,70,0,17,0,83.07,0,0,0,1,1,0,"NULL",100,100,"NULL","NULL","NULL","NULL","NULL","NULL","NULL","NULL","NULL","NULL","NULL","NULL","Residential Energy Star Refrigerator ","MANUFACTURER","Manufacturer","T","Alphanumeric",64,"CB","MODEL","Model","T","Alphanumeric",63,"CB","VOLUME","Volume (cubic feet)","T","Decimal",20,"CB","NULL","NULL","F","NULL","NULL","NULL","NULL","NULL","F","NULL","NULL","NULL","NULL","NULL","F","NULL","NULL","NULL","NULL","NULL","F","NULL","NULL","NULL","NULL","NULL","F","NULL","NULL","NULL","NULL","NULL","F","NULL","NULL","NULL","NULL","NULL","F","NULL","NULL","NULL","NULL","NULL","F","NULL","NULL","NULL","NULL","NULL","F","NULL","NULL","NULL","NULL","NULL","F","NULL","NULL","NULL","NULL","NULL","F","NULL","NULL","NULL","NULL","NULL","F","NULL","NULL","NULL","NULL","NULL","F","NULL","NULL","NULL","NULL","NULL","F","NULL","NULL","NULL",45253.110922256943,45253.110922256943]
[17987,"Yes","Prescriptive","ESETAFRIDGE","Energy Star Emerging Tech Award (ESETA) Multifamily Refrigerator","Refrigerator","Appliance","ELE","N/A",913,112,6,5625,"OR","NBE","New Buildings","2024-01-01","2026-12-31","Units",0,0,135.88,0,0,0,"Res Refrigerator","None - gas",0,70,0,17,0,87.76,0,0,0,1,1,0,"NULL",100,100,"NULL","NULL","NULL","NULL","NULL","NULL","NULL","NULL","NULL","NULL","NULL","NULL","Residential Energy Star Refrigerator ","MANUFACTURER","Manufacturer","T","Alphanumeric",64,"CB","MODEL","Model","T","Alphanumeric",63,"CB","VOLUME","Volume (cubic feet)","T","Decimal",20,"CB","NULL","NULL","F","NULL","NULL","NULL","NULL","NULL","F","NULL","NULL","NULL","NULL","NULL","F","NULL","NULL","NULL","NULL","NULL","F","NULL","NULL","NULL","NULL","NULL","F","NULL","NULL","NULL","NULL","NULL","F","NULL","NULL","NULL","NULL","NULL","F","NULL","NULL","NULL","NULL","NULL","F","NULL","NULL","NULL","NULL","NULL","F","NULL","NULL","NULL","NULL","NULL","F","NULL","NULL","NULL","NULL","NULL","F","NULL","NULL","NULL","NULL","NULL","F","NULL","NULL","NULL","NULL","NULL","F","NULL","NULL","NULL","NULL","NULL","F","NULL","NULL","NULL",45253.110922256943,45253.110922256943]
[13851,"Yes","Prescriptive","RADHEATNONMOD","Infrared Radiant Heaters, non-modulating","Radiant heating","HVAC","BOTH","N/A",716,117,3,3663,"OR","NBE","New Buildings","2022-01-01","2024-12-31","kBtu/hr",0,0,2.5,2.93,0,0,"Warehouse Ventilation","Com Heating",0,1.25,0,20,0,1.31,0,0,0,1,1,0,94,6,6,94,94,94,"NULL","NULL","NULL","NULL","NULL","NULL","NULL",94,94,"Radiant heating","MODEL","Model","T","ALPHANUMERIC",64,"ED","MANUFACTURER","Manufacturer Name","T","Alphanumeric",64,"ED","NULL","NULL","F","NULL","NULL","NULL","NULL","NULL","F","NULL","NULL","NULL","NULL","NULL","F","NULL","NULL","NULL","NULL","NULL","F","NULL","NULL","NULL","NULL","NULL","F","NULL","NULL","NULL","NULL","NULL","F","NULL","NULL","NULL","NULL","NULL","F","NULL","NULL","NULL","NULL","NULL","F","NULL","NULL","NULL","NULL","NULL","F","NULL","NULL","NULL","NULL","NULL","F","NULL","NULL","NULL","NULL","NULL","F","NULL","NULL","NULL","NULL","NULL","F","NULL","NULL","NULL","NULL","NULL","F","NULL","NULL","NULL","NULL","NULL","F","NULL","NULL","NULL","NULL","NULL","F","NULL","NULL","NULL",44952.607310150466,45213.112933564815]
[13852,"Yes","Prescriptive","RADHEATMODGO","Infrared Radiant Heaters, Modulating, Gas Only","Radiant heating","HVAC","GAS","N/A",716,117,3,3666,"OR","NBE","New Buildings","2022-01-01","2024-12-31","kBtu/hr",0,0,0,3.8,0.19,0,"Warehouse Ventilation","Com Heating",0,2.25,0,20,0,2.44,0,0,0,1,1,0,100,"NULL","NULL",100,100,100,"NULL","NULL","NULL","NULL","NULL","NULL","NULL",100,100,"Radiant heating","MODEL","Model","T","ALPHANUMERIC",64,"ED","MANUFACTURER","Manufacturer Name","T","Alphanumeric",64,"ED","NULL","NULL","F","NULL","NULL","NULL","NULL","NULL","F","NULL","NULL","NULL","NULL","NULL","F","NULL","NULL","NULL","NULL","NULL","F","NULL","NULL","NULL","NULL","NULL","F","NULL","NULL","NULL","NULL","NULL","F","NULL","NULL","NULL","NULL","NULL","F","NULL","NULL","NULL","NULL","NULL","F","NULL","NULL","NULL","NULL","NULL","F","NULL","NULL","NULL","NULL","NULL","F","NULL","NULL","NULL","NULL","NULL","F","NULL","NULL","NULL","NULL","NULL","F","NULL","NULL","NULL","NULL","NULL","F","NULL","NULL","NULL","NULL","NULL","F","NULL","NULL","NULL","NULL","NULL","F","NULL","NULL","NULL",44952.607310150466,45213.112933564815]
[13890,"Yes","Prescriptive","RADHEATMOD","Infrared Radiant Heaters, Modulating","Radiant heating","HVAC","BOTH","N/A",716,117,3,3664,"OR","NBE","New Buildings","2022-01-01","2024-12-31","kBtu/hr",0,0,2.44,3.8,0,0,"Warehouse Ventilation","Com Heating",0,2.25,0,20,0,2.44,0,0,0,1,1,0,96,4,4,96,96,96,"NULL","NULL","NULL","NULL","NULL","NULL","NULL",96,96,"Radiant heating","MODEL","Model","T","ALPHANUMERIC",64,"ED","MANUFACTURER","Manufacturer Name","T","Alphanumeric",64,"ED","NULL","NULL","F","NULL","NULL","NULL","NULL","NULL","F","NULL","NULL","NULL","NULL","NULL","F","NULL","NULL","NULL","NULL","NULL","F","NULL","NULL","NULL","NULL","NULL","F","NULL","NULL","NULL","NULL","NULL","F","NULL","NULL","NULL","NULL","NULL","F","NULL","NULL","NULL","NULL","NULL","F","NULL","NULL","NULL","NULL","NULL","F","NULL","NULL","NULL","NULL","NULL","F","NULL","NULL","NULL","NULL","NULL","F","NULL","NULL","NULL","NULL","NULL","F","NULL","NULL","NULL","NULL","NULL","F","NULL","NULL","NULL","NULL","NULL","F","NULL","NULL","NULL","NULL","NULL","F","NULL","NULL","NULL",44952.607310150466,45213.112933564815]
[13891,"Yes","Prescriptive","RADHEATNONMODGO","Infrared Radiant Heaters, Non-Modulating, Gas Only","Radiant heating","HVAC","GAS","N/A",716,117,3,3665,"OR","NBE","New Buildings","2022-01-01","2024-12-31","kBtu/hr",0,0,0,2.93,0.19,0,"Warehouse Ventilation","Com Heating",0,1.25,0,20,0,1.31,0,0,0,1,1,0,100,"NULL","NULL",100,100,100,"NULL","NULL","NULL","NULL","NULL","NULL","NULL",100,100,"Radiant heating","MODEL","Model","T","ALPHANUMERIC",64,"ED","MANUFACTURER","Manufacturer Name","T","Alphanumeric",64,"ED","NULL","NULL","F","NULL","NULL","NULL","NULL","NULL","F","NULL","NULL","NULL","NULL","NULL","F","NULL","NULL","NULL","NULL","NULL","F","NULL","NULL","NULL","NULL","NULL","F","NULL","NULL","NULL","NULL","NULL","F","NULL","NULL","NULL","NULL","NULL","F","NULL","NULL","NULL","NULL","NULL","F","NULL","NULL","NULL","NULL","NULL","F","NULL","NULL","NULL","NULL","NULL","F","NULL","NULL","NULL","NULL","NULL","F","NULL","NULL","NULL","NULL","NULL","F","NULL","NULL","NULL","NULL","NULL","F","NULL","NULL","NULL","NULL","NULL","F","NULL","NULL","NULL","NULL","NULL","F","NULL","NULL","NULL",44952.607310150466,45213.112933564815]
[14202,"Yes","Prescriptive","LCGASGOT","MF Laundry Center, In-Unit, Gas DHW, GOT","Clothes washer","Appliance","GAS","DHW",774,152,5,4024,"OR","NBE","New Buildings","2022-01-01","2024-12-31","Units",0,1,0,5.46,37.94,0,"None - ele","Clotheswasher",0,85,0,12,0,88.24,0,0,0,1,1,0,100,"NULL","NULL",100,100,100,"NULL","NULL","NULL","NULL","NULL","NULL","NULL",100,100,"Clothes Washer","MANUFACTURER","Manufacturer Name","T","ALPHANUMERIC",40,"ED","MODEL","Model","T","ALPHANUMERIC",20,"ED","IMEF","Integrated Modified Energy Factor (IMEF)","T","ALPHANUMERIC",10,"ED","VOLUME","Volume (cubic feet)","F","DECIMAL",10,"ED","WATERFACTOR","Water Factor","F","ALPHANUMERIC",10,"ED","NULL","NULL","F","NULL","NULL","NULL","NULL","NULL","F","NULL","NULL","NULL","NULL","NULL","F","NULL","NULL","NULL","NULL","NULL","F","NULL","NULL","NULL","NULL","NULL","F","NULL","NULL","NULL","NULL","NULL","F","NULL","NULL","NULL","NULL","NULL","F","NULL","NULL","NULL","NULL","NULL","F","NULL","NULL","NULL","NULL","NULL","F","NULL","NULL","NULL","NULL","NULL","F","NULL","NULL","NULL","NULL","NULL","F","NULL","NULL","NULL","NULL","NULL","F","NULL","NULL","NULL",44952.607310150466,45213.112933564815]
[14203,"Yes","Prescriptive","LCGAS","MF Laundry Center, In-Unit, Gas DHW","Clothes washer","Appliance","BOTH","N/A",774,152,5,4023,"OR","NBE","New Buildings","2022-01-01","2024-12-31","Units",0,0,102.42,5.46,25.74,0,"Res Clotheswasher","Clotheswasher",0,85,0,12,0,88.24,0,0,0,1,1,0,31,69,69,31,31,31,"NULL","NULL","NULL","NULL","NULL","NULL","NULL",31,31,"Clothes Washer","MANUFACTURER","Manufacturer Name","T","ALPHANUMERIC",40,"ED","MODEL","Model","T","ALPHANUMERIC",20,"ED","IMEF","Integrated Modified Energy Factor (IMEF)","T","ALPHANUMERIC",10,"ED","VOLUME","Volume (cubic feet)","F","DECIMAL",10,"ED","WATERFACTOR","Water Factor","F","ALPHANUMERIC",10,"ED","NULL","NULL","F","NULL","NULL","NULL","NULL","NULL","F","NULL","NULL","NULL","NULL","NULL","F","NULL","NULL","NULL","NULL","NULL","F","NULL","NULL","NULL","NULL","NULL","F","NULL","NULL","NULL","NULL","NULL","F","NULL","NULL","NULL","NULL","NULL","F","NULL","NULL","NULL","NULL","NULL","F","NULL","NULL","NULL","NULL","NULL","F","NULL","NULL","NULL","NULL","NULL","F","NULL","NULL","NULL","NULL","NULL","F","NULL","NULL","NULL","NULL","NULL","F","NULL","NULL","NULL",44952.607310150466,45213.112933564815]
[14204,"Yes","Prescriptive","LCELEEOT","MF Laundry Center, In-Unit, Electric DHW, EOT","Clothes washer","Appliance","ELE","DHW",774,152,5,4022,"OR","NBE","New Buildings","2022-01-01","2024-12-31","Units",0,0,214.19,0,25.73,0,"Res Clotheswasher","None - gas",0,85,0,12,0,88.24,0,0,0,1,1,0,"NULL",100,100,"NULL","NULL","NULL","NULL","NULL","NULL","NULL","NULL","NULL","NULL","NULL","NULL","Clothes Washer","MANUFACTURER","Manufacturer Name","T","ALPHANUMERIC",40,"ED","MODEL","Model","T","ALPHANUMERIC",20,"ED","IMEF","Integrated Modified Energy Factor (IMEF)","T","ALPHANUMERIC",10,"ED","VOLUME","Volume (cubic feet)","F","DECIMAL",10,"ED","WATERFACTOR","Water Factor","F","ALPHANUMERIC",10,"ED","NULL","NULL","F","NULL","NULL","NULL","NULL","NULL","F","NULL","NULL","NULL","NULL","NULL","F","NULL","NULL","NULL","NULL","NULL","F","NULL","NULL","NULL","NULL","NULL","F","NULL","NULL","NULL","NULL","NULL","F","NULL","NULL","NULL","NULL","NULL","F","NULL","NULL","NULL","NULL","NULL","F","NULL","NULL","NULL","NULL","NULL","F","NULL","NULL","NULL","NULL","NULL","F","NULL","NULL","NULL","NULL","NULL","F","NULL","NULL","NULL","NULL","NULL","F","NULL","NULL","NULL",44952.607310150466,44952.607310150466]
[14205,"Yes","Prescriptive","LCELE","MF Laundry Center, In-Unit, Electric DHW","Clothes washer","Appliance","BOTH","N/A",774,152,5,4021,"OR","NBE","New Buildings","2022-01-01","2024-12-31","Units",0,0,214.19,0.14000000000000001,25.73,0,"Res Clotheswasher","Clotheswasher",0,85,0,12,0,88.24,0,0,0,1,1,0,1,99,99,1,1,1,"NULL","NULL","NULL","NULL","NULL","NULL","NULL",1,1,"Clothes Washer","MANUFACTURER","Manufacturer Name","T","ALPHANUMERIC",40,"ED","MODEL","Model","T","ALPHANUMERIC",20,"ED","IMEF","Integrated Modified Energy Factor (IMEF)","T","ALPHANUMERIC",10,"ED","VOLUME","Volume (cubic feet)","F","DECIMAL",10,"ED","WATERFACTOR","Water Factor","F","ALPHANUMERIC",10,"ED","NULL","NULL","F","NULL","NULL","NULL","NULL","NULL","F","NULL","NULL","NULL","NULL","NULL","F","NULL","NULL","NULL","NULL","NULL","F","NULL","NULL","NULL","NULL","NULL","F","NULL","NULL","NULL","NULL","NULL","F","NULL","NULL","NULL","NULL","NULL","F","NULL","NULL","NULL","NULL","NULL","F","NULL","NULL","NULL","NULL","NULL","F","NULL","NULL","NULL","NULL","NULL","F","NULL","NULL","NULL","NULL","NULL","F","NULL","NULL","NULL","NULL","NULL","F","NULL","NULL","NULL",44952.607310150466,45213.112933564815]
[14206,"Yes","Prescriptive","WASHGASFLGOT","MF Clothes Washer, In-Unit, Gas DHW, GOT","Clothes washer","Appliance","GAS","DHW",774,152,5,4019,"OR","NBE","New Buildings","2022-01-01","2024-12-31","Units",0,1,0,5.53,32.21,0,"None - ele","Clotheswasher",0,60,0,14,0,64.900000000000006,0,0,0,1,1,0,100,"NULL","NULL",100,100,100,"NULL","NULL","NULL","NULL","NULL","NULL","NULL",100,100,"Clothes Washer","MANUFACTURER","Manufacturer Name","T","ALPHANUMERIC",40,"ED","MODEL","Model","T","ALPHANUMERIC",20,"ED","IMEF","Integrated Modified Energy Factor (IMEF)","T","ALPHANUMERIC",10,"ED","VOLUME","Volume (cubic feet)","F","DECIMAL",10,"ED","WATERFACTOR","Water Factor","F","ALPHANUMERIC",10,"ED","NULL","NULL","F","NULL","NULL","NULL","NULL","NULL","F","NULL","NULL","NULL","NULL","NULL","F","NULL","NULL","NULL","NULL","NULL","F","NULL","NULL","NULL","NULL","NULL","F","NULL","NULL","NULL","NULL","NULL","F","NULL","NULL","NULL","NULL","NULL","F","NULL","NULL","NULL","NULL","NULL","F","NULL","NULL","NULL","NULL","NULL","F","NULL","NULL","NULL","NULL","NULL","F","NULL","NULL","NULL","NULL","NULL","F","NULL","NULL","NULL","NULL","NULL","F","NULL","NULL","NULL",44952.607310150466,45213.112933564815]
[14207,"Yes","Prescriptive","WASHELEFLEOT","MF Clothes Washer, In-Unit, Electric DHW, EOT","Clothes washer","Appliance","ELE","DHW",774,152,5,4017,"OR","NBE","New Buildings","2022-01-01","2024-12-31","Units",0,0,166.06,0,25.74,0,"Res Clotheswasher","None - gas",0,60,0,14,0,64.900000000000006,0,0,0,1,1,0,"NULL",100,100,"NULL","NULL","NULL","NULL","NULL","NULL","NULL","NULL","NULL","NULL","NULL","NULL","Clothes Washer","MANUFACTURER","Manufacturer Name","T","ALPHANUMERIC",40,"ED","MODEL","Model","T","ALPHANUMERIC",20,"ED","IMEF","Integrated Modified Energy Factor (IMEF)","T","ALPHANUMERIC",10,"ED","VOLUME","Volume (cubic feet)","F","DECIMAL",10,"ED","WATERFACTOR","Water Factor","F","ALPHANUMERIC",10,"ED","NULL","NULL","F","NULL","NULL","NULL","NULL","NULL","F","NULL","NULL","NULL","NULL","NULL","F","NULL","NULL","NULL","NULL","NULL","F","NULL","NULL","NULL","NULL","NULL","F","NULL","NULL","NULL","NULL","NULL","F","NULL","NULL","NULL","NULL","NULL","F","NULL","NULL","NULL","NULL","NULL","F","NULL","NULL","NULL","NULL","NULL","F","NULL","NULL","NULL","NULL","NULL","F","NULL","NULL","NULL","NULL","NULL","F","NULL","NULL","NULL","NULL","NULL","F","NULL","NULL","NULL",44952.607310150466,44952.607310150466]
[14208,"Yes","Prescriptive","WASHELEFL","MF Clothes Washer, In-Unit, Electric DHW","Clothes washer","Appliance","BOTH","N/A",774,152,5,4016,"OR","NBE","New Buildings","2022-01-01","2024-12-31","Units",0,0,166.06,0.2,25.74,0,"Res Clotheswasher","Clotheswasher",0,60,0,14,0,64.900000000000006,0,0,0,1,1,0,1,99,99,1,1,1,"NULL","NULL","NULL","NULL","NULL","NULL","NULL",1,1,"Clothes Washer","MANUFACTURER","Manufacturer Name","T","ALPHANUMERIC",40,"ED","MODEL","Model","T","ALPHANUMERIC",20,"ED","IMEF","Integrated Modified Energy Factor (IMEF)","T","ALPHANUMERIC",10,"ED","VOLUME","Volume (cubic feet)","F","DECIMAL",10,"ED","WATERFACTOR","Water Factor","F","ALPHANUMERIC",10,"ED","NULL","NULL","F","NULL","NULL","NULL","NULL","NULL","F","NULL","NULL","NULL","NULL","NULL","F","NULL","NULL","NULL","NULL","NULL","F","NULL","NULL","NULL","NULL","NULL","F","NULL","NULL","NULL","NULL","NULL","F","NULL","NULL","NULL","NULL","NULL","F","NULL","NULL","NULL","NULL","NULL","F","NULL","NULL","NULL","NULL","NULL","F","NULL","NULL","NULL","NULL","NULL","F","NULL","NULL","NULL","NULL","NULL","F","NULL","NULL","NULL","NULL","NULL","F","NULL","NULL","NULL",44952.607310150466,45213.112933564815]
[14230,"Yes","Prescriptive","WASHGASFL","MF Clothes Washer, In-Unit, Gas DHW","Clothes washer","Appliance","BOTH","N/A",774,152,5,4018,"OR","NBE","New Buildings","2022-01-01","2024-12-31","Units",0,1,54.29,5.53,25.74,0,"Res Clotheswasher","Clotheswasher",0,60,0,14,0,64.900000000000006,0,0,0,1,1,0,47,53,53,47,47,47,"NULL","NULL","NULL","NULL","NULL","NULL","NULL",47,47,"Clothes Washer","MANUFACTURER","Manufacturer Name","T","ALPHANUMERIC",40,"ED","MODEL","Model","T","ALPHANUMERIC",20,"ED","IMEF","Integrated Modified Energy Factor (IMEF)","T","ALPHANUMERIC",10,"ED","VOLUME","Volume (cubic feet)","F","DECIMAL",10,"ED","WATERFACTOR","Water Factor","F","ALPHANUMERIC",10,"ED","NULL","NULL","F","NULL","NULL","NULL","NULL","NULL","F","NULL","NULL","NULL","NULL","NULL","F","NULL","NULL","NULL","NULL","NULL","F","NULL","NULL","NULL","NULL","NULL","F","NULL","NULL","NULL","NULL","NULL","F","NULL","NULL","NULL","NULL","NULL","F","NULL","NULL","NULL","NULL","NULL","F","NULL","NULL","NULL","NULL","NULL","F","NULL","NULL","NULL","NULL","NULL","F","NULL","NULL","NULL","NULL","NULL","F","NULL","NULL","NULL","NULL","NULL","F","NULL","NULL","NULL",44952.607310150466,45213.112933564815]
[18040,"Yes","Prescriptive","FRIGRCHVRT015GEOT","Vertical Reach-in Refrigerator, <15, Gas Heat, EOT","Refrigerator","Appliance","ELE","N/A",949,186,2,5867,"OR","NBE","New Buildings","2024-01-01","2026-12-31","Units",0,0,87.71,0,-1.1399999999999999,0,"Grocery Refrigeration","None - gas",0,20,0,10,0,22.32,0,0,0,1,1,0,"NULL",100,100,"NULL","NULL","NULL","NULL","NULL","NULL","NULL","NULL","NULL","NULL","NULL","NULL","Refrigerator","MANUFACTURER","Manufacturer Name","T","Alphanumeric",64,"ED","MODEL","Model","T","Alphanumeric",64,"ED","NULL","NULL","F","NULL","NULL","NULL","NULL","NULL","F","NULL","NULL","NULL","NULL","NULL","F","NULL","NULL","NULL","NULL","NULL","F","NULL","NULL","NULL","NULL","NULL","F","NULL","NULL","NULL","NULL","NULL","F","NULL","NULL","NULL","NULL","NULL","F","NULL","NULL","NULL","NULL","NULL","F","NULL","NULL","NULL","NULL","NULL","F","NULL","NULL","NULL","NULL","NULL","F","NULL","NULL","NULL","NULL","NULL","F","NULL","NULL","NULL","NULL","NULL","F","NULL","NULL","NULL","NULL","NULL","F","NULL","NULL","NULL","NULL","NULL","F","NULL","NULL","NULL","NULL","NULL","F","NULL","NULL","NULL",45266.124619872688,45266.124619872688]
[18041,"Yes","Prescriptive","FRIGRCHVRT015HP","Vertical Reach-in Refrigerator, <15, Heat Pump","Refrigerator","Appliance","ELE","N/A",949,186,2,5857,"OR","NBE","New Buildings","2024-01-01","2026-12-31","Units",0,0,77.47,0,0,0,"Grocery Refrigeration","None - gas",0,20,0,10,0,22.32,0,0,0,1,1,0,"NULL",100,100,"NULL","NULL","NULL","NULL","NULL","NULL","NULL","NULL","NULL","NULL","NULL","NULL","Refrigerator","MANUFACTURER","Manufacturer Name","T","Alphanumeric",64,"ED","MODEL","Model","T","Alphanumeric",64,"ED","NULL","NULL","F","NULL","NULL","NULL","NULL","NULL","F","NULL","NULL","NULL","NULL","NULL","F","NULL","NULL","NULL","NULL","NULL","F","NULL","NULL","NULL","NULL","NULL","F","NULL","NULL","NULL","NULL","NULL","F","NULL","NULL","NULL","NULL","NULL","F","NULL","NULL","NULL","NULL","NULL","F","NULL","NULL","NULL","NULL","NULL","F","NULL","NULL","NULL","NULL","NULL","F","NULL","NULL","NULL","NULL","NULL","F","NULL","NULL","NULL","NULL","NULL","F","NULL","NULL","NULL","NULL","NULL","F","NULL","NULL","NULL","NULL","NULL","F","NULL","NULL","NULL","NULL","NULL","F","NULL","NULL","NULL",45266.124619872688,45266.124619872688]
[18065,"Yes","Prescriptive","FRIGRCHVRT015GAS","Vertical Reach-in Refrigerator, <15, Gas Heat","Refrigerator","Appliance","BOTH","N/A",949,186,2,5862,"OR","NBE","New Buildings","2024-01-01","2026-12-31","Units",0,0,87.71,-0.96,0,0,"Grocery Refrigeration","Flat - gas",0,20,0,10,0,22.32,0,-0.96,0,1,1,0,"NULL",100,100,"NULL","NULL","NULL","NULL","NULL","NULL","NULL","NULL","NULL","NULL","NULL","NULL","Refrigerator","MANUFACTURER","Manufacturer Name","T","Alphanumeric",64,"ED","MODEL","Model","T","Alphanumeric",64,"ED","NULL","NULL","F","NULL","NULL","NULL","NULL","NULL","F","NULL","NULL","NULL","NULL","NULL","F","NULL","NULL","NULL","NULL","NULL","F","NULL","NULL","NULL","NULL","NULL","F","NULL","NULL","NULL","NULL","NULL","F","NULL","NULL","NULL","NULL","NULL","F","NULL","NULL","NULL","NULL","NULL","F","NULL","NULL","NULL","NULL","NULL","F","NULL","NULL","NULL","NULL","NULL","F","NULL","NULL","NULL","NULL","NULL","F","NULL","NULL","NULL","NULL","NULL","F","NULL","NULL","NULL","NULL","NULL","F","NULL","NULL","NULL","NULL","NULL","F","NULL","NULL","NULL","NULL","NULL","F","NULL","NULL","NULL",45266.124619872688,45266.124619872688]
[18066,"Yes","Prescriptive","FRIGRCHVRT015ELE","Vertical Reach-in Refrigerator, <15, Electric ","Refrigerator","Appliance","ELE","N/A",949,186,2,5852,"OR","NBE","New Buildings","2024-01-01","2026-12-31","Units",0,0,66.22,0,0,0,"Grocery Refrigeration","None - gas",0,20,0,10,0,22.32,0,0,0,1,1,0,"NULL",100,100,"NULL","NULL","NULL","NULL","NULL","NULL","NULL","NULL","NULL","NULL","NULL","NULL","Refrigerator","MANUFACTURER","Manufacturer Name","T","Alphanumeric",64,"ED","MODEL","Model","T","Alphanumeric",64,"ED","NULL","NULL","F","NULL","NULL","NULL","NULL","NULL","F","NULL","NULL","NULL","NULL","NULL","F","NULL","NULL","NULL","NULL","NULL","F","NULL","NULL","NULL","NULL","NULL","F","NULL","NULL","NULL","NULL","NULL","F","NULL","NULL","NULL","NULL","NULL","F","NULL","NULL","NULL","NULL","NULL","F","NULL","NULL","NULL","NULL","NULL","F","NULL","NULL","NULL","NULL","NULL","F","NULL","NULL","NULL","NULL","NULL","F","NULL","NULL","NULL","NULL","NULL","F","NULL","NULL","NULL","NULL","NULL","F","NULL","NULL","NULL","NULL","NULL","F","NULL","NULL","NULL","NULL","NULL","F","NULL","NULL","NULL",45266.124619872688,45266.124619872688]
[18067,"Yes","Prescriptive","FREZRCHVRT1530HP","Vertical Reach-in Freezer, 15 to <30, Heat Pump","Freezer","Appliance","ELE","N/A",949,186,2,5859,"OR","NBE","New Buildings","2024-01-01","2026-12-31","Units",0,0,308.83,0,0,0,"Grocery Refrigeration","None - gas",0,80,0,10,0,84.03,0,0,0,1,1,0,"NULL",100,100,"NULL","NULL","NULL","NULL","NULL","NULL","NULL","NULL","NULL","NULL","NULL","NULL","Refrigerator","MANUFACTURER","Manufacturer Name","T","Alphanumeric",64,"ED","MODEL","Model","T","Alphanumeric",64,"ED","NULL","NULL","F","NULL","NULL","NULL","NULL","NULL","F","NULL","NULL","NULL","NULL","NULL","F","NULL","NULL","NULL","NULL","NULL","F","NULL","NULL","NULL","NULL","NULL","F","NULL","NULL","NULL","NULL","NULL","F","NULL","NULL","NULL","NULL","NULL","F","NULL","NULL","NULL","NULL","NULL","F","NULL","NULL","NULL","NULL","NULL","F","NULL","NULL","NULL","NULL","NULL","F","NULL","NULL","NULL","NULL","NULL","F","NULL","NULL","NULL","NULL","NULL","F","NULL","NULL","NULL","NULL","NULL","F","NULL","NULL","NULL","NULL","NULL","F","NULL","NULL","NULL","NULL","NULL","F","NULL","NULL","NULL",45266.124619872688,45266.124619872688]
[18068,"Yes","Prescriptive","FREZRCHVRT1530GAS","Vertical Reach-in Freezer, 15 to <30, Gas Heat","Freezer","Appliance","BOTH","N/A",949,186,2,5864,"OR","NBE","New Buildings","2024-01-01","2026-12-31","Units",0,0,349.62,-3.85,0,0,"Grocery Refrigeration","Flat - gas",0,80,0,10,0,84.03,0,-3.85,0,1,1,0,"NULL",100,100,"NULL","NULL","NULL","NULL","NULL","NULL","NULL","NULL","NULL","NULL","NULL","NULL","Refrigerator","MANUFACTURER","Manufacturer Name","T","Alphanumeric",64,"ED","MODEL","Model","T","Alphanumeric",64,"ED","NULL","NULL","F","NULL","NULL","NULL","NULL","NULL","F","NULL","NULL","NULL","NULL","NULL","F","NULL","NULL","NULL","NULL","NULL","F","NULL","NULL","NULL","NULL","NULL","F","NULL","NULL","NULL","NULL","NULL","F","NULL","NULL","NULL","NULL","NULL","F","NULL","NULL","NULL","NULL","NULL","F","NULL","NULL","NULL","NULL","NULL","F","NULL","NULL","NULL","NULL","NULL","F","NULL","NULL","NULL","NULL","NULL","F","NULL","NULL","NULL","NULL","NULL","F","NULL","NULL","NULL","NULL","NULL","F","NULL","NULL","NULL","NULL","NULL","F","NULL","NULL","NULL","NULL","NULL","F","NULL","NULL","NULL",45266.124619872688,45266.124619872688]
[18069,"Yes","Prescriptive","FREZRCHVRT1530GEOT","Vertical Reach-in Freezer, 15 to <30, Gas Heat, EOT","Freezer","Appliance","ELE","N/A",949,186,2,5869,"OR","NBE","New Buildings","2024-01-01","2026-12-31","Units",0,0,349.62,0,-4.54,0,"Grocery Refrigeration","None - gas",0,80,0,10,0,84.03,0,0,0,1,1,0,"NULL",100,100,"NULL","NULL","NULL","NULL","NULL","NULL","NULL","NULL","NULL","NULL","NULL","NULL","Refrigerator","MANUFACTURER","Manufacturer Name","T","Alphanumeric",64,"ED","MODEL","Model","T","Alphanumeric",64,"ED","NULL","NULL","F","NULL","NULL","NULL","NULL","NULL","F","NULL","NULL","NULL","NULL","NULL","F","NULL","NULL","NULL","NULL","NULL","F","NULL","NULL","NULL","NULL","NULL","F","NULL","NULL","NULL","NULL","NULL","F","NULL","NULL","NULL","NULL","NULL","F","NULL","NULL","NULL","NULL","NULL","F","NULL","NULL","NULL","NULL","NULL","F","NULL","NULL","NULL","NULL","NULL","F","NULL","NULL","NULL","NULL","NULL","F","NULL","NULL","NULL","NULL","NULL","F","NULL","NULL","NULL","NULL","NULL","F","NULL","NULL","NULL","NULL","NULL","F","NULL","NULL","NULL","NULL","NULL","F","NULL","NULL","NULL",45266.124619872688,45266.124619872688]
[18078,"Yes","Prescriptive","FREZRCHVRT1530ELE","Vertical Reach-in Freezer, 15 to <30, Electric ","Freezer","Appliance","ELE","N/A",949,186,2,5854,"OR","NBE","New Buildings","2024-01-01","2026-12-31","Units",0,0,263.95,0,0,0,"Grocery Refrigeration","None - gas",0,80,0,10,0,84.03,0,0,0,1,1,0,"NULL",100,100,"NULL","NULL","NULL","NULL","NULL","NULL","NULL","NULL","NULL","NULL","NULL","NULL","Refrigerator","MANUFACTURER","Manufacturer Name","T","Alphanumeric",64,"ED","MODEL","Model","T","Alphanumeric",64,"ED","NULL","NULL","F","NULL","NULL","NULL","NULL","NULL","F","NULL","NULL","NULL","NULL","NULL","F","NULL","NULL","NULL","NULL","NULL","F","NULL","NULL","NULL","NULL","NULL","F","NULL","NULL","NULL","NULL","NULL","F","NULL","NULL","NULL","NULL","NULL","F","NULL","NULL","NULL","NULL","NULL","F","NULL","NULL","NULL","NULL","NULL","F","NULL","NULL","NULL","NULL","NULL","F","NULL","NULL","NULL","NULL","NULL","F","NULL","NULL","NULL","NULL","NULL","F","NULL","NULL","NULL","NULL","NULL","F","NULL","NULL","NULL","NULL","NULL","F","NULL","NULL","NULL","NULL","NULL","F","NULL","NULL","NULL",45266.124619872688,45266.124619872688]
[18079,"Yes","Prescriptive","FREZRCHVRT50HP","Vertical Reach-in Freezer, >50, Heat Pump","Freezer","Appliance","ELE","N/A",949,186,2,5861,"OR","NBE","New Buildings","2024-01-01","2026-12-31","Units",0,0,818.34,0,0,0,"Grocery Refrigeration","None - gas",0,325,0,10,0,344.01,0,0,0,1,1,0,"NULL",100,100,"NULL","NULL","NULL","NULL","NULL","NULL","NULL","NULL","NULL","NULL","NULL","NULL","Refrigerator","MANUFACTURER","Manufacturer Name","T","Alphanumeric",64,"ED","MODEL","Model","T","Alphanumeric",64,"ED","NULL","NULL","F","NULL","NULL","NULL","NULL","NULL","F","NULL","NULL","NULL","NULL","NULL","F","NULL","NULL","NULL","NULL","NULL","F","NULL","NULL","NULL","NULL","NULL","F","NULL","NULL","NULL","NULL","NULL","F","NULL","NULL","NULL","NULL","NULL","F","NULL","NULL","NULL","NULL","NULL","F","NULL","NULL","NULL","NULL","NULL","F","NULL","NULL","NULL","NULL","NULL","F","NULL","NULL","NULL","NULL","NULL","F","NULL","NULL","NULL","NULL","NULL","F","NULL","NULL","NULL","NULL","NULL","F","NULL","NULL","NULL","NULL","NULL","F","NULL","NULL","NULL","NULL","NULL","F","NULL","NULL","NULL",45266.124619872688,45266.124619872688]
[18080,"Yes","Prescriptive","FREZRCHVRT50GAS","Vertical Reach-in Freezer, >50, Gas Heat","Freezer","Appliance","BOTH","N/A",949,186,2,5866,"OR","NBE","New Buildings","2024-01-01","2026-12-31","Units",0,0,926.44,-10.19,0,0,"Grocery Refrigeration","Flat - gas",0,325,0,10,0,344.01,0,-10.19,0,1,1,0,"NULL",100,100,"NULL","NULL","NULL","NULL","NULL","NULL","NULL","NULL","NULL","NULL","NULL","NULL","Refrigerator","MANUFACTURER","Manufacturer Name","T","Alphanumeric",64,"ED","MODEL","Model","T","Alphanumeric",64,"ED","NULL","NULL","F","NULL","NULL","NULL","NULL","NULL","F","NULL","NULL","NULL","NULL","NULL","F","NULL","NULL","NULL","NULL","NULL","F","NULL","NULL","NULL","NULL","NULL","F","NULL","NULL","NULL","NULL","NULL","F","NULL","NULL","NULL","NULL","NULL","F","NULL","NULL","NULL","NULL","NULL","F","NULL","NULL","NULL","NULL","NULL","F","NULL","NULL","NULL","NULL","NULL","F","NULL","NULL","NULL","NULL","NULL","F","NULL","NULL","NULL","NULL","NULL","F","NULL","NULL","NULL","NULL","NULL","F","NULL","NULL","NULL","NULL","NULL","F","NULL","NULL","NULL","NULL","NULL","F","NULL","NULL","NULL",45266.124619872688,45266.124619872688]
[18081,"Yes","Prescriptive","FREZRCHVRT50ELE","Vertical Reach-in Freezer, >50, Electric ","Freezer","Appliance","ELE","N/A",949,186,2,5856,"OR","NBE","New Buildings","2024-01-01","2026-12-31","Units",0,0,699.43,0,0,0,"Grocery Refrigeration","None - gas",0,325,0,10,0,344.01,0,0,0,1,1,0,"NULL",100,100,"NULL","NULL","NULL","NULL","NULL","NULL","NULL","NULL","NULL","NULL","NULL","NULL","Refrigerator","MANUFACTURER","Manufacturer Name","T","Alphanumeric",64,"ED","MODEL","Model","T","Alphanumeric",64,"ED","NULL","NULL","F","NULL","NULL","NULL","NULL","NULL","F","NULL","NULL","NULL","NULL","NULL","F","NULL","NULL","NULL","NULL","NULL","F","NULL","NULL","NULL","NULL","NULL","F","NULL","NULL","NULL","NULL","NULL","F","NULL","NULL","NULL","NULL","NULL","F","NULL","NULL","NULL","NULL","NULL","F","NULL","NULL","NULL","NULL","NULL","F","NULL","NULL","NULL","NULL","NULL","F","NULL","NULL","NULL","NULL","NULL","F","NULL","NULL","NULL","NULL","NULL","F","NULL","NULL","NULL","NULL","NULL","F","NULL","NULL","NULL","NULL","NULL","F","NULL","NULL","NULL","NULL","NULL","F","NULL","NULL","NULL",45266.124619872688,45266.124619872688]
[18091,"Yes","Prescriptive","FREZRCHVRT50GEOT","Vertical Reach-in Freezer, >50, Gas Heat, EOT","Freezer","Appliance","ELE","N/A",949,186,2,5871,"OR","NBE","New Buildings","2024-01-01","2026-12-31","Units",0,0,926.44,0,-12.02,0,"Grocery Refrigeration","None - gas",0,325,0,10,0,344.01,0,0,0,1,1,0,"NULL",100,100,"NULL","NULL","NULL","NULL","NULL","NULL","NULL","NULL","NULL","NULL","NULL","NULL","Refrigerator","MANUFACTURER","Manufacturer Name","T","Alphanumeric",64,"ED","MODEL","Model","T","Alphanumeric",64,"ED","NULL","NULL","F","NULL","NULL","NULL","NULL","NULL","F","NULL","NULL","NULL","NULL","NULL","F","NULL","NULL","NULL","NULL","NULL","F","NULL","NULL","NULL","NULL","NULL","F","NULL","NULL","NULL","NULL","NULL","F","NULL","NULL","NULL","NULL","NULL","F","NULL","NULL","NULL","NULL","NULL","F","NULL","NULL","NULL","NULL","NULL","F","NULL","NULL","NULL","NULL","NULL","F","NULL","NULL","NULL","NULL","NULL","F","NULL","NULL","NULL","NULL","NULL","F","NULL","NULL","NULL","NULL","NULL","F","NULL","NULL","NULL","NULL","NULL","F","NULL","NULL","NULL","NULL","NULL","F","NULL","NULL","NULL",45266.124619872688,45266.124619872688]
[18092,"Yes","Prescriptive","FREZRCHVRT3050HP","Vertical Reach-in Freezer, 30 to <50, Heat Pump","Freezer","Appliance","ELE","N/A",949,186,2,5860,"OR","NBE","New Buildings","2024-01-01","2026-12-31","Units",0,0,513.74,0,0,0,"Grocery Refrigeration","None - gas",0,190,0,10,0,196.36,0,0,0,1,1,0,"NULL",100,100,"NULL","NULL","NULL","NULL","NULL","NULL","NULL","NULL","NULL","NULL","NULL","NULL","Refrigerator","MANUFACTURER","Manufacturer Name","T","Alphanumeric",64,"ED","MODEL","Model","T","Alphanumeric",64,"ED","NULL","NULL","F","NULL","NULL","NULL","NULL","NULL","F","NULL","NULL","NULL","NULL","NULL","F","NULL","NULL","NULL","NULL","NULL","F","NULL","NULL","NULL","NULL","NULL","F","NULL","NULL","NULL","NULL","NULL","F","NULL","NULL","NULL","NULL","NULL","F","NULL","NULL","NULL","NULL","NULL","F","NULL","NULL","NULL","NULL","NULL","F","NULL","NULL","NULL","NULL","NULL","F","NULL","NULL","NULL","NULL","NULL","F","NULL","NULL","NULL","NULL","NULL","F","NULL","NULL","NULL","NULL","NULL","F","NULL","NULL","NULL","NULL","NULL","F","NULL","NULL","NULL","NULL","NULL","F","NULL","NULL","NULL",45266.124619872688,45266.124619872688]
[18093,"Yes","Prescriptive","FREZRCHVRT3050GEOT","Vertical Reach-in Freezer, 30 to <50, Gas Heat, EOT","Freezer","Appliance","ELE","N/A",949,186,2,5870,"OR","NBE","New Buildings","2024-01-01","2026-12-31","Units",0,0,581.6,0,-7.55,0,"Grocery Refrigeration","None - gas",0,190,0,10,0,196.36,0,0,0,1,1,0,"NULL",100,100,"NULL","NULL","NULL","NULL","NULL","NULL","NULL","NULL","NULL","NULL","NULL","NULL","Refrigerator","MANUFACTURER","Manufacturer Name","T","Alphanumeric",64,"ED","MODEL","Model","T","Alphanumeric",64,"ED","NULL","NULL","F","NULL","NULL","NULL","NULL","NULL","F","NULL","NULL","NULL","NULL","NULL","F","NULL","NULL","NULL","NULL","NULL","F","NULL","NULL","NULL","NULL","NULL","F","NULL","NULL","NULL","NULL","NULL","F","NULL","NULL","NULL","NULL","NULL","F","NULL","NULL","NULL","NULL","NULL","F","NULL","NULL","NULL","NULL","NULL","F","NULL","NULL","NULL","NULL","NULL","F","NULL","NULL","NULL","NULL","NULL","F","NULL","NULL","NULL","NULL","NULL","F","NULL","NULL","NULL","NULL","NULL","F","NULL","NULL","NULL","NULL","NULL","F","NULL","NULL","NULL","NULL","NULL","F","NULL","NULL","NULL",45266.124619872688,45266.124619872688]
[18094,"Yes","Prescriptive","FREZRCHVRT3050GAS","Vertical Reach-in Freezer, 30 to <50, Gas Heat","Freezer","Appliance","BOTH","N/A",949,186,2,5865,"OR","NBE","New Buildings","2024-01-01","2026-12-31","Units",0,0,581.6,-6.4,0,0,"Grocery Refrigeration","Flat - gas",0,190,0,10,0,196.36,0,-6.4,0,1,1,0,"NULL",100,100,"NULL","NULL","NULL","NULL","NULL","NULL","NULL","NULL","NULL","NULL","NULL","NULL","Refrigerator","MANUFACTURER","Manufacturer Name","T","Alphanumeric",64,"ED","MODEL","Model","T","Alphanumeric",64,"ED","NULL","NULL","F","NULL","NULL","NULL","NULL","NULL","F","NULL","NULL","NULL","NULL","NULL","F","NULL","NULL","NULL","NULL","NULL","F","NULL","NULL","NULL","NULL","NULL","F","NULL","NULL","NULL","NULL","NULL","F","NULL","NULL","NULL","NULL","NULL","F","NULL","NULL","NULL","NULL","NULL","F","NULL","NULL","NULL","NULL","NULL","F","NULL","NULL","NULL","NULL","NULL","F","NULL","NULL","NULL","NULL","NULL","F","NULL","NULL","NULL","NULL","NULL","F","NULL","NULL","NULL","NULL","NULL","F","NULL","NULL","NULL","NULL","NULL","F","NULL","NULL","NULL","NULL","NULL","F","NULL","NULL","NULL",45266.124619872688,45266.124619872688]
[18095,"Yes","Prescriptive","FREZRCHVRT3050ELE","Vertical Reach-in Freezer, 30 to <50, Electric ","Freezer","Appliance","ELE","N/A",949,186,2,5855,"OR","NBE","New Buildings","2024-01-01","2026-12-31","Units",0,0,439.09,0,0,0,"Grocery Refrigeration","None - gas",0,190,0,10,0,196.36,0,0,0,1,1,0,"NULL",100,100,"NULL","NULL","NULL","NULL","NULL","NULL","NULL","NULL","NULL","NULL","NULL","NULL","Refrigerator","MANUFACTURER","Manufacturer Name","T","Alphanumeric",64,"ED","MODEL","Model","T","Alphanumeric",64,"ED","NULL","NULL","F","NULL","NULL","NULL","NULL","NULL","F","NULL","NULL","NULL","NULL","NULL","F","NULL","NULL","NULL","NULL","NULL","F","NULL","NULL","NULL","NULL","NULL","F","NULL","NULL","NULL","NULL","NULL","F","NULL","NULL","NULL","NULL","NULL","F","NULL","NULL","NULL","NULL","NULL","F","NULL","NULL","NULL","NULL","NULL","F","NULL","NULL","NULL","NULL","NULL","F","NULL","NULL","NULL","NULL","NULL","F","NULL","NULL","NULL","NULL","NULL","F","NULL","NULL","NULL","NULL","NULL","F","NULL","NULL","NULL","NULL","NULL","F","NULL","NULL","NULL","NULL","NULL","F","NULL","NULL","NULL",45266.124619872688,45266.124619872688]
[18096,"Yes","Prescriptive","FREZRCHVRT015HP","Vertical Reach-in Freezer, <15, Heat Pump","Freezer","Appliance","ELE","N/A",949,186,2,5858,"OR","NBE","New Buildings","2024-01-01","2026-12-31","Units",0,0,167.65,0,0,0,"Grocery Refrigeration","None - gas",0,40,0,10,0,40.049999999999997,0,0,0,1,1,0,"NULL",100,100,"NULL","NULL","NULL","NULL","NULL","NULL","NULL","NULL","NULL","NULL","NULL","NULL","Refrigerator","MANUFACTURER","Manufacturer Name","T","Alphanumeric",64,"ED","MODEL","Model","T","Alphanumeric",64,"ED","NULL","NULL","F","NULL","NULL","NULL","NULL","NULL","F","NULL","NULL","NULL","NULL","NULL","F","NULL","NULL","NULL","NULL","NULL","F","NULL","NULL","NULL","NULL","NULL","F","NULL","NULL","NULL","NULL","NULL","F","NULL","NULL","NULL","NULL","NULL","F","NULL","NULL","NULL","NULL","NULL","F","NULL","NULL","NULL","NULL","NULL","F","NULL","NULL","NULL","NULL","NULL","F","NULL","NULL","NULL","NULL","NULL","F","NULL","NULL","NULL","NULL","NULL","F","NULL","NULL","NULL","NULL","NULL","F","NULL","NULL","NULL","NULL","NULL","F","NULL","NULL","NULL","NULL","NULL","F","NULL","NULL","NULL",45266.124619872688,45266.124619872688]
[18097,"Yes","Prescriptive","FREZRCHVRT015GEOT","Vertical Reach-in Freezer, <15, Gas Heat, EOT","Freezer","Appliance","ELE","N/A",949,186,2,5868,"OR","NBE","New Buildings","2024-01-01","2026-12-31","Units",0,0,189.79,0,-2.46,0,"Grocery Refrigeration","None - gas",0,40,0,10,0,40.049999999999997,0,0,0,1,1,0,"NULL",100,100,"NULL","NULL","NULL","NULL","NULL","NULL","NULL","NULL","NULL","NULL","NULL","NULL","Refrigerator","MANUFACTURER","Manufacturer Name","T","Alphanumeric",64,"ED","MODEL","Model","T","Alphanumeric",64,"ED","NULL","NULL","F","NULL","NULL","NULL","NULL","NULL","F","NULL","NULL","NULL","NULL","NULL","F","NULL","NULL","NULL","NULL","NULL","F","NULL","NULL","NULL","NULL","NULL","F","NULL","NULL","NULL","NULL","NULL","F","NULL","NULL","NULL","NULL","NULL","F","NULL","NULL","NULL","NULL","NULL","F","NULL","NULL","NULL","NULL","NULL","F","NULL","NULL","NULL","NULL","NULL","F","NULL","NULL","NULL","NULL","NULL","F","NULL","NULL","NULL","NULL","NULL","F","NULL","NULL","NULL","NULL","NULL","F","NULL","NULL","NULL","NULL","NULL","F","NULL","NULL","NULL","NULL","NULL","F","NULL","NULL","NULL",45266.124619872688,45266.124619872688]
[18098,"Yes","Prescriptive","FREZRCHVRT015GAS","Vertical Reach-in Freezer, <15, Gas Heat","Freezer","Appliance","BOTH","N/A",949,186,2,5863,"OR","NBE","New Buildings","2024-01-01","2026-12-31","Units",0,0,189.79,-2.09,0,0,"Grocery Refrigeration","Flat - gas",0,40,0,10,0,40.049999999999997,0,-2.09,0,1,1,0,"NULL",100,100,"NULL","NULL","NULL","NULL","NULL","NULL","NULL","NULL","NULL","NULL","NULL","NULL","Refrigerator","MANUFACTURER","Manufacturer Name","T","Alphanumeric",64,"ED","MODEL","Model","T","Alphanumeric",64,"ED","NULL","NULL","F","NULL","NULL","NULL","NULL","NULL","F","NULL","NULL","NULL","NULL","NULL","F","NULL","NULL","NULL","NULL","NULL","F","NULL","NULL","NULL","NULL","NULL","F","NULL","NULL","NULL","NULL","NULL","F","NULL","NULL","NULL","NULL","NULL","F","NULL","NULL","NULL","NULL","NULL","F","NULL","NULL","NULL","NULL","NULL","F","NULL","NULL","NULL","NULL","NULL","F","NULL","NULL","NULL","NULL","NULL","F","NULL","NULL","NULL","NULL","NULL","F","NULL","NULL","NULL","NULL","NULL","F","NULL","NULL","NULL","NULL","NULL","F","NULL","NULL","NULL","NULL","NULL","F","NULL","NULL","NULL",45266.124619872688,45266.124619872688]
[18099,"Yes","Prescriptive","FREZRCHVRT015ELE","Vertical Reach-in Freezer, <15, Electric ","Freezer","Appliance","ELE","N/A",949,186,2,5853,"OR","NBE","New Buildings","2024-01-01","2026-12-31","Units",0,0,143.29,0,0,0,"Grocery Refrigeration","None - gas",0,40,0,10,0,40.049999999999997,0,0,0,1,1,0,"NULL",100,100,"NULL","NULL","NULL","NULL","NULL","NULL","NULL","NULL","NULL","NULL","NULL","NULL","Refrigerator","MANUFACTURER","Manufacturer Name","T","Alphanumeric",64,"ED","MODEL","Model","T","Alphanumeric",64,"ED","NULL","NULL","F","NULL","NULL","NULL","NULL","NULL","F","NULL","NULL","NULL","NULL","NULL","F","NULL","NULL","NULL","NULL","NULL","F","NULL","NULL","NULL","NULL","NULL","F","NULL","NULL","NULL","NULL","NULL","F","NULL","NULL","NULL","NULL","NULL","F","NULL","NULL","NULL","NULL","NULL","F","NULL","NULL","NULL","NULL","NULL","F","NULL","NULL","NULL","NULL","NULL","F","NULL","NULL","NULL","NULL","NULL","F","NULL","NULL","NULL","NULL","NULL","F","NULL","NULL","NULL","NULL","NULL","F","NULL","NULL","NULL","NULL","NULL","F","NULL","NULL","NULL","NULL","NULL","F","NULL","NULL","NULL",45266.124619872688,45266.124619872688]
[18153,"Yes","Prescriptive","DHPMFNOBASE","Ductless heat pump, Multifamily, w/o Baseboard Heating","Ductless heat pump","HVAC","ELE","HEAT",915,192,5,5631,"OR","NBE","New Buildings","2024-01-01","2026-12-31","Tons",0,0,574.5,0,0,0,"Res Air Source HP","None - gas",0,500,0,15,0,548.03,0,0,0,1,1,0,"NULL",100,100,"NULL","NULL","NULL","NULL","NULL","NULL","NULL","NULL","NULL","NULL","NULL","NULL","Ductless heat pump","HSPF","HSPF","F","Alphanumeric",64,"ED","OUTMANUFACTURER","Outdoor Unit Manufacturer Name","F","Alphanumeric",64,"ED","OUTDOORMODEL","Outdoor Model","F","Alphanumeric",64,"ED","HSPF2","HSPF 2","F","Alphanumeric",20,"ED","SEER","SEER","F","Decimal",20,"ED","SUPPLEMENTALHEAT","Supplemental Heating Equipment","F","Alphanumeric",64,"CB","SEER2","SEER 2","F","Alphanumeric",20,"ED","NULL","NULL","F","NULL","NULL","NULL","NULL","NULL","F","NULL","NULL","NULL","NULL","NULL","F","NULL","NULL","NULL","NULL","NULL","F","NULL","NULL","NULL","NULL","NULL","F","NULL","NULL","NULL","NULL","NULL","F","NULL","NULL","NULL","NULL","NULL","F","NULL","NULL","NULL","NULL","NULL","F","NULL","NULL","NULL","NULL","NULL","F","NULL","NULL","NULL","NULL","NULL","F","NULL","NULL","NULL",45266.124619872688,45266.124619872688]
[18154,"Yes","Prescriptive","DHPLODNOBASE","Ductless heat pump, Lodging, w/o Baseboard Heating","Ductless heat pump","HVAC","ELE","HEAT",915,192,5,5630,"OR","NBE","New Buildings","2024-01-01","2026-12-31","Tons",0,0,699.83,0,0,0,"Lodging Heating","None - gas",0,500,0,15,0,548.03,0,0,0,1,1,0,"NULL",100,100,"NULL","NULL","NULL","NULL","NULL","NULL","NULL","NULL","NULL","NULL","NULL","NULL","Ductless heat pump","HSPF","HSPF","F","Alphanumeric",64,"ED","OUTMANUFACTURER","Outdoor Unit Manufacturer Name","F","Alphanumeric",64,"ED","OUTDOORMODEL","Outdoor Model","F","Alphanumeric",64,"ED","HSPF2","HSPF 2","F","Alphanumeric",20,"ED","SEER","SEER","F","Decimal",20,"ED","SUPPLEMENTALHEAT","Supplemental Heating Equipment","F","Alphanumeric",64,"CB","SEER2","SEER 2","F","Alphanumeric",20,"ED","NULL","NULL","F","NULL","NULL","NULL","NULL","NULL","F","NULL","NULL","NULL","NULL","NULL","F","NULL","NULL","NULL","NULL","NULL","F","NULL","NULL","NULL","NULL","NULL","F","NULL","NULL","NULL","NULL","NULL","F","NULL","NULL","NULL","NULL","NULL","F","NULL","NULL","NULL","NULL","NULL","F","NULL","NULL","NULL","NULL","NULL","F","NULL","NULL","NULL","NULL","NULL","F","NULL","NULL","NULL",45266.124619872688,45266.124619872688]
[18155,"Yes","Prescriptive","DHPDORMNOBASE","Ductless heat pump, Dorm, w/o Baseboard Heating","Ductless heat pump","HVAC","ELE","HEAT",915,192,5,5629,"OR","NBE","New Buildings","2024-01-01","2026-12-31","Tons",0,0,581.76,0,0,0,"Res Air Source HP","None - gas",0,500,0,15,0,548.03,0,0,0,1,1,0,"NULL",100,100,"NULL","NULL","NULL","NULL","NULL","NULL","NULL","NULL","NULL","NULL","NULL","NULL","Ductless heat pump","HSPF","HSPF","F","Alphanumeric",64,"ED","OUTMANUFACTURER","Outdoor Unit Manufacturer Name","F","Alphanumeric",64,"ED","OUTDOORMODEL","Outdoor Model","F","Alphanumeric",64,"ED","HSPF2","HSPF 2","F","Alphanumeric",20,"ED","SEER","SEER","F","Decimal",20,"ED","SUPPLEMENTALHEAT","Supplemental Heating Equipment","F","Alphanumeric",64,"CB","SEER2","SEER 2","F","Alphanumeric",20,"ED","NULL","NULL","F","NULL","NULL","NULL","NULL","NULL","F","NULL","NULL","NULL","NULL","NULL","F","NULL","NULL","NULL","NULL","NULL","F","NULL","NULL","NULL","NULL","NULL","F","NULL","NULL","NULL","NULL","NULL","F","NULL","NULL","NULL","NULL","NULL","F","NULL","NULL","NULL","NULL","NULL","F","NULL","NULL","NULL","NULL","NULL","F","NULL","NULL","NULL","NULL","NULL","F","NULL","NULL","NULL",45266.124619872688,45266.124619872688]
[18156,"Yes","Prescriptive","DHPMFBASE","Ductless heat pump, Multifamily, w/ Baseboard Heating","Ductless heat pump","HVAC","ELE","HEAT",915,192,5,5628,"OR","NBE","New Buildings","2024-01-01","2026-12-31","Tons",0,0,497.88,0,0,0,"Res Air Source HP","None - gas",0,500,0,15,0,548.03,0,0,0,1,1,0,"NULL",100,100,"NULL","NULL","NULL","NULL","NULL","NULL","NULL","NULL","NULL","NULL","NULL","NULL","Ductless heat pump","HSPF","HSPF","F","Alphanumeric",64,"ED","OUTMANUFACTURER","Outdoor Unit Manufacturer Name","F","Alphanumeric",64,"ED","OUTDOORMODEL","Outdoor Model","F","Alphanumeric",64,"ED","HSPF2","HSPF 2","F","Alphanumeric",20,"ED","SEER","SEER","F","Decimal",20,"ED","SUPPLEMENTALHEAT","Supplemental Heating Equipment","F","Alphanumeric",64,"CB","SEER2","SEER 2","F","Alphanumeric",20,"ED","NULL","NULL","F","NULL","NULL","NULL","NULL","NULL","F","NULL","NULL","NULL","NULL","NULL","F","NULL","NULL","NULL","NULL","NULL","F","NULL","NULL","NULL","NULL","NULL","F","NULL","NULL","NULL","NULL","NULL","F","NULL","NULL","NULL","NULL","NULL","F","NULL","NULL","NULL","NULL","NULL","F","NULL","NULL","NULL","NULL","NULL","F","NULL","NULL","NULL","NULL","NULL","F","NULL","NULL","NULL",45266.124619872688,45266.124619872688]
[18157,"Yes","Prescriptive","DHPLODBASE","Ductless heat pump, Lodging, w/ Baseboard Heating","Ductless heat pump","HVAC","ELE","HEAT",915,192,5,5627,"OR","NBE","New Buildings","2024-01-01","2026-12-31","Tons",0,0,601.69000000000005,0,0,0,"Lodging Heating","None - gas",0,500,0,15,0,548.03,0,0,0,1,1,0,"NULL",100,100,"NULL","NULL","NULL","NULL","NULL","NULL","NULL","NULL","NULL","NULL","NULL","NULL","Ductless heat pump","HSPF","HSPF","F","Alphanumeric",64,"ED","OUTMANUFACTURER","Outdoor Unit Manufacturer Name","F","Alphanumeric",64,"ED","OUTDOORMODEL","Outdoor Model","F","Alphanumeric",64,"ED","HSPF2","HSPF 2","F","Alphanumeric",20,"ED","SEER","SEER","F","Decimal",20,"ED","SUPPLEMENTALHEAT","Supplemental Heating Equipment","F","Alphanumeric",64,"CB","SEER2","SEER 2","F","Alphanumeric",20,"ED","NULL","NULL","F","NULL","NULL","NULL","NULL","NULL","F","NULL","NULL","NULL","NULL","NULL","F","NULL","NULL","NULL","NULL","NULL","F","NULL","NULL","NULL","NULL","NULL","F","NULL","NULL","NULL","NULL","NULL","F","NULL","NULL","NULL","NULL","NULL","F","NULL","NULL","NULL","NULL","NULL","F","NULL","NULL","NULL","NULL","NULL","F","NULL","NULL","NULL","NULL","NULL","F","NULL","NULL","NULL",45266.124619872688,45266.124619872688]
[18158,"Yes","Prescriptive","DHPDORMBASE","Ductless heat pump, Dorm, w/ Baseboard Heating","Ductless heat pump","HVAC","ELE","HEAT",915,192,5,5626,"OR","NBE","New Buildings","2024-01-01","2026-12-31","Tons",0,0,506.82,0,0,0,"Res Air Source HP","None - gas",0,500,0,15,0,548.03,0,0,0,1,1,0,"NULL",100,100,"NULL","NULL","NULL","NULL","NULL","NULL","NULL","NULL","NULL","NULL","NULL","NULL","Ductless heat pump","HSPF","HSPF","F","Alphanumeric",64,"ED","OUTMANUFACTURER","Outdoor Unit Manufacturer Name","F","Alphanumeric",64,"ED","OUTDOORMODEL","Outdoor Model","F","Alphanumeric",64,"ED","HSPF2","HSPF 2","F","Alphanumeric",20,"ED","SEER","SEER","F","Decimal",20,"ED","SUPPLEMENTALHEAT","Supplemental Heating Equipment","F","Alphanumeric",64,"CB","SEER2","SEER 2","F","Alphanumeric",20,"ED","NULL","NULL","F","NULL","NULL","NULL","NULL","NULL","F","NULL","NULL","NULL","NULL","NULL","F","NULL","NULL","NULL","NULL","NULL","F","NULL","NULL","NULL","NULL","NULL","F","NULL","NULL","NULL","NULL","NULL","F","NULL","NULL","NULL","NULL","NULL","F","NULL","NULL","NULL","NULL","NULL","F","NULL","NULL","NULL","NULL","NULL","F","NULL","NULL","NULL","NULL","NULL","F","NULL","NULL","NULL",45266.124619872688,45266.124619872688]
[18127,"Yes","Prescriptive","RTUCTRLVSFHPH","RTU Controls, Variable Supply Fan, Heat Pump Heating","Ventilation","HVAC","ELE","N/A",903,195,3,5596,"OR","NBE","New Buildings","2024-01-01","2024-12-31","Tons",0,0,489.26,0,0,0,"Small Office Ventilation","None - gas",0,100,0,15,0,418.99,0,0,0,1,1,0,"NULL",100,100,"NULL","NULL","NULL","NULL","NULL","NULL","NULL","NULL","NULL","NULL","NULL","NULL","Motors","NULL","NULL","F","NULL","NULL","NULL","NULL","NULL","F","NULL","NULL","NULL","NULL","NULL","F","NULL","NULL","NULL","NULL","NULL","F","NULL","NULL","NULL","NULL","NULL","F","NULL","NULL","NULL","NULL","NULL","F","NULL","NULL","NULL","NULL","NULL","F","NULL","NULL","NULL","NULL","NULL","F","NULL","NULL","NULL","NULL","NULL","F","NULL","NULL","NULL","NULL","NULL","F","NULL","NULL","NULL","NULL","NULL","F","NULL","NULL","NULL","NULL","NULL","F","NULL","NULL","NULL","NULL","NULL","F","NULL","NULL","NULL","NULL","NULL","F","NULL","NULL","NULL","NULL","NULL","F","NULL","NULL","NULL","NULL","NULL","F","NULL","NULL","NULL","NULL","NULL","F","NULL","NULL","NULL",45266.124619872688,45266.124619872688]
[18128,"Yes","Prescriptive","RTUCTRLECOHPH","RTU Controls, Economizer, Heat Pump Heating","Economizer","HVAC","ELE","N/A",903,195,3,5593,"OR","NBE","New Buildings","2024-01-01","2024-12-31","Tons",0,0,174.15,0,0,0,"Small Office Cooling","None - gas",0,30,0,15,0,45.22,0,0,0,1,1,0,"NULL",100,100,"NULL","NULL","NULL","NULL","NULL","NULL","NULL","NULL","NULL","NULL","NULL","NULL","Economizer","CAPACITY","Size/Capacity in Tons","T","Decimal",10,"ED","NULL","NULL","F","NULL","NULL","NULL","NULL","NULL","F","NULL","NULL","NULL","NULL","NULL","F","NULL","NULL","NULL","NULL","NULL","F","NULL","NULL","NULL","NULL","NULL","F","NULL","NULL","NULL","NULL","NULL","F","NULL","NULL","NULL","NULL","NULL","F","NULL","NULL","NULL","NULL","NULL","F","NULL","NULL","NULL","NULL","NULL","F","NULL","NULL","NULL","NULL","NULL","F","NULL","NULL","NULL","NULL","NULL","F","NULL","NULL","NULL","NULL","NULL","F","NULL","NULL","NULL","NULL","NULL","F","NULL","NULL","NULL","NULL","NULL","F","NULL","NULL","NULL","NULL","NULL","F","NULL","NULL","NULL","NULL","NULL","F","NULL","NULL","NULL",45266.124619872688,45266.124619872688]
[18129,"Yes","Prescriptive","RTUCTRLECOGH","RTU Controls, Economizer, Gas Heating","Economizer","HVAC","BOTH","N/A",903,195,3,5592,"OR","NBE","New Buildings","2024-01-01","2024-12-31","Tons",0,0,174.31,-0.03,0,0,"Small Office Cooling","Com Heating",0,30,0,15,0,45.22,0,-0.03,0,1,1,0,"NULL",100,100,"NULL","NULL","NULL","NULL","NULL","NULL","NULL","NULL","NULL","NULL","NULL","NULL","Economizer","CAPACITY","Size/Capacity in Tons","T","Decimal",10,"ED","NULL","NULL","F","NULL","NULL","NULL","NULL","NULL","F","NULL","NULL","NULL","NULL","NULL","F","NULL","NULL","NULL","NULL","NULL","F","NULL","NULL","NULL","NULL","NULL","F","NULL","NULL","NULL","NULL","NULL","F","NULL","NULL","NULL","NULL","NULL","F","NULL","NULL","NULL","NULL","NULL","F","NULL","NULL","NULL","NULL","NULL","F","NULL","NULL","NULL","NULL","NULL","F","NULL","NULL","NULL","NULL","NULL","F","NULL","NULL","NULL","NULL","NULL","F","NULL","NULL","NULL","NULL","NULL","F","NULL","NULL","NULL","NULL","NULL","F","NULL","NULL","NULL","NULL","NULL","F","NULL","NULL","NULL","NULL","NULL","F","NULL","NULL","NULL",45266.124619872688,45266.124619872688]
[18130,"Yes","Prescriptive","RTUCTRLDCVHPH","RTU Controls, DCV, Heat Pump Heating","Demand Control Ventilation","HVAC","ELE","N/A",903,195,3,5595,"OR","NBE","New Buildings","2024-01-01","2024-12-31","Tons",0,0,196.48,0,0,0,"Small Office Heating","None - gas",0,29,0,15,0,38.28,0,0,0,1,1,0,"NULL",100,100,"NULL","NULL","NULL","NULL","NULL","NULL","NULL","NULL","NULL","NULL","NULL","NULL","Demand Control Ventilation","SPACETYPE","Space Types Served","T","Alphanumeric",64,"ED","NULL","NULL","F","NULL","NULL","NULL","NULL","NULL","F","NULL","NULL","NULL","NULL","NULL","F","NULL","NULL","NULL","NULL","NULL","F","NULL","NULL","NULL","NULL","NULL","F","NULL","NULL","NULL","NULL","NULL","F","NULL","NULL","NULL","NULL","NULL","F","NULL","NULL","NULL","NULL","NULL","F","NULL","NULL","NULL","NULL","NULL","F","NULL","NULL","NULL","NULL","NULL","F","NULL","NULL","NULL","NULL","NULL","F","NULL","NULL","NULL","NULL","NULL","F","NULL","NULL","NULL","NULL","NULL","F","NULL","NULL","NULL","NULL","NULL","F","NULL","NULL","NULL","NULL","NULL","F","NULL","NULL","NULL","NULL","NULL","F","NULL","NULL","NULL",45266.124619872688,45266.124619872688]
[18131,"Yes","Prescriptive","RTUCTRLDCVGHGOT","RTU Controls, DCV, Gas Heating (gas only territories)","Demand Control Ventilation","HVAC","GAS","N/A",903,195,3,5597,"OR","NBE","New Buildings","2024-01-01","2024-12-31","Tons",0,0,0,21.46,1.28,0,"None - ele","Com Heating",0,29,0,15,0,38.28,0,0,0,1,1,0,100,"NULL","NULL",100,100,100,100,"NULL","NULL","NULL","NULL","NULL","NULL",100,"NULL","Demand Control Ventilation","SPACETYPE","Space Types Served","T","Alphanumeric",64,"ED","NULL","NULL","F","NULL","NULL","NULL","NULL","NULL","F","NULL","NULL","NULL","NULL","NULL","F","NULL","NULL","NULL","NULL","NULL","F","NULL","NULL","NULL","NULL","NULL","F","NULL","NULL","NULL","NULL","NULL","F","NULL","NULL","NULL","NULL","NULL","F","NULL","NULL","NULL","NULL","NULL","F","NULL","NULL","NULL","NULL","NULL","F","NULL","NULL","NULL","NULL","NULL","F","NULL","NULL","NULL","NULL","NULL","F","NULL","NULL","NULL","NULL","NULL","F","NULL","NULL","NULL","NULL","NULL","F","NULL","NULL","NULL","NULL","NULL","F","NULL","NULL","NULL","NULL","NULL","F","NULL","NULL","NULL","NULL","NULL","F","NULL","NULL","NULL",45266.124619872688,45266.124619872688]
[18132,"Yes","Prescriptive","RTUCTRLDCVGH","RTU Controls, DCV, Gas Heating","Demand Control Ventilation","HVAC","BOTH","N/A",903,195,3,5594,"OR","NBE","New Buildings","2024-01-01","2024-12-31","Tons",0,0,16,21.46,0,0,"Small Office Cooling","Com Heating",0,29,0,15,0,38.28,0,0,0,1,1,0,96,4,4,96,96,96,96,"NULL","NULL","NULL","NULL","NULL","NULL",96,"NULL","Demand Control Ventilation","SPACETYPE","Space Types Served","T","Alphanumeric",64,"ED","NULL","NULL","F","NULL","NULL","NULL","NULL","NULL","F","NULL","NULL","NULL","NULL","NULL","F","NULL","NULL","NULL","NULL","NULL","F","NULL","NULL","NULL","NULL","NULL","F","NULL","NULL","NULL","NULL","NULL","F","NULL","NULL","NULL","NULL","NULL","F","NULL","NULL","NULL","NULL","NULL","F","NULL","NULL","NULL","NULL","NULL","F","NULL","NULL","NULL","NULL","NULL","F","NULL","NULL","NULL","NULL","NULL","F","NULL","NULL","NULL","NULL","NULL","F","NULL","NULL","NULL","NULL","NULL","F","NULL","NULL","NULL","NULL","NULL","F","NULL","NULL","NULL","NULL","NULL","F","NULL","NULL","NULL","NULL","NULL","F","NULL","NULL","NULL",45266.124619872688,45266.124619872688]
[15429,"Yes","Prescriptive","MFTANKLESS199","Multifamily 199 kBth/h Condensing Tankless water heater","Tankless water heater","Water Heating","GAS","DHW",828,196,5,4692,"OR","NBE","New Buildings","2023-01-01","2025-12-31","Units",0,0,0,25.67,0,0,"None - ele","DHW",0,140,0,20,0,140.21,0,0,0,1,1,0,100,"NULL","NULL",100,100,100,100,"NULL","NULL","NULL","NULL","NULL","NULL",100,100,"Tankless water heater","KBTUHINPUT","kBtuh input per unit","T","Decimal",10,"ED","MANUFACTURER","Manufacturer Name","T","Alphanumeric",64,"ED","MODEL","Model","F","ALPHANUMERIC",64,"ED","EXISTTANK","Existing Water Storage Tank?","T","ALPHANUMERIC",10,"CB","UNITS","Number of units","T","INTEGER",20,"ED","UENFACT","Uniform Energy Factor","T","DECIMAL",20,"ED","NULL","NULL","F","NULL","NULL","NULL","NULL","NULL","F","NULL","NULL","NULL","NULL","NULL","F","NULL","NULL","NULL","NULL","NULL","F","NULL","NULL","NULL","NULL","NULL","F","NULL","NULL","NULL","NULL","NULL","F","NULL","NULL","NULL","NULL","NULL","F","NULL","NULL","NULL","NULL","NULL","F","NULL","NULL","NULL","NULL","NULL","F","NULL","NULL","NULL","NULL","NULL","F","NULL","NULL","NULL","NULL","NULL","F","NULL","NULL","NULL",44952.607310150466,45213.112933564815]
[17988,"Yes","Prescriptive","COOLCASEDRRCHZLOWGAS","Cooler w/ Door - Remote Condensing, Horiz Low Temp - Gas","Refrigerator","Appliance","BOTH","N/A",937,201,3,5780,"OR","NBE","New Buildings","2024-01-01","2026-12-31","Linear feet",0,0,500.36,15.91,0,0,"Grocery Refrigeration","Com Heating",0,150,0,10,0,293.82,0,0,0,1,1,0,43,57,57,43,43,43,43,"NULL","NULL","NULL","NULL","NULL","NULL",43,"NULL","No Attributes ","NULL","NULL","F","NULL","NULL","NULL","NULL","NULL","F","NULL","NULL","NULL","NULL","NULL","F","NULL","NULL","NULL","NULL","NULL","F","NULL","NULL","NULL","NULL","NULL","F","NULL","NULL","NULL","NULL","NULL","F","NULL","NULL","NULL","NULL","NULL","F","NULL","NULL","NULL","NULL","NULL","F","NULL","NULL","NULL","NULL","NULL","F","NULL","NULL","NULL","NULL","NULL","F","NULL","NULL","NULL","NULL","NULL","F","NULL","NULL","NULL","NULL","NULL","F","NULL","NULL","NULL","NULL","NULL","F","NULL","NULL","NULL","NULL","NULL","F","NULL","NULL","NULL","NULL","NULL","F","NULL","NULL","NULL","NULL","NULL","F","NULL","NULL","NULL","NULL","NULL","F","NULL","NULL","NULL",45253.110922256943,45253.110922256943]
[17989,"Yes","Prescriptive","COOLCASEDRRCHZMEDGAS","Cooler w/ Door - Remote Condensing, Horiz Med Temp - Gas","Refrigerator","Appliance","BOTH","N/A",937,201,3,5776,"OR","NBE","New Buildings","2024-01-01","2026-12-31","Linear feet",0,0,282.10000000000002,25.68,0,0,"Grocery Refrigeration","Com Heating",0,150,0,10,0,293.82,0,0,0,1,1,0,68,32,32,68,68,68,68,"NULL","NULL","NULL","NULL","NULL","NULL",68,"NULL","No Attributes ","NULL","NULL","F","NULL","NULL","NULL","NULL","NULL","F","NULL","NULL","NULL","NULL","NULL","F","NULL","NULL","NULL","NULL","NULL","F","NULL","NULL","NULL","NULL","NULL","F","NULL","NULL","NULL","NULL","NULL","F","NULL","NULL","NULL","NULL","NULL","F","NULL","NULL","NULL","NULL","NULL","F","NULL","NULL","NULL","NULL","NULL","F","NULL","NULL","NULL","NULL","NULL","F","NULL","NULL","NULL","NULL","NULL","F","NULL","NULL","NULL","NULL","NULL","F","NULL","NULL","NULL","NULL","NULL","F","NULL","NULL","NULL","NULL","NULL","F","NULL","NULL","NULL","NULL","NULL","F","NULL","NULL","NULL","NULL","NULL","F","NULL","NULL","NULL","NULL","NULL","F","NULL","NULL","NULL",45253.110922256943,45253.110922256943]
[17990,"Yes","Prescriptive","COOLCASEDRRCVTMEDGAS","Cooler w/ Door - Remote Condensing, Vert Med Temp - Gas","Refrigerator","Appliance","BOTH","N/A",937,201,3,5775,"OR","NBE","New Buildings","2024-01-01","2026-12-31","Linear feet",0,0,729.34,66.400000000000006,0,0,"Grocery Refrigeration","Com Heating",0,150,0,10,0,293.82,0,0,0,1,1,0,68,32,32,68,68,68,68,"NULL","NULL","NULL","NULL","NULL","NULL",68,"NULL","No Attributes ","NULL","NULL","F","NULL","NULL","NULL","NULL","NULL","F","NULL","NULL","NULL","NULL","NULL","F","NULL","NULL","NULL","NULL","NULL","F","NULL","NULL","NULL","NULL","NULL","F","NULL","NULL","NULL","NULL","NULL","F","NULL","NULL","NULL","NULL","NULL","F","NULL","NULL","NULL","NULL","NULL","F","NULL","NULL","NULL","NULL","NULL","F","NULL","NULL","NULL","NULL","NULL","F","NULL","NULL","NULL","NULL","NULL","F","NULL","NULL","NULL","NULL","NULL","F","NULL","NULL","NULL","NULL","NULL","F","NULL","NULL","NULL","NULL","NULL","F","NULL","NULL","NULL","NULL","NULL","F","NULL","NULL","NULL","NULL","NULL","F","NULL","NULL","NULL","NULL","NULL","F","NULL","NULL","NULL",45253.110922256943,45253.110922256943]
[17991,"Yes","Prescriptive","COOLCASEDRRCHZLOWEOT","Cooler w/ Door - Remote Condensing, Horiz Low Temp - Gas EOT","Refrigerator","Appliance","ELE","N/A",937,201,3,5784,"OR","NBE","New Buildings","2024-01-01","2026-12-31","Linear feet",0,0,500.36,0,18.77,0,"Grocery Refrigeration","Com Heating",0,150,0,10,0,293.82,0,0,0,1,1,0,"NULL",100,100,"NULL","NULL","NULL","NULL","NULL","NULL","NULL","NULL","NULL","NULL","NULL","NULL","No Attributes ","NULL","NULL","F","NULL","NULL","NULL","NULL","NULL","F","NULL","NULL","NULL","NULL","NULL","F","NULL","NULL","NULL","NULL","NULL","F","NULL","NULL","NULL","NULL","NULL","F","NULL","NULL","NULL","NULL","NULL","F","NULL","NULL","NULL","NULL","NULL","F","NULL","NULL","NULL","NULL","NULL","F","NULL","NULL","NULL","NULL","NULL","F","NULL","NULL","NULL","NULL","NULL","F","NULL","NULL","NULL","NULL","NULL","F","NULL","NULL","NULL","NULL","NULL","F","NULL","NULL","NULL","NULL","NULL","F","NULL","NULL","NULL","NULL","NULL","F","NULL","NULL","NULL","NULL","NULL","F","NULL","NULL","NULL","NULL","NULL","F","NULL","NULL","NULL","NULL","NULL","F","NULL","NULL","NULL",45253.110922256943,45253.110922256943]
[17992,"Yes","Prescriptive","COOLCASEDRRCVTMEDEOT","Cooler w/ Door - Remote Condensing, Vert Med Temp - Gas EOT","Refrigerator","Appliance","ELE","N/A",937,201,3,5782,"OR","NBE","New Buildings","2024-01-01","2026-12-31","Linear feet",0,0,729.34,0,78.31,0,"Grocery Refrigeration","Com Heating",0,150,0,10,0,293.82,0,0,0,1,1,0,"NULL",100,100,"NULL","NULL","NULL","NULL","NULL","NULL","NULL","NULL","NULL","NULL","NULL","NULL","No Attributes ","NULL","NULL","F","NULL","NULL","NULL","NULL","NULL","F","NULL","NULL","NULL","NULL","NULL","F","NULL","NULL","NULL","NULL","NULL","F","NULL","NULL","NULL","NULL","NULL","F","NULL","NULL","NULL","NULL","NULL","F","NULL","NULL","NULL","NULL","NULL","F","NULL","NULL","NULL","NULL","NULL","F","NULL","NULL","NULL","NULL","NULL","F","NULL","NULL","NULL","NULL","NULL","F","NULL","NULL","NULL","NULL","NULL","F","NULL","NULL","NULL","NULL","NULL","F","NULL","NULL","NULL","NULL","NULL","F","NULL","NULL","NULL","NULL","NULL","F","NULL","NULL","NULL","NULL","NULL","F","NULL","NULL","NULL","NULL","NULL","F","NULL","NULL","NULL","NULL","NULL","F","NULL","NULL","NULL",45253.110922256943,45279.151787418981]
[17993,"Yes","Prescriptive","COOLCASEDRRCHZMEDEOT","Cooler w/ Door - Remote Condensing, Horiz Med Temp - Gas EOT","Refrigerator","Appliance","ELE","N/A",937,201,3,5783,"OR","NBE","New Buildings","2024-01-01","2026-12-31","Linear feet",0,0,282.10000000000002,0,30.29,0,"Grocery Refrigeration","Com Heating",0,150,0,10,0,293.82,0,0,0,1,1,0,"NULL",100,100,"NULL","NULL","NULL","NULL","NULL","NULL","NULL","NULL","NULL","NULL","NULL","NULL","No Attributes ","NULL","NULL","F","NULL","NULL","NULL","NULL","NULL","F","NULL","NULL","NULL","NULL","NULL","F","NULL","NULL","NULL","NULL","NULL","F","NULL","NULL","NULL","NULL","NULL","F","NULL","NULL","NULL","NULL","NULL","F","NULL","NULL","NULL","NULL","NULL","F","NULL","NULL","NULL","NULL","NULL","F","NULL","NULL","NULL","NULL","NULL","F","NULL","NULL","NULL","NULL","NULL","F","NULL","NULL","NULL","NULL","NULL","F","NULL","NULL","NULL","NULL","NULL","F","NULL","NULL","NULL","NULL","NULL","F","NULL","NULL","NULL","NULL","NULL","F","NULL","NULL","NULL","NULL","NULL","F","NULL","NULL","NULL","NULL","NULL","F","NULL","NULL","NULL","NULL","NULL","F","NULL","NULL","NULL",45253.110922256943,45253.110922256943]
[17994,"Yes","Prescriptive","COOLCASEDRRCHZLOWGOT","Cooler w/ Door - Remote Condensing, Horiz Low Temp - GOT","Refrigerator","Appliance","GAS","HEAT",937,201,3,5781,"OR","NBE","New Buildings","2024-01-01","2026-12-31","Linear feet",0,0,0,15.91,39.880000000000003,0,"Grocery Refrigeration","Com Heating",0,150,0,10,0,293.82,0,0,0,1,1,0,100,"NULL","NULL",100,100,100,100,"NULL","NULL","NULL","NULL","NULL","NULL",100,"NULL","No Attributes ","NULL","NULL","F","NULL","NULL","NULL","NULL","NULL","F","NULL","NULL","NULL","NULL","NULL","F","NULL","NULL","NULL","NULL","NULL","F","NULL","NULL","NULL","NULL","NULL","F","NULL","NULL","NULL","NULL","NULL","F","NULL","NULL","NULL","NULL","NULL","F","NULL","NULL","NULL","NULL","NULL","F","NULL","NULL","NULL","NULL","NULL","F","NULL","NULL","NULL","NULL","NULL","F","NULL","NULL","NULL","NULL","NULL","F","NULL","NULL","NULL","NULL","NULL","F","NULL","NULL","NULL","NULL","NULL","F","NULL","NULL","NULL","NULL","NULL","F","NULL","NULL","NULL","NULL","NULL","F","NULL","NULL","NULL","NULL","NULL","F","NULL","NULL","NULL","NULL","NULL","F","NULL","NULL","NULL",45253.110922256943,45253.110922256943]
[17995,"Yes","Prescriptive","COOLCASEDRRCHZMEDGOT","Cooler w/ Door - Remote Condensing, Horiz Med Temp - GOT","Refrigerator","Appliance","GAS","HEAT",937,201,3,5778,"OR","NBE","New Buildings","2024-01-01","2026-12-31","Linear feet",0,0,0,25.68,22.49,0,"Grocery Refrigeration","Com Heating",0,150,0,10,0,293.82,0,0,0,1,1,0,100,"NULL","NULL",100,100,100,100,"NULL","NULL","NULL","NULL","NULL","NULL",100,"NULL","No Attributes ","NULL","NULL","F","NULL","NULL","NULL","NULL","NULL","F","NULL","NULL","NULL","NULL","NULL","F","NULL","NULL","NULL","NULL","NULL","F","NULL","NULL","NULL","NULL","NULL","F","NULL","NULL","NULL","NULL","NULL","F","NULL","NULL","NULL","NULL","NULL","F","NULL","NULL","NULL","NULL","NULL","F","NULL","NULL","NULL","NULL","NULL","F","NULL","NULL","NULL","NULL","NULL","F","NULL","NULL","NULL","NULL","NULL","F","NULL","NULL","NULL","NULL","NULL","F","NULL","NULL","NULL","NULL","NULL","F","NULL","NULL","NULL","NULL","NULL","F","NULL","NULL","NULL","NULL","NULL","F","NULL","NULL","NULL","NULL","NULL","F","NULL","NULL","NULL","NULL","NULL","F","NULL","NULL","NULL",45253.110922256943,45253.110922256943]
[17996,"Yes","Prescriptive","COOLCASEDRRCVTMEDGOT","Cooler w/ Door - Remote Condensing, Vert Med Temp - GOT","Refrigerator","Appliance","GAS","HEAT",937,201,3,5777,"OR","NBE","New Buildings","2024-01-01","2026-12-31","Linear feet",0,0,0,66.400000000000006,58.13,0,"Grocery Refrigeration","Com Heating",0,150,0,10,0,293.82,0,0,0,1,1,0,100,"NULL","NULL",100,100,100,100,"NULL","NULL","NULL","NULL","NULL","NULL",100,"NULL","No Attributes ","NULL","NULL","F","NULL","NULL","NULL","NULL","NULL","F","NULL","NULL","NULL","NULL","NULL","F","NULL","NULL","NULL","NULL","NULL","F","NULL","NULL","NULL","NULL","NULL","F","NULL","NULL","NULL","NULL","NULL","F","NULL","NULL","NULL","NULL","NULL","F","NULL","NULL","NULL","NULL","NULL","F","NULL","NULL","NULL","NULL","NULL","F","NULL","NULL","NULL","NULL","NULL","F","NULL","NULL","NULL","NULL","NULL","F","NULL","NULL","NULL","NULL","NULL","F","NULL","NULL","NULL","NULL","NULL","F","NULL","NULL","NULL","NULL","NULL","F","NULL","NULL","NULL","NULL","NULL","F","NULL","NULL","NULL","NULL","NULL","F","NULL","NULL","NULL","NULL","NULL","F","NULL","NULL","NULL",45253.110922256943,45253.110922256943]
[17997,"Yes","Prescriptive","COOLCASEDRRCHZLOWELE","Cooler w/ Door - Remote Condensing, Horiz Low Temp - Elec","Refrigerator","Appliance","ELE","HEAT",937,201,3,5779,"OR","NBE","New Buildings","2024-01-01","2026-12-31","Linear feet",0,0,852.29,0,0,0,"Grocery Refrigeration","None - gas",0,150,0,10,0,293.82,0,0,0,1,1,0,"NULL",100,100,"NULL","NULL","NULL","NULL","NULL","NULL","NULL","NULL","NULL","NULL","NULL","NULL","No Attributes ","NULL","NULL","F","NULL","NULL","NULL","NULL","NULL","F","NULL","NULL","NULL","NULL","NULL","F","NULL","NULL","NULL","NULL","NULL","F","NULL","NULL","NULL","NULL","NULL","F","NULL","NULL","NULL","NULL","NULL","F","NULL","NULL","NULL","NULL","NULL","F","NULL","NULL","NULL","NULL","NULL","F","NULL","NULL","NULL","NULL","NULL","F","NULL","NULL","NULL","NULL","NULL","F","NULL","NULL","NULL","NULL","NULL","F","NULL","NULL","NULL","NULL","NULL","F","NULL","NULL","NULL","NULL","NULL","F","NULL","NULL","NULL","NULL","NULL","F","NULL","NULL","NULL","NULL","NULL","F","NULL","NULL","NULL","NULL","NULL","F","NULL","NULL","NULL","NULL","NULL","F","NULL","NULL","NULL",45253.110922256943,45253.110922256943]
[17998,"Yes","Prescriptive","COOLCASEDRRCHZMEDELE","Cooler w/ Door - Remote Condensing, Horiz Med Temp - Elec","Refrigerator","Appliance","ELE","HEAT",937,201,3,5774,"OR","NBE","New Buildings","2024-01-01","2026-12-31","Linear feet",0,0,850.19,0,0,0,"Grocery Refrigeration","None - gas",0,150,0,10,0,293.82,0,0,0,1,1,0,"NULL",100,100,"NULL","NULL","NULL","NULL","NULL","NULL","NULL","NULL","NULL","NULL","NULL","NULL","No Attributes ","NULL","NULL","F","NULL","NULL","NULL","NULL","NULL","F","NULL","NULL","NULL","NULL","NULL","F","NULL","NULL","NULL","NULL","NULL","F","NULL","NULL","NULL","NULL","NULL","F","NULL","NULL","NULL","NULL","NULL","F","NULL","NULL","NULL","NULL","NULL","F","NULL","NULL","NULL","NULL","NULL","F","NULL","NULL","NULL","NULL","NULL","F","NULL","NULL","NULL","NULL","NULL","F","NULL","NULL","NULL","NULL","NULL","F","NULL","NULL","NULL","NULL","NULL","F","NULL","NULL","NULL","NULL","NULL","F","NULL","NULL","NULL","NULL","NULL","F","NULL","NULL","NULL","NULL","NULL","F","NULL","NULL","NULL","NULL","NULL","F","NULL","NULL","NULL","NULL","NULL","F","NULL","NULL","NULL",45253.110922256943,45253.110922256943]
[18008,"Yes","Prescriptive","COOLCASEDRRCVTMEDELE","Cooler w/ Door - Remote Condensing, Vert Med Temp - Elec","Refrigerator","Appliance","ELE","HEAT",937,201,3,5773,"OR","NBE","New Buildings","2024-01-01","2026-12-31","Linear feet",0,0,2198.0700000000002,0,0,0,"Grocery Refrigeration","None - gas",0,150,0,10,0,293.82,0,0,0,1,1,0,"NULL",100,100,"NULL","NULL","NULL","NULL","NULL","NULL","NULL","NULL","NULL","NULL","NULL","NULL","No Attributes ","NULL","NULL","F","NULL","NULL","NULL","NULL","NULL","F","NULL","NULL","NULL","NULL","NULL","F","NULL","NULL","NULL","NULL","NULL","F","NULL","NULL","NULL","NULL","NULL","F","NULL","NULL","NULL","NULL","NULL","F","NULL","NULL","NULL","NULL","NULL","F","NULL","NULL","NULL","NULL","NULL","F","NULL","NULL","NULL","NULL","NULL","F","NULL","NULL","NULL","NULL","NULL","F","NULL","NULL","NULL","NULL","NULL","F","NULL","NULL","NULL","NULL","NULL","F","NULL","NULL","NULL","NULL","NULL","F","NULL","NULL","NULL","NULL","NULL","F","NULL","NULL","NULL","NULL","NULL","F","NULL","NULL","NULL","NULL","NULL","F","NULL","NULL","NULL","NULL","NULL","F","NULL","NULL","NULL",45253.110922256943,45253.110922256943]
[18348,"Yes","Prescriptive","COOLCASEDRSCHZLOWEOT","Cooler w/ Door - Self-Contained, Horiz Low Temp - Gas EOT","Refrigerator","Appliance","ELE","N/A",937,201,3,5785,"OR","NBE","New Buildings","2024-01-01","2026-12-31","Linear feet",0,0,643.59,0,-9.91,0,"Grocery Refrigeration","Com Heating",0,150,0,10,0,293.82,0,0,0,1,1,0,"NULL",100,100,"NULL","NULL","NULL","NULL","NULL","NULL","NULL","NULL","NULL","NULL","NULL","NULL","No Attributes ","NULL","NULL","F","NULL","NULL","NULL","NULL","NULL","F","NULL","NULL","NULL","NULL","NULL","F","NULL","NULL","NULL","NULL","NULL","F","NULL","NULL","NULL","NULL","NULL","F","NULL","NULL","NULL","NULL","NULL","F","NULL","NULL","NULL","NULL","NULL","F","NULL","NULL","NULL","NULL","NULL","F","NULL","NULL","NULL","NULL","NULL","F","NULL","NULL","NULL","NULL","NULL","F","NULL","NULL","NULL","NULL","NULL","F","NULL","NULL","NULL","NULL","NULL","F","NULL","NULL","NULL","NULL","NULL","F","NULL","NULL","NULL","NULL","NULL","F","NULL","NULL","NULL","NULL","NULL","F","NULL","NULL","NULL","NULL","NULL","F","NULL","NULL","NULL","NULL","NULL","F","NULL","NULL","NULL",45279.151787418981,45279.151787418981]
[18365,"Yes","Prescriptive","CTWH199ALLCOM","Commercial Tankless Water Heater <200 - All Commercial","Tankless water heater","Water Heating","GAS","DHW",890,212,5,5492,"OR","NBE","New Buildings","2024-01-01","2025-12-31","Units",0,0,0,15.51,0,0,"None - ele","DHW",0,140,0,20,0,140.21,0,0,0,1,1,0,100,"NULL","NULL",100,100,100,100,"NULL","NULL","NULL","NULL","NULL","NULL",100,"NULL","Tankless water heater","EXISTTANK","Existing Water Storage Tank?","T","Alphanumeric",10,"CB","TANKSIZE","Tank Size in gallons","T","Alphanumeric",64,"ED","THERMALEFF","Thermal Efficiency","T","Alphanumeric",64,"ED","NULL","NULL","F","NULL","NULL","NULL","NULL","NULL","F","NULL","NULL","NULL","NULL","NULL","F","NULL","NULL","NULL","NULL","NULL","F","NULL","NULL","NULL","NULL","NULL","F","NULL","NULL","NULL","NULL","NULL","F","NULL","NULL","NULL","NULL","NULL","F","NULL","NULL","NULL","NULL","NULL","F","NULL","NULL","NULL","NULL","NULL","F","NULL","NULL","NULL","NULL","NULL","F","NULL","NULL","NULL","NULL","NULL","F","NULL","NULL","NULL","NULL","NULL","F","NULL","NULL","NULL","NULL","NULL","F","NULL","NULL","NULL","NULL","NULL","F","NULL","NULL","NULL",45294.118139317128,45294.118139317128]
[18006,"Yes","Prescriptive","VRFNDHEDOAS","VRF - Ductless w/ HE DOAS (per sf)","Variable refrigerant flow","HVAC","ELE","N/A",948,216,5,5851,"OR","NBE","New Buildings","2024-01-01","2024-12-31","Square feet",0,0,4.17,0,0,0,"Large Office Heating","None - gas",0,1,0,20,0,2.72,0,0,0,1,1,0,"NULL",100,100,"NULL","NULL","NULL","NULL","NULL","NULL","NULL","NULL","NULL","NULL","NULL","NULL","Variable refrigerant flow","CAPACITY","Size/Capacity in Tons","T","Decimal",10,"ED","NULL","NULL","F","NULL","NULL","NULL","NULL","NULL","F","NULL","NULL","NULL","NULL","NULL","F","NULL","NULL","NULL","NULL","NULL","F","NULL","NULL","NULL","NULL","NULL","F","NULL","NULL","NULL","NULL","NULL","F","NULL","NULL","NULL","NULL","NULL","F","NULL","NULL","NULL","NULL","NULL","F","NULL","NULL","NULL","NULL","NULL","F","NULL","NULL","NULL","NULL","NULL","F","NULL","NULL","NULL","NULL","NULL","F","NULL","NULL","NULL","NULL","NULL","F","NULL","NULL","NULL","NULL","NULL","F","NULL","NULL","NULL","NULL","NULL","F","NULL","NULL","NULL","NULL","NULL","F","NULL","NULL","NULL","NULL","NULL","F","NULL","NULL","NULL",45253.110922256943,45253.110922256943]
[18007,"Yes","Prescriptive","VRFND","VRF - Ductless (per sf)","Variable refrigerant flow","HVAC","ELE","N/A",948,216,5,5850,"OR","NBE","New Buildings","2024-01-01","2024-12-31","Square feet",0,0,3.9,0,0,0,"Large Office Heating","None - gas",0,1,0,20,0,2.37,0,0,0,1,1,0,"NULL",100,100,"NULL","NULL","NULL","NULL","NULL","NULL","NULL","NULL","NULL","NULL","NULL","NULL","Variable refrigerant flow","CAPACITY","Size/Capacity in Tons","T","Decimal",10,"ED","NULL","NULL","F","NULL","NULL","NULL","NULL","NULL","F","NULL","NULL","NULL","NULL","NULL","F","NULL","NULL","NULL","NULL","NULL","F","NULL","NULL","NULL","NULL","NULL","F","NULL","NULL","NULL","NULL","NULL","F","NULL","NULL","NULL","NULL","NULL","F","NULL","NULL","NULL","NULL","NULL","F","NULL","NULL","NULL","NULL","NULL","F","NULL","NULL","NULL","NULL","NULL","F","NULL","NULL","NULL","NULL","NULL","F","NULL","NULL","NULL","NULL","NULL","F","NULL","NULL","NULL","NULL","NULL","F","NULL","NULL","NULL","NULL","NULL","F","NULL","NULL","NULL","NULL","NULL","F","NULL","NULL","NULL","NULL","NULL","F","NULL","NULL","NULL",45253.110922256943,45253.110922256943]
[18003,"Yes","Prescriptive","OVERWRAPPER","On-Demand Overwrapper","Food equipment","Food Service","BOTH","N/A",854,230,3,5029,"OR","NBE","New Buildings","2024-01-01","2025-12-31","Units",0,0,1584.49,-37.57,0,0,"Grocery Process","Com Heating",0,350,0,10,0,367.16,0,-37.57,0,1,1,0,"NULL",100,100,"NULL","NULL","NULL","NULL","NULL","NULL","NULL","NULL","NULL","NULL","NULL","NULL","No Attributes ","NULL","NULL","F","NULL","NULL","NULL","NULL","NULL","F","NULL","NULL","NULL","NULL","NULL","F","NULL","NULL","NULL","NULL","NULL","F","NULL","NULL","NULL","NULL","NULL","F","NULL","NULL","NULL","NULL","NULL","F","NULL","NULL","NULL","NULL","NULL","F","NULL","NULL","NULL","NULL","NULL","F","NULL","NULL","NULL","NULL","NULL","F","NULL","NULL","NULL","NULL","NULL","F","NULL","NULL","NULL","NULL","NULL","F","NULL","NULL","NULL","NULL","NULL","F","NULL","NULL","NULL","NULL","NULL","F","NULL","NULL","NULL","NULL","NULL","F","NULL","NULL","NULL","NULL","NULL","F","NULL","NULL","NULL","NULL","NULL","F","NULL","NULL","NULL","NULL","NULL","F","NULL","NULL","NULL",45253.110922256943,45253.110922256943]
[13451,"Yes","Prescriptive","DRYERELE","Electric Clothes Dryer - In-Unit","Clothes Dryer","Appliance","ELE","N/A",746,231,2,3792,"OR","NBE","New Buildings","2022-01-01","2024-12-31","Units",0,0,54.13,0,0,0,"Res Dryer","None - gas",0,25,0,12,0,25.27,0,0,1,1,1,0,"NULL",100,100,"NULL","NULL","NULL","NULL","NULL","NULL","NULL","NULL","NULL","NULL","NULL","NULL","Clothes Dryer","MANUFACTURER","Manufacturer Name","T","ALPHANUMERIC",40,"ED","MODEL","Model","T","ALPHANUMERIC",20,"ED","CEF","Combined Energy Factor","T","ALPHANUMERIC",5,"ED","CLOTHDRYERTYPE","Clothes Dryer Type","F","ALPHANUMERIC",20,"CB","VOLUME","Volume (cubic feet)","F","DECIMAL",10,"ED","VENTING","Venting or Ventless","F","ALPHANUMERIC",20,"CB","NULL","NULL","F","NULL","NULL","NULL","NULL","NULL","F","NULL","NULL","NULL","NULL","NULL","F","NULL","NULL","NULL","NULL","NULL","F","NULL","NULL","NULL","NULL","NULL","F","NULL","NULL","NULL","NULL","NULL","F","NULL","NULL","NULL","NULL","NULL","F","NULL","NULL","NULL","NULL","NULL","F","NULL","NULL","NULL","NULL","NULL","F","NULL","NULL","NULL","NULL","NULL","F","NULL","NULL","NULL","NULL","NULL","F","NULL","NULL","NULL",44952.607310150466,44952.607310150466]
[15933,"Yes","Prescriptive","HHCECMVS050075HP","Hydro Heating Circulators, ECM, Variable Speed, >0.5 - = 0.75 HP","Recirculation Pump Control","Pumps","ELE","N/A",733,247,2,3755,"OR","NBE","New Buildings","2023-01-01","2024-12-31","Units",0,0,674.88,0,0,0,"Other Heating","Com Heating",0,300,0,15,0,499,0,0,0,1,1,0,"NULL",100,100,"NULL","NULL","NULL","NULL","NULL","NULL","NULL","NULL","NULL","NULL","NULL","NULL","Recirculation Pump Control","PUMPEFFINDEX","Pump Efficiency Index (PEI)","F","ALPHANUMERIC",40,"ED","ENERGYRATING","Energy Rating (ER)","F","ALPHANUMERIC",40,"ED","EQUIPCOST","Total Equipment Cost","F","Alphanumeric",64,"ED","INSTALLCOST","Total Installed Cost","F","Alphanumeric",64,"ED","NULL","NULL","F","NULL","NULL","NULL","NULL","NULL","F","NULL","NULL","NULL","NULL","NULL","F","NULL","NULL","NULL","NULL","NULL","F","NULL","NULL","NULL","NULL","NULL","F","NULL","NULL","NULL","NULL","NULL","F","NULL","NULL","NULL","NULL","NULL","F","NULL","NULL","NULL","NULL","NULL","F","NULL","NULL","NULL","NULL","NULL","F","NULL","NULL","NULL","NULL","NULL","F","NULL","NULL","NULL","NULL","NULL","F","NULL","NULL","NULL","NULL","NULL","F","NULL","NULL","NULL","NULL","NULL","F","NULL","NULL","NULL",44952.607310150466,44952.607310150466]
[15934,"Yes","Prescriptive","HHCECMVS175250HP","Hydro Heating Circulators, ECM, Variable Speed, >1.75 - =2.5 HP","Recirculation Pump Control","Pumps","ELE","N/A",733,247,2,3758,"OR","NBE","New Buildings","2023-01-01","2024-12-31","Units",0,0,1749.3,0,0,0,"Other Heating","Com Heating",0,300,0,15,0,981.78,0,0,0,1,1,0,"NULL",100,100,"NULL","NULL","NULL","NULL","NULL","NULL","NULL","NULL","NULL","NULL","NULL","NULL","Recirculation Pump Control","PUMPEFFINDEX","Pump Efficiency Index (PEI)","F","ALPHANUMERIC",40,"ED","ENERGYRATING","Energy Rating (ER)","F","ALPHANUMERIC",40,"ED","EQUIPCOST","Total Equipment Cost","F","Alphanumeric",64,"ED","INSTALLCOST","Total Installed Cost","F","Alphanumeric",64,"ED","NULL","NULL","F","NULL","NULL","NULL","NULL","NULL","F","NULL","NULL","NULL","NULL","NULL","F","NULL","NULL","NULL","NULL","NULL","F","NULL","NULL","NULL","NULL","NULL","F","NULL","NULL","NULL","NULL","NULL","F","NULL","NULL","NULL","NULL","NULL","F","NULL","NULL","NULL","NULL","NULL","F","NULL","NULL","NULL","NULL","NULL","F","NULL","NULL","NULL","NULL","NULL","F","NULL","NULL","NULL","NULL","NULL","F","NULL","NULL","NULL","NULL","NULL","F","NULL","NULL","NULL","NULL","NULL","F","NULL","NULL","NULL",44952.607310150466,44952.607310150466]
[15935,"Yes","Prescriptive","HHCECMVS250350HP","Hydro Heating Circulators, ECM, Variable Speed, >2.5 - =3.5 HP","Recirculation Pump Control","Pumps","ELE","N/A",733,247,2,3759,"OR","NBE","New Buildings","2023-01-01","2024-12-31","Units",0,0,2623.95,0,0,0,"Other Heating","Com Heating",0,750,0,15,0,1227.22,0,0,0,1,1,0,"NULL",100,100,"NULL","NULL","NULL","NULL","NULL","NULL","NULL","NULL","NULL","NULL","NULL","NULL","Recirculation Pump Control","PUMPEFFINDEX","Pump Efficiency Index (PEI)","F","ALPHANUMERIC",40,"ED","ENERGYRATING","Energy Rating (ER)","F","ALPHANUMERIC",40,"ED","EQUIPCOST","Total Equipment Cost","F","Alphanumeric",64,"ED","INSTALLCOST","Total Installed Cost","F","Alphanumeric",64,"ED","NULL","NULL","F","NULL","NULL","NULL","NULL","NULL","F","NULL","NULL","NULL","NULL","NULL","F","NULL","NULL","NULL","NULL","NULL","F","NULL","NULL","NULL","NULL","NULL","F","NULL","NULL","NULL","NULL","NULL","F","NULL","NULL","NULL","NULL","NULL","F","NULL","NULL","NULL","NULL","NULL","F","NULL","NULL","NULL","NULL","NULL","F","NULL","NULL","NULL","NULL","NULL","F","NULL","NULL","NULL","NULL","NULL","F","NULL","NULL","NULL","NULL","NULL","F","NULL","NULL","NULL","NULL","NULL","F","NULL","NULL","NULL",44952.607310150466,44952.607310150466]
[15936,"Yes","Prescriptive","HHCECMVS350450HP","Hydro Heating Circulators, ECM, Variable Speed, >3.5 - =4.5 HP","Recirculation Pump Control","Pumps","ELE","N/A",733,247,2,3760,"OR","NBE","New Buildings","2023-01-01","2024-12-31","Units",0,0,3498.6,0,0,0,"Other Heating","Com Heating",0,750,0,15,0,1472.66,0,0,0,1,1,0,"NULL",100,100,"NULL","NULL","NULL","NULL","NULL","NULL","NULL","NULL","NULL","NULL","NULL","NULL","Recirculation Pump Control","PUMPEFFINDEX","Pump Efficiency Index (PEI)","F","ALPHANUMERIC",40,"ED","ENERGYRATING","Energy Rating (ER)","F","ALPHANUMERIC",40,"ED","EQUIPCOST","Total Equipment Cost","F","Alphanumeric",64,"ED","INSTALLCOST","Total Installed Cost","F","Alphanumeric",64,"ED","NULL","NULL","F","NULL","NULL","NULL","NULL","NULL","F","NULL","NULL","NULL","NULL","NULL","F","NULL","NULL","NULL","NULL","NULL","F","NULL","NULL","NULL","NULL","NULL","F","NULL","NULL","NULL","NULL","NULL","F","NULL","NULL","NULL","NULL","NULL","F","NULL","NULL","NULL","NULL","NULL","F","NULL","NULL","NULL","NULL","NULL","F","NULL","NULL","NULL","NULL","NULL","F","NULL","NULL","NULL","NULL","NULL","F","NULL","NULL","NULL","NULL","NULL","F","NULL","NULL","NULL","NULL","NULL","F","NULL","NULL","NULL",44952.607310150466,44952.607310150466]
[15937,"Yes","Prescriptive","HHCECMVS450500HP","Hydro Heating Circulators, ECM, Variable Speed, >4.5 - =5 HP","Recirculation Pump Control","Pumps","ELE","N/A",733,247,2,3761,"OR","NBE","New Buildings","2023-01-01","2024-12-31","Units",0,0,4373.25,0,0,0,"Other Heating","Com Heating",0,750,0,15,0,1718.11,0,0,0,1,1,0,"NULL",100,100,"NULL","NULL","NULL","NULL","NULL","NULL","NULL","NULL","NULL","NULL","NULL","NULL","Recirculation Pump Control","PUMPEFFINDEX","Pump Efficiency Index (PEI)","F","ALPHANUMERIC",40,"ED","ENERGYRATING","Energy Rating (ER)","F","ALPHANUMERIC",40,"ED","EQUIPCOST","Total Equipment Cost","F","Alphanumeric",64,"ED","INSTALLCOST","Total Installed Cost","F","Alphanumeric",64,"ED","NULL","NULL","F","NULL","NULL","NULL","NULL","NULL","F","NULL","NULL","NULL","NULL","NULL","F","NULL","NULL","NULL","NULL","NULL","F","NULL","NULL","NULL","NULL","NULL","F","NULL","NULL","NULL","NULL","NULL","F","NULL","NULL","NULL","NULL","NULL","F","NULL","NULL","NULL","NULL","NULL","F","NULL","NULL","NULL","NULL","NULL","F","NULL","NULL","NULL","NULL","NULL","F","NULL","NULL","NULL","NULL","NULL","F","NULL","NULL","NULL","NULL","NULL","F","NULL","NULL","NULL","NULL","NULL","F","NULL","NULL","NULL",44952.607310150466,44952.607310150466]
[15938,"Yes","Prescriptive","HHCECMSS075125HP","Hydro Heating Circulators, ECM, Single Speed, >.75 - =1.25 HP","Recirculation Pump Control","Pumps","ELE","N/A",733,247,2,3749,"OR","NBE","New Buildings","2023-01-01","2024-12-31","Units",0,0,415.73,0,0,0,"Other Heating","Com Heating",0,200,0,15,0,351.68,0,0,0,1,1,0,"NULL",100,100,"NULL","NULL","NULL","NULL","NULL","NULL","NULL","NULL","NULL","NULL","NULL","NULL","Recirculation Pump Control","PUMPEFFINDEX","Pump Efficiency Index (PEI)","F","ALPHANUMERIC",40,"ED","ENERGYRATING","Energy Rating (ER)","F","ALPHANUMERIC",40,"ED","EQUIPCOST","Total Equipment Cost","F","Alphanumeric",64,"ED","INSTALLCOST","Total Installed Cost","F","Alphanumeric",64,"ED","NULL","NULL","F","NULL","NULL","NULL","NULL","NULL","F","NULL","NULL","NULL","NULL","NULL","F","NULL","NULL","NULL","NULL","NULL","F","NULL","NULL","NULL","NULL","NULL","F","NULL","NULL","NULL","NULL","NULL","F","NULL","NULL","NULL","NULL","NULL","F","NULL","NULL","NULL","NULL","NULL","F","NULL","NULL","NULL","NULL","NULL","F","NULL","NULL","NULL","NULL","NULL","F","NULL","NULL","NULL","NULL","NULL","F","NULL","NULL","NULL","NULL","NULL","F","NULL","NULL","NULL","NULL","NULL","F","NULL","NULL","NULL",44952.607310150466,44952.607310150466]
[15939,"Yes","Prescriptive","HHCECMSS125175HP","Hydro Heating Circulators, ECM, Single Speed, > 1.25 - = 1.75 HP","Recirculation Pump Control","Pumps","ELE","N/A",733,247,2,3750,"OR","NBE","New Buildings","2023-01-01","2024-12-31","Units",0,0,623.59,0,0,0,"Other Heating","Com Heating",0,200,0,15,0,527.52,0,0,0,1,1,0,"NULL",100,100,"NULL","NULL","NULL","NULL","NULL","NULL","NULL","NULL","NULL","NULL","NULL","NULL","Recirculation Pump Control","PUMPEFFINDEX","Pump Efficiency Index (PEI)","F","ALPHANUMERIC",40,"ED","ENERGYRATING","Energy Rating (ER)","F","ALPHANUMERIC",40,"ED","EQUIPCOST","Total Equipment Cost","F","Alphanumeric",64,"ED","INSTALLCOST","Total Installed Cost","F","Alphanumeric",64,"ED","NULL","NULL","F","NULL","NULL","NULL","NULL","NULL","F","NULL","NULL","NULL","NULL","NULL","F","NULL","NULL","NULL","NULL","NULL","F","NULL","NULL","NULL","NULL","NULL","F","NULL","NULL","NULL","NULL","NULL","F","NULL","NULL","NULL","NULL","NULL","F","NULL","NULL","NULL","NULL","NULL","F","NULL","NULL","NULL","NULL","NULL","F","NULL","NULL","NULL","NULL","NULL","F","NULL","NULL","NULL","NULL","NULL","F","NULL","NULL","NULL","NULL","NULL","F","NULL","NULL","NULL","NULL","NULL","F","NULL","NULL","NULL",44952.607310150466,44952.607310150466]
[15942,"Yes","Prescriptive","HHCECMSS450500HP","Hydro Heating Circulators, ECM, Single Speed, > 4.5 - = 5 HP","Recirculation Pump Control","Pumps","ELE","N/A",733,247,2,3754,"OR","NBE","New Buildings","2022-01-01","2024-12-31","Units",0,0,2078.65,0,0,0,"Other Heating","Com Heating",0,300,0,15,0,1230.8699999999999,0,0,0,1,1,0,"NULL",100,100,"NULL","NULL","NULL","NULL","NULL","NULL","NULL","NULL","NULL","NULL","NULL","NULL","Recirculation Pump Control","PUMPEFFINDEX","Pump Efficiency Index (PEI)","F","ALPHANUMERIC",40,"ED","ENERGYRATING","Energy Rating (ER)","F","ALPHANUMERIC",40,"ED","EQUIPCOST","Total Equipment Cost","F","Alphanumeric",64,"ED","INSTALLCOST","Total Installed Cost","F","Alphanumeric",64,"ED","NULL","NULL","F","NULL","NULL","NULL","NULL","NULL","F","NULL","NULL","NULL","NULL","NULL","F","NULL","NULL","NULL","NULL","NULL","F","NULL","NULL","NULL","NULL","NULL","F","NULL","NULL","NULL","NULL","NULL","F","NULL","NULL","NULL","NULL","NULL","F","NULL","NULL","NULL","NULL","NULL","F","NULL","NULL","NULL","NULL","NULL","F","NULL","NULL","NULL","NULL","NULL","F","NULL","NULL","NULL","NULL","NULL","F","NULL","NULL","NULL","NULL","NULL","F","NULL","NULL","NULL","NULL","NULL","F","NULL","NULL","NULL",44952.607310150466,44952.607310150466]
[15943,"Yes","Prescriptive","HHCECMSS350450HP","Hydro Heating Circulators, ECM, Single Speed, > 3.5 - = 4.5 HP","Recirculation Pump Control","Pumps","ELE","N/A",733,247,2,3753,"OR","NBE","New Buildings","2023-01-01","2024-12-31","Units",0,0,1662.92,0,0,0,"Other Heating","Com Heating",0,300,0,15,0,1055.03,0,0,0,1,1,0,"NULL",100,100,"NULL","NULL","NULL","NULL","NULL","NULL","NULL","NULL","NULL","NULL","NULL","NULL","Recirculation Pump Control","PUMPEFFINDEX","Pump Efficiency Index (PEI)","F","ALPHANUMERIC",40,"ED","ENERGYRATING","Energy Rating (ER)","F","ALPHANUMERIC",40,"ED","EQUIPCOST","Total Equipment Cost","F","Alphanumeric",64,"ED","INSTALLCOST","Total Installed Cost","F","Alphanumeric",64,"ED","NULL","NULL","F","NULL","NULL","NULL","NULL","NULL","F","NULL","NULL","NULL","NULL","NULL","F","NULL","NULL","NULL","NULL","NULL","F","NULL","NULL","NULL","NULL","NULL","F","NULL","NULL","NULL","NULL","NULL","F","NULL","NULL","NULL","NULL","NULL","F","NULL","NULL","NULL","NULL","NULL","F","NULL","NULL","NULL","NULL","NULL","F","NULL","NULL","NULL","NULL","NULL","F","NULL","NULL","NULL","NULL","NULL","F","NULL","NULL","NULL","NULL","NULL","F","NULL","NULL","NULL","NULL","NULL","F","NULL","NULL","NULL",44952.607310150466,44952.607310150466]
[15944,"Yes","Prescriptive","HHCECMSS175250HP","Hydro Heating Circulators, ECM, Single Speed, >1.75 - = 2.5 HP","Recirculation Pump Control","Pumps","ELE","N/A",733,247,2,3751,"OR","NBE","New Buildings","2023-01-01","2024-12-31","Units",0,0,831.46,0,0,0,"Other Heating","Com Heating",0,200,0,15,0,703.35,0,0,0,1,1,0,"NULL",100,100,"NULL","NULL","NULL","NULL","NULL","NULL","NULL","NULL","NULL","NULL","NULL","NULL","Recirculation Pump Control","PUMPEFFINDEX","Pump Efficiency Index (PEI)","F","ALPHANUMERIC",40,"ED","ENERGYRATING","Energy Rating (ER)","F","ALPHANUMERIC",40,"ED","EQUIPCOST","Total Equipment Cost","F","Alphanumeric",64,"ED","INSTALLCOST","Total Installed Cost","F","Alphanumeric",64,"ED","NULL","NULL","F","NULL","NULL","NULL","NULL","NULL","F","NULL","NULL","NULL","NULL","NULL","F","NULL","NULL","NULL","NULL","NULL","F","NULL","NULL","NULL","NULL","NULL","F","NULL","NULL","NULL","NULL","NULL","F","NULL","NULL","NULL","NULL","NULL","F","NULL","NULL","NULL","NULL","NULL","F","NULL","NULL","NULL","NULL","NULL","F","NULL","NULL","NULL","NULL","NULL","F","NULL","NULL","NULL","NULL","NULL","F","NULL","NULL","NULL","NULL","NULL","F","NULL","NULL","NULL","NULL","NULL","F","NULL","NULL","NULL",44952.607310150466,44952.607310150466]
[15945,"Yes","Prescriptive","HHCECMVS075125HP","Hydro Heating Circulators, ECM, Variable Speed, >.75 - =1.25 HP","Recirculation Pump Control","Pumps","ELE","N/A",733,247,2,3756,"OR","NBE","New Buildings","2023-01-01","2024-12-31","Units",0,0,874.65,0,0,0,"Other Heating","Com Heating",0,300,0,15,0,490.89,0,0,0,1,1,0,"NULL",100,100,"NULL","NULL","NULL","NULL","NULL","NULL","NULL","NULL","NULL","NULL","NULL","NULL","Recirculation Pump Control","PUMPEFFINDEX","Pump Efficiency Index (PEI)","F","ALPHANUMERIC",40,"ED","ENERGYRATING","Energy Rating (ER)","F","ALPHANUMERIC",40,"ED","EQUIPCOST","Total Equipment Cost","F","Alphanumeric",64,"ED","INSTALLCOST","Total Installed Cost","F","Alphanumeric",64,"ED","NULL","NULL","F","NULL","NULL","NULL","NULL","NULL","F","NULL","NULL","NULL","NULL","NULL","F","NULL","NULL","NULL","NULL","NULL","F","NULL","NULL","NULL","NULL","NULL","F","NULL","NULL","NULL","NULL","NULL","F","NULL","NULL","NULL","NULL","NULL","F","NULL","NULL","NULL","NULL","NULL","F","NULL","NULL","NULL","NULL","NULL","F","NULL","NULL","NULL","NULL","NULL","F","NULL","NULL","NULL","NULL","NULL","F","NULL","NULL","NULL","NULL","NULL","F","NULL","NULL","NULL","NULL","NULL","F","NULL","NULL","NULL",44952.607310150466,44952.607310150466]
[16087,"Yes","Prescriptive","HHCECMSS250350HP","Hydro Heating Circulators, ECM, Single Speed, >2.5 - =3.5 HP","Recirculation Pump Control","Pumps","ELE","N/A",733,247,2,3752,"OR","NBE","New Buildings","2023-01-01","2024-12-31","Units",0,0,1247.19,0,0,0,"Other Heating","Com Heating",0,300,0,15,0,879.19,0,0,0,1,1,0,"NULL",100,100,"NULL","NULL","NULL","NULL","NULL","NULL","NULL","NULL","NULL","NULL","NULL","NULL","Recirculation Pump Control","PUMPEFFINDEX","Pump Efficiency Index (PEI)","F","ALPHANUMERIC",40,"ED","ENERGYRATING","Energy Rating (ER)","F","ALPHANUMERIC",40,"ED","EQUIPCOST","Total Equipment Cost","F","Alphanumeric",64,"ED","INSTALLCOST","Total Installed Cost","F","Alphanumeric",64,"ED","NULL","NULL","F","NULL","NULL","NULL","NULL","NULL","F","NULL","NULL","NULL","NULL","NULL","F","NULL","NULL","NULL","NULL","NULL","F","NULL","NULL","NULL","NULL","NULL","F","NULL","NULL","NULL","NULL","NULL","F","NULL","NULL","NULL","NULL","NULL","F","NULL","NULL","NULL","NULL","NULL","F","NULL","NULL","NULL","NULL","NULL","F","NULL","NULL","NULL","NULL","NULL","F","NULL","NULL","NULL","NULL","NULL","F","NULL","NULL","NULL","NULL","NULL","F","NULL","NULL","NULL","NULL","NULL","F","NULL","NULL","NULL",44952.607310150466,44952.607310150466]
[16094,"Yes","Prescriptive","HHCECMVS125175HP","Hydro Heating Circulators, ECM, Variable Speed, >1.25 - =1.75 HP","Recirculation Pump Control","Pumps","ELE","N/A",733,247,2,3757,"OR","NBE","New Buildings","2023-01-01","2024-12-31","Units",0,0,1311.97,0,0,0,"Other Heating","Com Heating",0,300,0,15,0,736.33,0,0,0,1,1,0,"NULL",100,100,"NULL","NULL","NULL","NULL","NULL","NULL","NULL","NULL","NULL","NULL","NULL","NULL","Recirculation Pump Control","PUMPEFFINDEX","Pump Efficiency Index (PEI)","F","ALPHANUMERIC",40,"ED","ENERGYRATING","Energy Rating (ER)","F","ALPHANUMERIC",40,"ED","EQUIPCOST","Total Equipment Cost","F","Alphanumeric",64,"ED","INSTALLCOST","Total Installed Cost","F","Alphanumeric",64,"ED","NULL","NULL","F","NULL","NULL","NULL","NULL","NULL","F","NULL","NULL","NULL","NULL","NULL","F","NULL","NULL","NULL","NULL","NULL","F","NULL","NULL","NULL","NULL","NULL","F","NULL","NULL","NULL","NULL","NULL","F","NULL","NULL","NULL","NULL","NULL","F","NULL","NULL","NULL","NULL","NULL","F","NULL","NULL","NULL","NULL","NULL","F","NULL","NULL","NULL","NULL","NULL","F","NULL","NULL","NULL","NULL","NULL","F","NULL","NULL","NULL","NULL","NULL","F","NULL","NULL","NULL","NULL","NULL","F","NULL","NULL","NULL",44952.607310150466,44952.607310150466]
[18270,"Yes","Prescriptive","CHPWHT2","Commercial Heat Pump Water Heater - Tier 2","Heat pump water heater","Water Heating","BOTH","N/A",929,254,2,5698,"OR","NBE","New Buildings","2024-01-01","2026-12-31","Units",0,0,1432.74,-5.9,0,0,"Other Hot Water","None - gas",0,800,0,18,0,866.65,0,-5.9,0,1,1,0,"NULL",100,100,"NULL","NULL","NULL","NULL","NULL","NULL","NULL","NULL","NULL","NULL","NULL","NULL","Heat pump water heater","SN","Serial Number","F","Alphanumeric",64,"ED","NULL","NULL","F","NULL","NULL","NULL","NULL","NULL","F","NULL","NULL","NULL","NULL","NULL","F","NULL","NULL","NULL","NULL","NULL","F","NULL","NULL","NULL","NULL","NULL","F","NULL","NULL","NULL","NULL","NULL","F","NULL","NULL","NULL","NULL","NULL","F","NULL","NULL","NULL","NULL","NULL","F","NULL","NULL","NULL","NULL","NULL","F","NULL","NULL","NULL","NULL","NULL","F","NULL","NULL","NULL","NULL","NULL","F","NULL","NULL","NULL","NULL","NULL","F","NULL","NULL","NULL","NULL","NULL","F","NULL","NULL","NULL","NULL","NULL","F","NULL","NULL","NULL","NULL","NULL","F","NULL","NULL","NULL","NULL","NULL","F","NULL","NULL","NULL",45276.116190428242,45276.116190428242]
[18271,"Yes","Prescriptive","CHPWHT2D","Commercial Heat Pump Water Heater - Tier 2, ducted","Heat pump water heater","Water Heating","BOTH","N/A",929,254,2,5699,"OR","NBE","New Buildings","2024-01-01","2026-12-31","Units",0,0,1328.12,-7.9,0,0,"Other Hot Water","None - gas",0,800,0,18,0,1138.1300000000001,0,-7.9,0,1,1,0,"NULL",100,100,"NULL","NULL","NULL","NULL","NULL","NULL","NULL","NULL","NULL","NULL","NULL","NULL","Heat pump water heater","SN","Serial Number","F","Alphanumeric",64,"ED","NULL","NULL","F","NULL","NULL","NULL","NULL","NULL","F","NULL","NULL","NULL","NULL","NULL","F","NULL","NULL","NULL","NULL","NULL","F","NULL","NULL","NULL","NULL","NULL","F","NULL","NULL","NULL","NULL","NULL","F","NULL","NULL","NULL","NULL","NULL","F","NULL","NULL","NULL","NULL","NULL","F","NULL","NULL","NULL","NULL","NULL","F","NULL","NULL","NULL","NULL","NULL","F","NULL","NULL","NULL","NULL","NULL","F","NULL","NULL","NULL","NULL","NULL","F","NULL","NULL","NULL","NULL","NULL","F","NULL","NULL","NULL","NULL","NULL","F","NULL","NULL","NULL","NULL","NULL","F","NULL","NULL","NULL","NULL","NULL","F","NULL","NULL","NULL",45276.116190428242,45276.116190428242]
[18272,"Yes","Prescriptive","CHPWHT3","Commercial Heat Pump Water Heater - Tier 3","Heat pump water heater","Water Heating","BOTH","N/A",929,254,2,5700,"OR","NBE","New Buildings","2024-01-01","2026-12-31","Units",0,0,1612.95,-5.89,0,0,"Other Hot Water","None - gas",0,800,0,18,0,866.65,0,-5.89,0,1,1,0,"NULL",100,100,"NULL","NULL","NULL","NULL","NULL","NULL","NULL","NULL","NULL","NULL","NULL","NULL","Heat pump water heater","SN","Serial Number","F","Alphanumeric",64,"ED","NULL","NULL","F","NULL","NULL","NULL","NULL","NULL","F","NULL","NULL","NULL","NULL","NULL","F","NULL","NULL","NULL","NULL","NULL","F","NULL","NULL","NULL","NULL","NULL","F","NULL","NULL","NULL","NULL","NULL","F","NULL","NULL","NULL","NULL","NULL","F","NULL","NULL","NULL","NULL","NULL","F","NULL","NULL","NULL","NULL","NULL","F","NULL","NULL","NULL","NULL","NULL","F","NULL","NULL","NULL","NULL","NULL","F","NULL","NULL","NULL","NULL","NULL","F","NULL","NULL","NULL","NULL","NULL","F","NULL","NULL","NULL","NULL","NULL","F","NULL","NULL","NULL","NULL","NULL","F","NULL","NULL","NULL","NULL","NULL","F","NULL","NULL","NULL",45276.116190428242,45276.116190428242]
[18273,"Yes","Prescriptive","CHPWHT3D","Commercial Heat Pump Water Heater - Tier 3, ducted","Heat pump water heater","Water Heating","BOTH","N/A",929,254,2,5701,"OR","NBE","New Buildings","2024-01-01","2026-12-31","Units",0,0,1493.61,-7.9,0,0,"Other Hot Water","None - gas",0,800,0,18,0,1138.1300000000001,0,-7.9,0,1,1,0,"NULL",100,100,"NULL","NULL","NULL","NULL","NULL","NULL","NULL","NULL","NULL","NULL","NULL","NULL","Heat pump water heater","SN","Serial Number","F","Alphanumeric",64,"ED","NULL","NULL","F","NULL","NULL","NULL","NULL","NULL","F","NULL","NULL","NULL","NULL","NULL","F","NULL","NULL","NULL","NULL","NULL","F","NULL","NULL","NULL","NULL","NULL","F","NULL","NULL","NULL","NULL","NULL","F","NULL","NULL","NULL","NULL","NULL","F","NULL","NULL","NULL","NULL","NULL","F","NULL","NULL","NULL","NULL","NULL","F","NULL","NULL","NULL","NULL","NULL","F","NULL","NULL","NULL","NULL","NULL","F","NULL","NULL","NULL","NULL","NULL","F","NULL","NULL","NULL","NULL","NULL","F","NULL","NULL","NULL","NULL","NULL","F","NULL","NULL","NULL","NULL","NULL","F","NULL","NULL","NULL","NULL","NULL","F","NULL","NULL","NULL",45276.116190428242,45276.116190428242]
[18274,"Yes","Prescriptive","CHPWHT4UP","Commercial Heat Pump Water Heater - Tier 4 & up","Heat pump water heater","Water Heating","BOTH","N/A",929,254,2,5702,"OR","NBE","New Buildings","2024-01-01","2026-12-31","Units",0,0,1838.46,-6.52,0,0,"Other Hot Water","None - gas",0,800,0,18,0,866.65,0,-6.52,0,1,1,0,"NULL",100,100,"NULL","NULL","NULL","NULL","NULL","NULL","NULL","NULL","NULL","NULL","NULL","NULL","Heat pump water heater","SN","Serial Number","F","Alphanumeric",64,"ED","NULL","NULL","F","NULL","NULL","NULL","NULL","NULL","F","NULL","NULL","NULL","NULL","NULL","F","NULL","NULL","NULL","NULL","NULL","F","NULL","NULL","NULL","NULL","NULL","F","NULL","NULL","NULL","NULL","NULL","F","NULL","NULL","NULL","NULL","NULL","F","NULL","NULL","NULL","NULL","NULL","F","NULL","NULL","NULL","NULL","NULL","F","NULL","NULL","NULL","NULL","NULL","F","NULL","NULL","NULL","NULL","NULL","F","NULL","NULL","NULL","NULL","NULL","F","NULL","NULL","NULL","NULL","NULL","F","NULL","NULL","NULL","NULL","NULL","F","NULL","NULL","NULL","NULL","NULL","F","NULL","NULL","NULL","NULL","NULL","F","NULL","NULL","NULL",45276.116190428242,45276.116190428242]
[18275,"Yes","Prescriptive","CHPWHT4UPD","Commercial Heat Pump Water Heater - Tier 4 & up, ducted","Heat pump water heater","Water Heating","BOTH","N/A",929,254,2,5703,"OR","NBE","New Buildings","2024-01-01","2026-12-31","Units",0,0,1624.15,-10.99,0,0,"Other Hot Water","None - gas",0,800,0,18,0,1138.1300000000001,0,-10.99,0,1,1,0,"NULL",100,100,"NULL","NULL","NULL","NULL","NULL","NULL","NULL","NULL","NULL","NULL","NULL","NULL","Heat pump water heater","SN","Serial Number","F","Alphanumeric",64,"ED","NULL","NULL","F","NULL","NULL","NULL","NULL","NULL","F","NULL","NULL","NULL","NULL","NULL","F","NULL","NULL","NULL","NULL","NULL","F","NULL","NULL","NULL","NULL","NULL","F","NULL","NULL","NULL","NULL","NULL","F","NULL","NULL","NULL","NULL","NULL","F","NULL","NULL","NULL","NULL","NULL","F","NULL","NULL","NULL","NULL","NULL","F","NULL","NULL","NULL","NULL","NULL","F","NULL","NULL","NULL","NULL","NULL","F","NULL","NULL","NULL","NULL","NULL","F","NULL","NULL","NULL","NULL","NULL","F","NULL","NULL","NULL","NULL","NULL","F","NULL","NULL","NULL","NULL","NULL","F","NULL","NULL","NULL","NULL","NULL","F","NULL","NULL","NULL",45276.116190428242,45276.116190428242]
[18364,"Yes","Prescriptive","CHPWHT1","Commercial Heat Pump Water Heater - Tier 1","Heat pump water heater","Water Heating","BOTH","N/A",929,254,2,5697,"OR","NBE","New Buildings","2024-01-01","2026-12-31","Units",0,0,1110.6400000000001,-3.71,0,0,"Other Hot Water","None - gas",0,800,0,18,0,866.65,0,-3.71,0,1,1,0,"NULL",100,100,"NULL","NULL","NULL","NULL","NULL","NULL","NULL","NULL","NULL","NULL","NULL","NULL","Heat pump water heater","SN","Serial Number","F","Alphanumeric",64,"ED","NULL","NULL","F","NULL","NULL","NULL","NULL","NULL","F","NULL","NULL","NULL","NULL","NULL","F","NULL","NULL","NULL","NULL","NULL","F","NULL","NULL","NULL","NULL","NULL","F","NULL","NULL","NULL","NULL","NULL","F","NULL","NULL","NULL","NULL","NULL","F","NULL","NULL","NULL","NULL","NULL","F","NULL","NULL","NULL","NULL","NULL","F","NULL","NULL","NULL","NULL","NULL","F","NULL","NULL","NULL","NULL","NULL","F","NULL","NULL","NULL","NULL","NULL","F","NULL","NULL","NULL","NULL","NULL","F","NULL","NULL","NULL","NULL","NULL","F","NULL","NULL","NULL","NULL","NULL","F","NULL","NULL","NULL","NULL","NULL","F","NULL","NULL","NULL",45294.118139317128,45294.118139317128]
[18001,"Yes","Prescriptive","HPREPHZ23","DHP - Replacement or new HZ2 or HZ3","Heat pump","HVAC","ELE","HEAT",819,255,2,4615,"OR","NBE","New Buildings","2024-01-01","2025-12-31","Tons",0,0,461.07,0,0,0,"Small Office Heating","None - gas",0,300,0,15,0,402,0,0,0,1,1,0,"NULL",100,100,"NULL","NULL","NULL","NULL","NULL","NULL","NULL","NULL","NULL","NULL","NULL","NULL","Heat pump","HPTYPE","Heat Pump Type","T","Alphanumeric",64,"CB","HSPF","HSPF","F","Alphanumeric",64,"ED","SEER2","SEER 2","F","Alphanumeric",20,"ED","SEER","SEER","F","Decimal",20,"ED","HSPF2","HSPF 2","F","Alphanumeric",20,"ED","NULL","NULL","F","NULL","NULL","NULL","NULL","NULL","F","NULL","NULL","NULL","NULL","NULL","F","NULL","NULL","NULL","NULL","NULL","F","NULL","NULL","NULL","NULL","NULL","F","NULL","NULL","NULL","NULL","NULL","F","NULL","NULL","NULL","NULL","NULL","F","NULL","NULL","NULL","NULL","NULL","F","NULL","NULL","NULL","NULL","NULL","F","NULL","NULL","NULL","NULL","NULL","F","NULL","NULL","NULL","NULL","NULL","F","NULL","NULL","NULL","NULL","NULL","F","NULL","NULL","NULL",45253.110922256943,45253.110922256943]
[18002,"Yes","Prescriptive","HPREPHZ1","DHP - Replacement or new - HZ_all CZs","Heat pump","HVAC","ELE","HEAT",819,255,2,4614,"OR","NBE","New Buildings","2024-01-01","2025-12-31","Tons",0,0,410.61,0,0,0,"Small Office Heating","None - gas",0,300,0,15,0,402,0,0,0,1,1,0,"NULL",100,100,"NULL","NULL","NULL","NULL","NULL","NULL","NULL","NULL","NULL","NULL","NULL","NULL","Heat pump","HPTYPE","Heat Pump Type","T","Alphanumeric",64,"CB","HSPF","HSPF","F","Alphanumeric",64,"ED","SEER2","SEER 2","F","Alphanumeric",20,"ED","SEER","SEER","F","Decimal",20,"ED","HSPF2","HSPF 2","F","Alphanumeric",20,"ED","NULL","NULL","F","NULL","NULL","NULL","NULL","NULL","F","NULL","NULL","NULL","NULL","NULL","F","NULL","NULL","NULL","NULL","NULL","F","NULL","NULL","NULL","NULL","NULL","F","NULL","NULL","NULL","NULL","NULL","F","NULL","NULL","NULL","NULL","NULL","F","NULL","NULL","NULL","NULL","NULL","F","NULL","NULL","NULL","NULL","NULL","F","NULL","NULL","NULL","NULL","NULL","F","NULL","NULL","NULL","NULL","NULL","F","NULL","NULL","NULL","NULL","NULL","F","NULL","NULL","NULL",45253.110922256943,45253.110922256943]
[13853,"Yes","Prescriptive","BFSS5","Bath Fan - Continuous single speed, <10 cfm/W","Ventilation","HVAC","ELE","N/A",719,269,1,3686,"OR","NBE","New Buildings","2022-01-01","2024-12-31","Units",0,0,68.83,0,0,0,"Res Other","None - gas",0,15,0,19,0,38.630000000000003,0,0,0,1,1,0,"NULL",100,100,"NULL","NULL","NULL","NULL","NULL","NULL","NULL","NULL","NULL","NULL","NULL","NULL","Ventilation","CFM","Rate of flow (CFM)","T","Alphanumeric",64,"ED","CFMPERWATT","CFM per Watt","T","Alphanumeric",64,"ED","NULL","NULL","F","NULL","NULL","NULL","NULL","NULL","F","NULL","NULL","NULL","NULL","NULL","F","NULL","NULL","NULL","NULL","NULL","F","NULL","NULL","NULL","NULL","NULL","F","NULL","NULL","NULL","NULL","NULL","F","NULL","NULL","NULL","NULL","NULL","F","NULL","NULL","NULL","NULL","NULL","F","NULL","NULL","NULL","NULL","NULL","F","NULL","NULL","NULL","NULL","NULL","F","NULL","NULL","NULL","NULL","NULL","F","NULL","NULL","NULL","NULL","NULL","F","NULL","NULL","NULL","NULL","NULL","F","NULL","NULL","NULL","NULL","NULL","F","NULL","NULL","NULL","NULL","NULL","F","NULL","NULL","NULL",44952.607310150466,44952.607310150466]
[13854,"Yes","Prescriptive","BFSS10","Bath Fan - Continuous single speed, >=10 cfm/W, <15 cfm/W","Ventilation","HVAC","ELE","N/A",719,269,1,3687,"OR","NBE","New Buildings","2022-01-01","2024-12-31","Units",0,0,112.63,0,0,0,"Res Other","None - gas",0,25,0,19,0,46,0,0,0,1,1,0,"NULL",100,100,"NULL","NULL","NULL","NULL","NULL","NULL","NULL","NULL","NULL","NULL","NULL","NULL","Ventilation","CFM","Rate of flow (CFM)","T","Alphanumeric",64,"ED","CFMPERWATT","CFM per Watt","T","Alphanumeric",64,"ED","NULL","NULL","F","NULL","NULL","NULL","NULL","NULL","F","NULL","NULL","NULL","NULL","NULL","F","NULL","NULL","NULL","NULL","NULL","F","NULL","NULL","NULL","NULL","NULL","F","NULL","NULL","NULL","NULL","NULL","F","NULL","NULL","NULL","NULL","NULL","F","NULL","NULL","NULL","NULL","NULL","F","NULL","NULL","NULL","NULL","NULL","F","NULL","NULL","NULL","NULL","NULL","F","NULL","NULL","NULL","NULL","NULL","F","NULL","NULL","NULL","NULL","NULL","F","NULL","NULL","NULL","NULL","NULL","F","NULL","NULL","NULL","NULL","NULL","F","NULL","NULL","NULL","NULL","NULL","F","NULL","NULL","NULL",44952.607310150466,44952.607310150466]
[13855,"Yes","Prescriptive","BFSS15","Bath Fan - Continuous single speed, >=15 cfm/W","Ventilation","HVAC","ELE","N/A",719,269,1,3688,"OR","NBE","New Buildings","2022-01-01","2024-12-31","Units",0,0,127.23,0,0,0,"Res Other","None - gas",0,30,0,19,0,59,0,0,0,1,1,0,"NULL",100,100,"NULL","NULL","NULL","NULL","NULL","NULL","NULL","NULL","NULL","NULL","NULL","NULL","Ventilation","CFM","Rate of flow (CFM)","T","Alphanumeric",64,"ED","CFMPERWATT","CFM per Watt","T","Alphanumeric",64,"ED","NULL","NULL","F","NULL","NULL","NULL","NULL","NULL","F","NULL","NULL","NULL","NULL","NULL","F","NULL","NULL","NULL","NULL","NULL","F","NULL","NULL","NULL","NULL","NULL","F","NULL","NULL","NULL","NULL","NULL","F","NULL","NULL","NULL","NULL","NULL","F","NULL","NULL","NULL","NULL","NULL","F","NULL","NULL","NULL","NULL","NULL","F","NULL","NULL","NULL","NULL","NULL","F","NULL","NULL","NULL","NULL","NULL","F","NULL","NULL","NULL","NULL","NULL","F","NULL","NULL","NULL","NULL","NULL","F","NULL","NULL","NULL","NULL","NULL","F","NULL","NULL","NULL","NULL","NULL","F","NULL","NULL","NULL",44952.607310150466,44952.607310150466]
[13856,"Yes","Prescriptive","BFTSSM5","Bath Fan - Continuous two-speed, <90 cfm, >=5 cfm/W, <10 cfm/W","Ventilation","HVAC","ELE","N/A",719,269,1,3689,"OR","NBE","New Buildings","2022-01-01","2024-12-31","Units",0,0,73.3,0,0,0,"Res Other","None - gas",0,15,0,19,0,42,0,0,0,1,1,0,"NULL",100,100,"NULL","NULL","NULL","NULL","NULL","NULL","NULL","NULL","NULL","NULL","NULL","NULL","Ventilation","CFM","Rate of flow (CFM)","T","Alphanumeric",64,"ED","CFMPERWATT","CFM per Watt","T","Alphanumeric",64,"ED","NULL","NULL","F","NULL","NULL","NULL","NULL","NULL","F","NULL","NULL","NULL","NULL","NULL","F","NULL","NULL","NULL","NULL","NULL","F","NULL","NULL","NULL","NULL","NULL","F","NULL","NULL","NULL","NULL","NULL","F","NULL","NULL","NULL","NULL","NULL","F","NULL","NULL","NULL","NULL","NULL","F","NULL","NULL","NULL","NULL","NULL","F","NULL","NULL","NULL","NULL","NULL","F","NULL","NULL","NULL","NULL","NULL","F","NULL","NULL","NULL","NULL","NULL","F","NULL","NULL","NULL","NULL","NULL","F","NULL","NULL","NULL","NULL","NULL","F","NULL","NULL","NULL","NULL","NULL","F","NULL","NULL","NULL",44952.607310150466,44952.607310150466]
[13857,"Yes","Prescriptive","BFTSSM10","Bath Fan - Continuous two-speed, <90 cfm, >=10 cfm/W, <15 cfm/W","Ventilation","HVAC","ELE","N/A",719,269,1,3690,"OR","NBE","New Buildings","2022-01-01","2024-12-31","Units",0,0,119.95,0,0,0,"Res Other","None - gas",0,25,0,19,0,58,0,0,0,1,1,0,"NULL",100,100,"NULL","NULL","NULL","NULL","NULL","NULL","NULL","NULL","NULL","NULL","NULL","NULL","Ventilation","CFM","Rate of flow (CFM)","T","Alphanumeric",64,"ED","CFMPERWATT","CFM per Watt","T","Alphanumeric",64,"ED","NULL","NULL","F","NULL","NULL","NULL","NULL","NULL","F","NULL","NULL","NULL","NULL","NULL","F","NULL","NULL","NULL","NULL","NULL","F","NULL","NULL","NULL","NULL","NULL","F","NULL","NULL","NULL","NULL","NULL","F","NULL","NULL","NULL","NULL","NULL","F","NULL","NULL","NULL","NULL","NULL","F","NULL","NULL","NULL","NULL","NULL","F","NULL","NULL","NULL","NULL","NULL","F","NULL","NULL","NULL","NULL","NULL","F","NULL","NULL","NULL","NULL","NULL","F","NULL","NULL","NULL","NULL","NULL","F","NULL","NULL","NULL","NULL","NULL","F","NULL","NULL","NULL","NULL","NULL","F","NULL","NULL","NULL",44952.607310150466,44952.607310150466]
[13858,"Yes","Prescriptive","BFTSSM15","Bath Fan - Continuous two-speed, <90 cfm,  >=15 cfm/W","Ventilation","HVAC","ELE","N/A",719,269,1,3691,"OR","NBE","New Buildings","2022-01-01","2024-12-31","Units",0,0,135.5,0,0,0,"Res Other","None - gas",0,30,0,19,0,64.64,0,0,0,1,1,0,"NULL",100,100,"NULL","NULL","NULL","NULL","NULL","NULL","NULL","NULL","NULL","NULL","NULL","NULL","Ventilation","CFM","Rate of flow (CFM)","T","Alphanumeric",64,"ED","CFMPERWATT","CFM per Watt","T","Alphanumeric",64,"ED","NULL","NULL","F","NULL","NULL","NULL","NULL","NULL","F","NULL","NULL","NULL","NULL","NULL","F","NULL","NULL","NULL","NULL","NULL","F","NULL","NULL","NULL","NULL","NULL","F","NULL","NULL","NULL","NULL","NULL","F","NULL","NULL","NULL","NULL","NULL","F","NULL","NULL","NULL","NULL","NULL","F","NULL","NULL","NULL","NULL","NULL","F","NULL","NULL","NULL","NULL","NULL","F","NULL","NULL","NULL","NULL","NULL","F","NULL","NULL","NULL","NULL","NULL","F","NULL","NULL","NULL","NULL","NULL","F","NULL","NULL","NULL","NULL","NULL","F","NULL","NULL","NULL","NULL","NULL","F","NULL","NULL","NULL",44952.607310150466,44952.607310150466]
[13859,"Yes","Prescriptive","BFTSLG5","Bath Fan - two-speed, >90 cfm, >=5 cfm/W, <10 cfm/W","Ventilation","HVAC","ELE","N/A",719,269,1,3692,"OR","NBE","New Buildings","2022-01-01","2024-12-31","Units",0,0,70.319999999999993,0,0,0,"Res Other","None - gas",0,15,0,19,0,31.86,0,0,0,1,1,0,"NULL",100,100,"NULL","NULL","NULL","NULL","NULL","NULL","NULL","NULL","NULL","NULL","NULL","NULL","Ventilation","CFM","Rate of flow (CFM)","T","Alphanumeric",64,"ED","CFMPERWATT","CFM per Watt","T","Alphanumeric",64,"ED","NULL","NULL","F","NULL","NULL","NULL","NULL","NULL","F","NULL","NULL","NULL","NULL","NULL","F","NULL","NULL","NULL","NULL","NULL","F","NULL","NULL","NULL","NULL","NULL","F","NULL","NULL","NULL","NULL","NULL","F","NULL","NULL","NULL","NULL","NULL","F","NULL","NULL","NULL","NULL","NULL","F","NULL","NULL","NULL","NULL","NULL","F","NULL","NULL","NULL","NULL","NULL","F","NULL","NULL","NULL","NULL","NULL","F","NULL","NULL","NULL","NULL","NULL","F","NULL","NULL","NULL","NULL","NULL","F","NULL","NULL","NULL","NULL","NULL","F","NULL","NULL","NULL","NULL","NULL","F","NULL","NULL","NULL",44952.607310150466,44952.607310150466]
[13860,"Yes","Prescriptive","BFTSLG10","Bath Fan - two-speed, >90 cfm, >=5 cfm/W,  >=10 cfm/W, <15 cfm/W","Ventilation","HVAC","ELE","N/A",719,269,1,3693,"OR","NBE","New Buildings","2022-01-01","2024-12-31","Units",0,0,119.81,0,0,0,"Res Other","None - gas",0,25,0,19,0,55.86,0,0,0,1,1,0,"NULL",100,100,"NULL","NULL","NULL","NULL","NULL","NULL","NULL","NULL","NULL","NULL","NULL","NULL","Ventilation","CFM","Rate of flow (CFM)","T","Alphanumeric",64,"ED","CFMPERWATT","CFM per Watt","T","Alphanumeric",64,"ED","NULL","NULL","F","NULL","NULL","NULL","NULL","NULL","F","NULL","NULL","NULL","NULL","NULL","F","NULL","NULL","NULL","NULL","NULL","F","NULL","NULL","NULL","NULL","NULL","F","NULL","NULL","NULL","NULL","NULL","F","NULL","NULL","NULL","NULL","NULL","F","NULL","NULL","NULL","NULL","NULL","F","NULL","NULL","NULL","NULL","NULL","F","NULL","NULL","NULL","NULL","NULL","F","NULL","NULL","NULL","NULL","NULL","F","NULL","NULL","NULL","NULL","NULL","F","NULL","NULL","NULL","NULL","NULL","F","NULL","NULL","NULL","NULL","NULL","F","NULL","NULL","NULL","NULL","NULL","F","NULL","NULL","NULL",44952.607310150466,44952.607310150466]
[13861,"Yes","Prescriptive","BFTSLG15","Bath Fan - two-speed, >90 cfm, >=5 cfm/W,  >=15 cfm/W","Ventilation","HVAC","ELE","N/A",719,269,1,3694,"OR","NBE","New Buildings","2022-01-01","2024-12-31","Units",0,0,136.31,0,0,0,"Res Other","None - gas",0,30,0,19,0,69.12,0,0,0,1,1,0,"NULL",100,100,"NULL","NULL","NULL","NULL","NULL","NULL","NULL","NULL","NULL","NULL","NULL","NULL","Ventilation","CFM","Rate of flow (CFM)","T","Alphanumeric",64,"ED","CFMPERWATT","CFM per Watt","T","Alphanumeric",64,"ED","NULL","NULL","F","NULL","NULL","NULL","NULL","NULL","F","NULL","NULL","NULL","NULL","NULL","F","NULL","NULL","NULL","NULL","NULL","F","NULL","NULL","NULL","NULL","NULL","F","NULL","NULL","NULL","NULL","NULL","F","NULL","NULL","NULL","NULL","NULL","F","NULL","NULL","NULL","NULL","NULL","F","NULL","NULL","NULL","NULL","NULL","F","NULL","NULL","NULL","NULL","NULL","F","NULL","NULL","NULL","NULL","NULL","F","NULL","NULL","NULL","NULL","NULL","F","NULL","NULL","NULL","NULL","NULL","F","NULL","NULL","NULL","NULL","NULL","F","NULL","NULL","NULL","NULL","NULL","F","NULL","NULL","NULL",44952.607310150466,44952.607310150466]
[17835,"Yes","Prescriptive","GASFURNCONNGO","Commercial Condensing Gas Furnace 95%+ New Site Gas Only","Gas furnace","HVAC","GAS","HEAT",720,270,1,3698,"OR","NBE","New Buildings","2024-01-01","2024-12-31","kBtu/hr",0,0,0,0.51,0.06,0,"Small Office Ventilation","Com Heating",0,8,0,20,0,8.44,0,0,0,1,1,0,100,"NULL","NULL",100,100,100,100,"NULL","NULL","NULL","NULL","NULL","NULL",100,100,"Gas furnace","AFUE","AFUE","T","DECIMAL",2,"ED","ECM","ECM?","T","Alphanumeric",64,"CB","MANUFACTURER","Manufacturer Name","T","Alphanumeric",64,"ED","MODEL","Model","T","ALPHANUMERIC",64,"ED","NULL","NULL","F","NULL","NULL","NULL","NULL","NULL","F","NULL","NULL","NULL","NULL","NULL","F","NULL","NULL","NULL","NULL","NULL","F","NULL","NULL","NULL","NULL","NULL","F","NULL","NULL","NULL","NULL","NULL","F","NULL","NULL","NULL","NULL","NULL","F","NULL","NULL","NULL","NULL","NULL","F","NULL","NULL","NULL","NULL","NULL","F","NULL","NULL","NULL","NULL","NULL","F","NULL","NULL","NULL","NULL","NULL","F","NULL","NULL","NULL","NULL","NULL","F","NULL","NULL","NULL","NULL","NULL","F","NULL","NULL","NULL",45245.124047187499,45245.124047187499]
[17849,"Yes","Prescriptive","GASFURNCONN","Commercial Condensing Gas Furnace 95%+ New Site","Gas furnace","HVAC","BOTH","N/A",720,270,1,3696,"OR","NBE","New Buildings","2024-01-01","2024-12-31","kBtu/hr",0,0,0.73,0.51,0,0,"Small Office Ventilation","Com Heating",0,8.25,0,20,0,8.44,0,0,0,1,1,0,91,9,9,91,91,91,91,"NULL","NULL","NULL","NULL","NULL","NULL",91,"NULL","Gas furnace","AFUE","AFUE","T","DECIMAL",2,"ED","ECM","ECM?","T","Alphanumeric",64,"CB","MANUFACTURER","Manufacturer Name","T","Alphanumeric",64,"ED","MODEL","Model","T","ALPHANUMERIC",64,"ED","NULL","NULL","F","NULL","NULL","NULL","NULL","NULL","F","NULL","NULL","NULL","NULL","NULL","F","NULL","NULL","NULL","NULL","NULL","F","NULL","NULL","NULL","NULL","NULL","F","NULL","NULL","NULL","NULL","NULL","F","NULL","NULL","NULL","NULL","NULL","F","NULL","NULL","NULL","NULL","NULL","F","NULL","NULL","NULL","NULL","NULL","F","NULL","NULL","NULL","NULL","NULL","F","NULL","NULL","NULL","NULL","NULL","F","NULL","NULL","NULL","NULL","NULL","F","NULL","NULL","NULL","NULL","NULL","F","NULL","NULL","NULL",45245.124047187499,45245.124047187499]
[13445,"Yes","Prescriptive","VFDGARMFSM2019","VFD - Parking Garage MF <8,000 CFM","Ventilation","HVAC","ELE","N/A",723,271,1,3703,"OR","NBE","New Buildings","2022-01-01","2024-12-31","CFM",0,0,2.4500000000000002,0,0,0,"Other Exterior Lights","None - gas",0,0.5,0,15,0,0.7,0,0,0,1,1,0,"NULL",100,100,"NULL","NULL","NULL","NULL","NULL","NULL","NULL","NULL","NULL","NULL","NULL","NULL","Ventilation","CFM","Rate of flow (CFM)","T","Alphanumeric",64,"ED","NULL","NULL","F","NULL","NULL","NULL","NULL","NULL","F","NULL","NULL","NULL","NULL","NULL","F","NULL","NULL","NULL","NULL","NULL","F","NULL","NULL","NULL","NULL","NULL","F","NULL","NULL","NULL","NULL","NULL","F","NULL","NULL","NULL","NULL","NULL","F","NULL","NULL","NULL","NULL","NULL","F","NULL","NULL","NULL","NULL","NULL","F","NULL","NULL","NULL","NULL","NULL","F","NULL","NULL","NULL","NULL","NULL","F","NULL","NULL","NULL","NULL","NULL","F","NULL","NULL","NULL","NULL","NULL","F","NULL","NULL","NULL","NULL","NULL","F","NULL","NULL","NULL","NULL","NULL","F","NULL","NULL","NULL","NULL","NULL","F","NULL","NULL","NULL",44952.607310150466,44952.607310150466]
[13446,"Yes","Prescriptive","VFDGARMFLG2019","VFD - Parking Garage MF >=8,000 CFM","Ventilation","HVAC","ELE","N/A",723,271,1,3704,"OR","NBE","New Buildings","2022-01-01","2024-12-31","CFM",0,0,0.5,0,0,0,"Other Exterior Lights","None - gas",0,0.1,0,15,0,0.26,0,0,0,1,1,0,"NULL",100,100,"NULL","NULL","NULL","NULL","NULL","NULL","NULL","NULL","NULL","NULL","NULL","NULL","Ventilation","CFM","Rate of flow (CFM)","T","Alphanumeric",64,"ED","NULL","NULL","F","NULL","NULL","NULL","NULL","NULL","F","NULL","NULL","NULL","NULL","NULL","F","NULL","NULL","NULL","NULL","NULL","F","NULL","NULL","NULL","NULL","NULL","F","NULL","NULL","NULL","NULL","NULL","F","NULL","NULL","NULL","NULL","NULL","F","NULL","NULL","NULL","NULL","NULL","F","NULL","NULL","NULL","NULL","NULL","F","NULL","NULL","NULL","NULL","NULL","F","NULL","NULL","NULL","NULL","NULL","F","NULL","NULL","NULL","NULL","NULL","F","NULL","NULL","NULL","NULL","NULL","F","NULL","NULL","NULL","NULL","NULL","F","NULL","NULL","NULL","NULL","NULL","F","NULL","NULL","NULL","NULL","NULL","F","NULL","NULL","NULL",44952.607310150466,44952.607310150466]
[13447,"Yes","Prescriptive","VFDGARMFSM","VFD - Parking Garage MF < 30,000 sq ft","Ventilation","HVAC","ELE","N/A",723,271,1,3705,"OR","NBE","New Buildings","2022-01-01","2024-12-31","CFM",0,0,2.4500000000000002,0,0,0,"Other Exterior Lights","None - gas",0,0.5,0,15,0,0.7,0,0,0,1,1,0,"NULL",100,100,"NULL","NULL","NULL","NULL","NULL","NULL","NULL","NULL","NULL","NULL","NULL","NULL","Ventilation","CFM","Rate of flow (CFM)","T","Alphanumeric",64,"ED","NULL","NULL","F","NULL","NULL","NULL","NULL","NULL","F","NULL","NULL","NULL","NULL","NULL","F","NULL","NULL","NULL","NULL","NULL","F","NULL","NULL","NULL","NULL","NULL","F","NULL","NULL","NULL","NULL","NULL","F","NULL","NULL","NULL","NULL","NULL","F","NULL","NULL","NULL","NULL","NULL","F","NULL","NULL","NULL","NULL","NULL","F","NULL","NULL","NULL","NULL","NULL","F","NULL","NULL","NULL","NULL","NULL","F","NULL","NULL","NULL","NULL","NULL","F","NULL","NULL","NULL","NULL","NULL","F","NULL","NULL","NULL","NULL","NULL","F","NULL","NULL","NULL","NULL","NULL","F","NULL","NULL","NULL","NULL","NULL","F","NULL","NULL","NULL",44952.607310150466,44952.607310150466]
[13448,"Yes","Prescriptive","VFDGARMFLG","VFD - Parking Garage MF >= 30,000 sq ft","Ventilation","HVAC","ELE","N/A",723,271,1,3706,"OR","NBE","New Buildings","2022-01-01","2024-12-31","CFM",0,0,0.5,0,0,0,"Other Exterior Lights","None - gas",0,0.1,0,15,0,0.26,0,0,0,1,1,0,"NULL",100,100,"NULL","NULL","NULL","NULL","NULL","NULL","NULL","NULL","NULL","NULL","NULL","NULL","Ventilation","CFM","Rate of flow (CFM)","T","Alphanumeric",64,"ED","NULL","NULL","F","NULL","NULL","NULL","NULL","NULL","F","NULL","NULL","NULL","NULL","NULL","F","NULL","NULL","NULL","NULL","NULL","F","NULL","NULL","NULL","NULL","NULL","F","NULL","NULL","NULL","NULL","NULL","F","NULL","NULL","NULL","NULL","NULL","F","NULL","NULL","NULL","NULL","NULL","F","NULL","NULL","NULL","NULL","NULL","F","NULL","NULL","NULL","NULL","NULL","F","NULL","NULL","NULL","NULL","NULL","F","NULL","NULL","NULL","NULL","NULL","F","NULL","NULL","NULL","NULL","NULL","F","NULL","NULL","NULL","NULL","NULL","F","NULL","NULL","NULL","NULL","NULL","F","NULL","NULL","NULL","NULL","NULL","F","NULL","NULL","NULL",44952.607310150466,44952.607310150466]
[13449,"Yes","Prescriptive","VFDGARNMFSM","VFD - Parking Garage < 30,000 sq ft","Ventilation","HVAC","ELE","N/A",723,271,1,3707,"OR","NBE","New Buildings","2022-01-01","2024-12-31","CFM",0,0,2.04,0,0,0,"Other Exterior Lights","None - gas",0,0.4,0,15,0,0.7,0,0,0,1,1,0,"NULL",100,100,"NULL","NULL","NULL","NULL","NULL","NULL","NULL","NULL","NULL","NULL","NULL","NULL","Ventilation","CFM","Rate of flow (CFM)","T","Alphanumeric",64,"ED","NULL","NULL","F","NULL","NULL","NULL","NULL","NULL","F","NULL","NULL","NULL","NULL","NULL","F","NULL","NULL","NULL","NULL","NULL","F","NULL","NULL","NULL","NULL","NULL","F","NULL","NULL","NULL","NULL","NULL","F","NULL","NULL","NULL","NULL","NULL","F","NULL","NULL","NULL","NULL","NULL","F","NULL","NULL","NULL","NULL","NULL","F","NULL","NULL","NULL","NULL","NULL","F","NULL","NULL","NULL","NULL","NULL","F","NULL","NULL","NULL","NULL","NULL","F","NULL","NULL","NULL","NULL","NULL","F","NULL","NULL","NULL","NULL","NULL","F","NULL","NULL","NULL","NULL","NULL","F","NULL","NULL","NULL","NULL","NULL","F","NULL","NULL","NULL",44952.607310150466,44952.607310150466]
[13450,"Yes","Prescriptive","VFDGARNMFLG","VFD - Parking Garage >= 30,000 sq ft","Ventilation","HVAC","ELE","N/A",723,271,1,3708,"OR","NBE","New Buildings","2022-01-01","2024-12-31","CFM",0,0,0.42,0,0,0,"Other Exterior Lights","None - gas",0,0.09,0,15,0,0.26,0,0,0,1,1,0,"NULL",100,100,"NULL","NULL","NULL","NULL","NULL","NULL","NULL","NULL","NULL","NULL","NULL","NULL","Ventilation","CFM","Rate of flow (CFM)","T","Alphanumeric",64,"ED","NULL","NULL","F","NULL","NULL","NULL","NULL","NULL","F","NULL","NULL","NULL","NULL","NULL","F","NULL","NULL","NULL","NULL","NULL","F","NULL","NULL","NULL","NULL","NULL","F","NULL","NULL","NULL","NULL","NULL","F","NULL","NULL","NULL","NULL","NULL","F","NULL","NULL","NULL","NULL","NULL","F","NULL","NULL","NULL","NULL","NULL","F","NULL","NULL","NULL","NULL","NULL","F","NULL","NULL","NULL","NULL","NULL","F","NULL","NULL","NULL","NULL","NULL","F","NULL","NULL","NULL","NULL","NULL","F","NULL","NULL","NULL","NULL","NULL","F","NULL","NULL","NULL","NULL","NULL","F","NULL","NULL","NULL","NULL","NULL","F","NULL","NULL","NULL",44952.607310150466,44952.607310150466]
[15287,"Yes","Prescriptive","CPUMPVSDHEAT5HP","Commercial Pump VSD_Heating_New Pump_5 HP (4.51 to 6.00 HP)","Pump","Pumps","ELE","N/A",864,284,2,5105,"OR","NBE","New Buildings","2023-01-01","2025-12-31","Units",0,0,1826.51,0,0,0,"Other Heating","None - gas",0,500,0,15,0,592.58000000000004,0,0,0,1,1,0,"NULL",100,100,"NULL","NULL","NULL","NULL","NULL","NULL","NULL","NULL","NULL","NULL","NULL","NULL","No Attributes ","NULL","NULL","F","NULL","NULL","NULL","NULL","NULL","F","NULL","NULL","NULL","NULL","NULL","F","NULL","NULL","NULL","NULL","NULL","F","NULL","NULL","NULL","NULL","NULL","F","NULL","NULL","NULL","NULL","NULL","F","NULL","NULL","NULL","NULL","NULL","F","NULL","NULL","NULL","NULL","NULL","F","NULL","NULL","NULL","NULL","NULL","F","NULL","NULL","NULL","NULL","NULL","F","NULL","NULL","NULL","NULL","NULL","F","NULL","NULL","NULL","NULL","NULL","F","NULL","NULL","NULL","NULL","NULL","F","NULL","NULL","NULL","NULL","NULL","F","NULL","NULL","NULL","NULL","NULL","F","NULL","NULL","NULL","NULL","NULL","F","NULL","NULL","NULL","NULL","NULL","F","NULL","NULL","NULL",44952.607310150466,44952.607310150466]
[15288,"Yes","Prescriptive","CPUMPVSDCOOL4HP","Comm Pump VSD_Cooling_New Pump_4 HP (3.51 to 4.50 HP)","Pump","Pumps","ELE","N/A",864,284,2,5121,"OR","NBE","New Buildings","2023-01-01","2025-12-31","Units",0,0,1438.37,0,0,0,"Other Cooling","None - gas",0,450,0,15,0,532.9,0,0,0,1,1,0,"NULL",100,100,"NULL","NULL","NULL","NULL","NULL","NULL","NULL","NULL","NULL","NULL","NULL","NULL","No Attributes ","NULL","NULL","F","NULL","NULL","NULL","NULL","NULL","F","NULL","NULL","NULL","NULL","NULL","F","NULL","NULL","NULL","NULL","NULL","F","NULL","NULL","NULL","NULL","NULL","F","NULL","NULL","NULL","NULL","NULL","F","NULL","NULL","NULL","NULL","NULL","F","NULL","NULL","NULL","NULL","NULL","F","NULL","NULL","NULL","NULL","NULL","F","NULL","NULL","NULL","NULL","NULL","F","NULL","NULL","NULL","NULL","NULL","F","NULL","NULL","NULL","NULL","NULL","F","NULL","NULL","NULL","NULL","NULL","F","NULL","NULL","NULL","NULL","NULL","F","NULL","NULL","NULL","NULL","NULL","F","NULL","NULL","NULL","NULL","NULL","F","NULL","NULL","NULL","NULL","NULL","F","NULL","NULL","NULL",44952.607310150466,44952.607310150466]
[15289,"Yes","Prescriptive","CPUMPVSDCOOL3HP","Comm Pump VSD_Cooling_New Pump_3 HP (2.51 to 3.50 HP)","Pump","Pumps","ELE","N/A",864,284,2,5120,"OR","NBE","New Buildings","2023-01-01","2025-12-31","Units",0,0,1078.78,0,0,0,"Other Cooling","None - gas",0,350,0,15,0,464.75,0,0,0,1,1,0,"NULL",100,100,"NULL","NULL","NULL","NULL","NULL","NULL","NULL","NULL","NULL","NULL","NULL","NULL","No Attributes ","NULL","NULL","F","NULL","NULL","NULL","NULL","NULL","F","NULL","NULL","NULL","NULL","NULL","F","NULL","NULL","NULL","NULL","NULL","F","NULL","NULL","NULL","NULL","NULL","F","NULL","NULL","NULL","NULL","NULL","F","NULL","NULL","NULL","NULL","NULL","F","NULL","NULL","NULL","NULL","NULL","F","NULL","NULL","NULL","NULL","NULL","F","NULL","NULL","NULL","NULL","NULL","F","NULL","NULL","NULL","NULL","NULL","F","NULL","NULL","NULL","NULL","NULL","F","NULL","NULL","NULL","NULL","NULL","F","NULL","NULL","NULL","NULL","NULL","F","NULL","NULL","NULL","NULL","NULL","F","NULL","NULL","NULL","NULL","NULL","F","NULL","NULL","NULL","NULL","NULL","F","NULL","NULL","NULL",44952.607310150466,44952.607310150466]
[15290,"Yes","Prescriptive","CPUMPVSDPB7P5HP","Comm Pump VSD_Pressure Boost_New Pump_7.5 HP (6.01 to 8.00 HP)","Pump","Pumps","ELE","N/A",864,284,2,5112,"OR","NBE","New Buildings","2023-01-01","2025-12-31","Units",0,0,2088.5500000000002,0,0,0,"3-Shift Industrial","None - gas",0,600,0,15,0,718.63,0,0,0,1,1,0,"NULL",100,100,"NULL","NULL","NULL","NULL","NULL","NULL","NULL","NULL","NULL","NULL","NULL","NULL","No Attributes ","NULL","NULL","F","NULL","NULL","NULL","NULL","NULL","F","NULL","NULL","NULL","NULL","NULL","F","NULL","NULL","NULL","NULL","NULL","F","NULL","NULL","NULL","NULL","NULL","F","NULL","NULL","NULL","NULL","NULL","F","NULL","NULL","NULL","NULL","NULL","F","NULL","NULL","NULL","NULL","NULL","F","NULL","NULL","NULL","NULL","NULL","F","NULL","NULL","NULL","NULL","NULL","F","NULL","NULL","NULL","NULL","NULL","F","NULL","NULL","NULL","NULL","NULL","F","NULL","NULL","NULL","NULL","NULL","F","NULL","NULL","NULL","NULL","NULL","F","NULL","NULL","NULL","NULL","NULL","F","NULL","NULL","NULL","NULL","NULL","F","NULL","NULL","NULL","NULL","NULL","F","NULL","NULL","NULL",44952.607310150466,44952.607310150466]
[15291,"Yes","Prescriptive","CPUMPVSDPB4HP","Comm Pump VSD_Pressure Boost_New Pump_4 HP (3.51 to 4.50 HP)","Pump","Pumps","ELE","N/A",864,284,2,5110,"OR","NBE","New Buildings","2023-01-01","2025-12-31","Units",0,0,1113.8900000000001,0,0,0,"3-Shift Industrial","None - gas",0,450,0,15,0,532.9,0,0,0,1,1,0,"NULL",100,100,"NULL","NULL","NULL","NULL","NULL","NULL","NULL","NULL","NULL","NULL","NULL","NULL","No Attributes ","NULL","NULL","F","NULL","NULL","NULL","NULL","NULL","F","NULL","NULL","NULL","NULL","NULL","F","NULL","NULL","NULL","NULL","NULL","F","NULL","NULL","NULL","NULL","NULL","F","NULL","NULL","NULL","NULL","NULL","F","NULL","NULL","NULL","NULL","NULL","F","NULL","NULL","NULL","NULL","NULL","F","NULL","NULL","NULL","NULL","NULL","F","NULL","NULL","NULL","NULL","NULL","F","NULL","NULL","NULL","NULL","NULL","F","NULL","NULL","NULL","NULL","NULL","F","NULL","NULL","NULL","NULL","NULL","F","NULL","NULL","NULL","NULL","NULL","F","NULL","NULL","NULL","NULL","NULL","F","NULL","NULL","NULL","NULL","NULL","F","NULL","NULL","NULL","NULL","NULL","F","NULL","NULL","NULL",44952.607310150466,44952.607310150466]
[15292,"Yes","Prescriptive","CPUMPVSDHEAT0P75","Commercial Pump VSD_Heating_New Pump_0.75 HP (0.50 to 0.75 HP)","Pump","Pumps","ELE","N/A",864,284,2,5099,"OR","NBE","New Buildings","2023-01-01","2025-12-31","Units",0,0,273.98,0,0,0,"Other Heating","None - gas",0,150,0,15,0,240.34,0,0,0,1,1,0,"NULL",100,100,"NULL","NULL","NULL","NULL","NULL","NULL","NULL","NULL","NULL","NULL","NULL","NULL","No Attributes ","NULL","NULL","F","NULL","NULL","NULL","NULL","NULL","F","NULL","NULL","NULL","NULL","NULL","F","NULL","NULL","NULL","NULL","NULL","F","NULL","NULL","NULL","NULL","NULL","F","NULL","NULL","NULL","NULL","NULL","F","NULL","NULL","NULL","NULL","NULL","F","NULL","NULL","NULL","NULL","NULL","F","NULL","NULL","NULL","NULL","NULL","F","NULL","NULL","NULL","NULL","NULL","F","NULL","NULL","NULL","NULL","NULL","F","NULL","NULL","NULL","NULL","NULL","F","NULL","NULL","NULL","NULL","NULL","F","NULL","NULL","NULL","NULL","NULL","F","NULL","NULL","NULL","NULL","NULL","F","NULL","NULL","NULL","NULL","NULL","F","NULL","NULL","NULL","NULL","NULL","F","NULL","NULL","NULL",44952.607310150466,44952.607310150466]
[15293,"Yes","Prescriptive","CPUMPVSDHEAT4HP","Commercial Pump VSD_Heating_New Pump_4 HP (3.51 to 4.50 HP)","Pump","Pumps","ELE","N/A",864,284,2,5104,"OR","NBE","New Buildings","2023-01-01","2025-12-31","Units",0,0,1461.2,0,0,0,"Other Heating","None - gas",0,450,0,15,0,532.9,0,0,0,1,1,0,"NULL",100,100,"NULL","NULL","NULL","NULL","NULL","NULL","NULL","NULL","NULL","NULL","NULL","NULL","No Attributes ","NULL","NULL","F","NULL","NULL","NULL","NULL","NULL","F","NULL","NULL","NULL","NULL","NULL","F","NULL","NULL","NULL","NULL","NULL","F","NULL","NULL","NULL","NULL","NULL","F","NULL","NULL","NULL","NULL","NULL","F","NULL","NULL","NULL","NULL","NULL","F","NULL","NULL","NULL","NULL","NULL","F","NULL","NULL","NULL","NULL","NULL","F","NULL","NULL","NULL","NULL","NULL","F","NULL","NULL","NULL","NULL","NULL","F","NULL","NULL","NULL","NULL","NULL","F","NULL","NULL","NULL","NULL","NULL","F","NULL","NULL","NULL","NULL","NULL","F","NULL","NULL","NULL","NULL","NULL","F","NULL","NULL","NULL","NULL","NULL","F","NULL","NULL","NULL","NULL","NULL","F","NULL","NULL","NULL",44952.607310150466,44952.607310150466]
[15294,"Yes","Prescriptive","CPUMPVSDCOOLT5HP","Comm Pump VSD_Cooling Tower_New Pump_5 HP (4.51 to 6.00 HP)","Pump","Pumps","ELE","N/A",864,284,2,5094,"OR","NBE","New Buildings","2023-01-01","2025-12-31","Units",0,0,898.41,0,0,0,"Other Cooling","None - gas",0,500,0,15,0,592.58000000000004,0,0,0,1,1,0,"NULL",100,100,"NULL","NULL","NULL","NULL","NULL","NULL","NULL","NULL","NULL","NULL","NULL","NULL","No Attributes ","NULL","NULL","F","NULL","NULL","NULL","NULL","NULL","F","NULL","NULL","NULL","NULL","NULL","F","NULL","NULL","NULL","NULL","NULL","F","NULL","NULL","NULL","NULL","NULL","F","NULL","NULL","NULL","NULL","NULL","F","NULL","NULL","NULL","NULL","NULL","F","NULL","NULL","NULL","NULL","NULL","F","NULL","NULL","NULL","NULL","NULL","F","NULL","NULL","NULL","NULL","NULL","F","NULL","NULL","NULL","NULL","NULL","F","NULL","NULL","NULL","NULL","NULL","F","NULL","NULL","NULL","NULL","NULL","F","NULL","NULL","NULL","NULL","NULL","F","NULL","NULL","NULL","NULL","NULL","F","NULL","NULL","NULL","NULL","NULL","F","NULL","NULL","NULL","NULL","NULL","F","NULL","NULL","NULL",44952.607310150466,44952.607310150466]
[15295,"Yes","Prescriptive","CPUMPVSDPB15HP","Comm Pump VSD_Pressure Boost_New Pump_15 HP (12.51 to 17.50 HP)","Pump","Pumps","ELE","N/A",864,284,2,5114,"OR","NBE","New Buildings","2023-01-01","2025-12-31","Units",0,0,4177.09,0,0,0,"3-Shift Industrial","None - gas",0,850,0,15,0,999.31,0,0,0,1,1,0,"NULL",100,100,"NULL","NULL","NULL","NULL","NULL","NULL","NULL","NULL","NULL","NULL","NULL","NULL","No Attributes ","NULL","NULL","F","NULL","NULL","NULL","NULL","NULL","F","NULL","NULL","NULL","NULL","NULL","F","NULL","NULL","NULL","NULL","NULL","F","NULL","NULL","NULL","NULL","NULL","F","NULL","NULL","NULL","NULL","NULL","F","NULL","NULL","NULL","NULL","NULL","F","NULL","NULL","NULL","NULL","NULL","F","NULL","NULL","NULL","NULL","NULL","F","NULL","NULL","NULL","NULL","NULL","F","NULL","NULL","NULL","NULL","NULL","F","NULL","NULL","NULL","NULL","NULL","F","NULL","NULL","NULL","NULL","NULL","F","NULL","NULL","NULL","NULL","NULL","F","NULL","NULL","NULL","NULL","NULL","F","NULL","NULL","NULL","NULL","NULL","F","NULL","NULL","NULL","NULL","NULL","F","NULL","NULL","NULL",44952.607310150466,44952.607310150466]
[15296,"Yes","Prescriptive","CPUMPVSDPB3HP","Comm Pump VSD_Pressure Boost_New Pump_3 HP (2.51 to 3.50 HP)","Pump","Pumps","ELE","N/A",864,284,2,5109,"OR","NBE","New Buildings","2023-01-01","2025-12-31","Units",0,0,835.42,0,0,0,"3-Shift Industrial","None - gas",0,350,0,15,0,464.75,0,0,0,1,1,0,"NULL",100,100,"NULL","NULL","NULL","NULL","NULL","NULL","NULL","NULL","NULL","NULL","NULL","NULL","No Attributes ","NULL","NULL","F","NULL","NULL","NULL","NULL","NULL","F","NULL","NULL","NULL","NULL","NULL","F","NULL","NULL","NULL","NULL","NULL","F","NULL","NULL","NULL","NULL","NULL","F","NULL","NULL","NULL","NULL","NULL","F","NULL","NULL","NULL","NULL","NULL","F","NULL","NULL","NULL","NULL","NULL","F","NULL","NULL","NULL","NULL","NULL","F","NULL","NULL","NULL","NULL","NULL","F","NULL","NULL","NULL","NULL","NULL","F","NULL","NULL","NULL","NULL","NULL","F","NULL","NULL","NULL","NULL","NULL","F","NULL","NULL","NULL","NULL","NULL","F","NULL","NULL","NULL","NULL","NULL","F","NULL","NULL","NULL","NULL","NULL","F","NULL","NULL","NULL","NULL","NULL","F","NULL","NULL","NULL",44952.607310150466,44952.607310150466]
[15297,"Yes","Prescriptive","CPUMPVSDPB10HP","Comm Pump VSD_Pressure Boost_New Pump_10 HP (8.01 to 12.50 HP)","Pump","Pumps","ELE","N/A",864,284,2,5113,"OR","NBE","New Buildings","2023-01-01","2025-12-31","Units",0,0,2784.73,0,0,0,"3-Shift Industrial","None - gas",0,700,0,15,0,824.02,0,0,0,1,1,0,"NULL",100,100,"NULL","NULL","NULL","NULL","NULL","NULL","NULL","NULL","NULL","NULL","NULL","NULL","No Attributes ","NULL","NULL","F","NULL","NULL","NULL","NULL","NULL","F","NULL","NULL","NULL","NULL","NULL","F","NULL","NULL","NULL","NULL","NULL","F","NULL","NULL","NULL","NULL","NULL","F","NULL","NULL","NULL","NULL","NULL","F","NULL","NULL","NULL","NULL","NULL","F","NULL","NULL","NULL","NULL","NULL","F","NULL","NULL","NULL","NULL","NULL","F","NULL","NULL","NULL","NULL","NULL","F","NULL","NULL","NULL","NULL","NULL","F","NULL","NULL","NULL","NULL","NULL","F","NULL","NULL","NULL","NULL","NULL","F","NULL","NULL","NULL","NULL","NULL","F","NULL","NULL","NULL","NULL","NULL","F","NULL","NULL","NULL","NULL","NULL","F","NULL","NULL","NULL","NULL","NULL","F","NULL","NULL","NULL",44952.607310150466,44952.607310150466]
[15298,"Yes","Prescriptive","CPUMPVSDCOOLT7P5HP","Comm Pump VSD_Cooling Tower_New Pump_7.5 HP (6.01 to 8.00 HP)","Pump","Pumps","ELE","N/A",864,284,2,5095,"OR","NBE","New Buildings","2023-01-01","2025-12-31","Units",0,0,1347.61,0,0,0,"Other Cooling","None - gas",0,600,0,15,0,718.63,0,0,0,1,1,0,"NULL",100,100,"NULL","NULL","NULL","NULL","NULL","NULL","NULL","NULL","NULL","NULL","NULL","NULL","No Attributes ","NULL","NULL","F","NULL","NULL","NULL","NULL","NULL","F","NULL","NULL","NULL","NULL","NULL","F","NULL","NULL","NULL","NULL","NULL","F","NULL","NULL","NULL","NULL","NULL","F","NULL","NULL","NULL","NULL","NULL","F","NULL","NULL","NULL","NULL","NULL","F","NULL","NULL","NULL","NULL","NULL","F","NULL","NULL","NULL","NULL","NULL","F","NULL","NULL","NULL","NULL","NULL","F","NULL","NULL","NULL","NULL","NULL","F","NULL","NULL","NULL","NULL","NULL","F","NULL","NULL","NULL","NULL","NULL","F","NULL","NULL","NULL","NULL","NULL","F","NULL","NULL","NULL","NULL","NULL","F","NULL","NULL","NULL","NULL","NULL","F","NULL","NULL","NULL","NULL","NULL","F","NULL","NULL","NULL",44952.607310150466,44952.607310150466]
[15299,"Yes","Prescriptive","CPUMPVSDHEAT2HP","Commercial Pump VSD_Heating_New Pump_2 HP (1.76 to 2.50 HP)","Pump","Pumps","ELE","N/A",864,284,2,5102,"OR","NBE","New Buildings","2023-01-01","2025-12-31","Units",0,0,730.6,0,0,0,"Other Heating","None - gas",0,300,0,15,0,383.22,0,0,0,1,1,0,"NULL",100,100,"NULL","NULL","NULL","NULL","NULL","NULL","NULL","NULL","NULL","NULL","NULL","NULL","No Attributes ","NULL","NULL","F","NULL","NULL","NULL","NULL","NULL","F","NULL","NULL","NULL","NULL","NULL","F","NULL","NULL","NULL","NULL","NULL","F","NULL","NULL","NULL","NULL","NULL","F","NULL","NULL","NULL","NULL","NULL","F","NULL","NULL","NULL","NULL","NULL","F","NULL","NULL","NULL","NULL","NULL","F","NULL","NULL","NULL","NULL","NULL","F","NULL","NULL","NULL","NULL","NULL","F","NULL","NULL","NULL","NULL","NULL","F","NULL","NULL","NULL","NULL","NULL","F","NULL","NULL","NULL","NULL","NULL","F","NULL","NULL","NULL","NULL","NULL","F","NULL","NULL","NULL","NULL","NULL","F","NULL","NULL","NULL","NULL","NULL","F","NULL","NULL","NULL","NULL","NULL","F","NULL","NULL","NULL",44952.607310150466,44952.607310150466]
[15300,"Yes","Prescriptive","CPUMPVSDCOOL1HP","Comm Pump VSD_Cooling_New Pump_1 HP (0.76 to 1.25 HP)","Pump","Pumps","ELE","N/A",864,284,2,5117,"OR","NBE","New Buildings","2023-01-01","2025-12-31","Units",0,0,359.59,0,0,0,"Other Cooling","None - gas",0,200,0,15,0,275.58999999999997,0,0,0,1,1,0,"NULL",100,100,"NULL","NULL","NULL","NULL","NULL","NULL","NULL","NULL","NULL","NULL","NULL","NULL","No Attributes ","NULL","NULL","F","NULL","NULL","NULL","NULL","NULL","F","NULL","NULL","NULL","NULL","NULL","F","NULL","NULL","NULL","NULL","NULL","F","NULL","NULL","NULL","NULL","NULL","F","NULL","NULL","NULL","NULL","NULL","F","NULL","NULL","NULL","NULL","NULL","F","NULL","NULL","NULL","NULL","NULL","F","NULL","NULL","NULL","NULL","NULL","F","NULL","NULL","NULL","NULL","NULL","F","NULL","NULL","NULL","NULL","NULL","F","NULL","NULL","NULL","NULL","NULL","F","NULL","NULL","NULL","NULL","NULL","F","NULL","NULL","NULL","NULL","NULL","F","NULL","NULL","NULL","NULL","NULL","F","NULL","NULL","NULL","NULL","NULL","F","NULL","NULL","NULL","NULL","NULL","F","NULL","NULL","NULL",44952.607310150466,44952.607310150466]
[15301,"Yes","Prescriptive","CPUMPVSDCOOL2HP","Comm Pump VSD_Cooling_New Pump_2 HP (1.76 to 2.50 HP)","Pump","Pumps","ELE","N/A",864,284,2,5119,"OR","NBE","New Buildings","2023-01-01","2025-12-31","Units",0,0,719.19,0,0,0,"Other Cooling","None - gas",0,300,0,15,0,383.22,0,0,0,1,1,0,"NULL",100,100,"NULL","NULL","NULL","NULL","NULL","NULL","NULL","NULL","NULL","NULL","NULL","NULL","No Attributes ","NULL","NULL","F","NULL","NULL","NULL","NULL","NULL","F","NULL","NULL","NULL","NULL","NULL","F","NULL","NULL","NULL","NULL","NULL","F","NULL","NULL","NULL","NULL","NULL","F","NULL","NULL","NULL","NULL","NULL","F","NULL","NULL","NULL","NULL","NULL","F","NULL","NULL","NULL","NULL","NULL","F","NULL","NULL","NULL","NULL","NULL","F","NULL","NULL","NULL","NULL","NULL","F","NULL","NULL","NULL","NULL","NULL","F","NULL","NULL","NULL","NULL","NULL","F","NULL","NULL","NULL","NULL","NULL","F","NULL","NULL","NULL","NULL","NULL","F","NULL","NULL","NULL","NULL","NULL","F","NULL","NULL","NULL","NULL","NULL","F","NULL","NULL","NULL","NULL","NULL","F","NULL","NULL","NULL",44952.607310150466,44952.607310150466]
[15303,"Yes","Prescriptive","CPUMPVSDPB2HP","Comm Pump VSD_Pressure Boost_New Pump_2 HP (1.76 to 2.50 HP)","Pump","Pumps","ELE","N/A",864,284,2,5108,"OR","NBE","New Buildings","2023-01-01","2025-12-31","Units",0,0,556.95000000000005,0,0,0,"3-Shift Industrial","None - gas",0,300,0,15,0,383.22,0,0,0,1,1,0,"NULL",100,100,"NULL","NULL","NULL","NULL","NULL","NULL","NULL","NULL","NULL","NULL","NULL","NULL","No Attributes ","NULL","NULL","F","NULL","NULL","NULL","NULL","NULL","F","NULL","NULL","NULL","NULL","NULL","F","NULL","NULL","NULL","NULL","NULL","F","NULL","NULL","NULL","NULL","NULL","F","NULL","NULL","NULL","NULL","NULL","F","NULL","NULL","NULL","NULL","NULL","F","NULL","NULL","NULL","NULL","NULL","F","NULL","NULL","NULL","NULL","NULL","F","NULL","NULL","NULL","NULL","NULL","F","NULL","NULL","NULL","NULL","NULL","F","NULL","NULL","NULL","NULL","NULL","F","NULL","NULL","NULL","NULL","NULL","F","NULL","NULL","NULL","NULL","NULL","F","NULL","NULL","NULL","NULL","NULL","F","NULL","NULL","NULL","NULL","NULL","F","NULL","NULL","NULL","NULL","NULL","F","NULL","NULL","NULL",44952.607310150466,44952.607310150466]
[15304,"Yes","Prescriptive","CPUMPVSDCOOLT15HP","Comm Pump VSD_Cooling Tower_New Pump_15 HP (12.51 to 17.50 HP)","Pump","Pumps","ELE","N/A",864,284,2,5097,"OR","NBE","New Buildings","2023-01-01","2025-12-31","Units",0,0,2695.22,0,0,0,"Other Cooling","None - gas",0,850,0,15,0,999.31,0,0,0,1,1,0,"NULL",100,100,"NULL","NULL","NULL","NULL","NULL","NULL","NULL","NULL","NULL","NULL","NULL","NULL","No Attributes ","NULL","NULL","F","NULL","NULL","NULL","NULL","NULL","F","NULL","NULL","NULL","NULL","NULL","F","NULL","NULL","NULL","NULL","NULL","F","NULL","NULL","NULL","NULL","NULL","F","NULL","NULL","NULL","NULL","NULL","F","NULL","NULL","NULL","NULL","NULL","F","NULL","NULL","NULL","NULL","NULL","F","NULL","NULL","NULL","NULL","NULL","F","NULL","NULL","NULL","NULL","NULL","F","NULL","NULL","NULL","NULL","NULL","F","NULL","NULL","NULL","NULL","NULL","F","NULL","NULL","NULL","NULL","NULL","F","NULL","NULL","NULL","NULL","NULL","F","NULL","NULL","NULL","NULL","NULL","F","NULL","NULL","NULL","NULL","NULL","F","NULL","NULL","NULL","NULL","NULL","F","NULL","NULL","NULL",44952.607310150466,44952.607310150466]
[15305,"Yes","Prescriptive","CPUMPVSDPB20HP","Comm Pump VSD_Pressure Boost_New Pump_20 HP (17.51 to 22.50 HP)","Pump","Pumps","ELE","N/A",864,284,2,5115,"OR","NBE","New Buildings","2023-01-01","2025-12-31","Units",0,0,5569.46,0,0,0,"3-Shift Industrial","None - gas",0,1000,0,15,0,1145.8699999999999,0,0,0,1,1,0,"NULL",100,100,"NULL","NULL","NULL","NULL","NULL","NULL","NULL","NULL","NULL","NULL","NULL","NULL","No Attributes ","NULL","NULL","F","NULL","NULL","NULL","NULL","NULL","F","NULL","NULL","NULL","NULL","NULL","F","NULL","NULL","NULL","NULL","NULL","F","NULL","NULL","NULL","NULL","NULL","F","NULL","NULL","NULL","NULL","NULL","F","NULL","NULL","NULL","NULL","NULL","F","NULL","NULL","NULL","NULL","NULL","F","NULL","NULL","NULL","NULL","NULL","F","NULL","NULL","NULL","NULL","NULL","F","NULL","NULL","NULL","NULL","NULL","F","NULL","NULL","NULL","NULL","NULL","F","NULL","NULL","NULL","NULL","NULL","F","NULL","NULL","NULL","NULL","NULL","F","NULL","NULL","NULL","NULL","NULL","F","NULL","NULL","NULL","NULL","NULL","F","NULL","NULL","NULL","NULL","NULL","F","NULL","NULL","NULL",44952.607310150466,44952.607310150466]
[15306,"Yes","Prescriptive","CPUMPVSDPB5HP","Comm Pump VSD_Pressure Boost_New Pump_5 HP (4.51 to 6.00 HP)","Pump","Pumps","ELE","N/A",864,284,2,5111,"OR","NBE","New Buildings","2023-01-01","2025-12-31","Units",0,0,1392.36,0,0,0,"3-Shift Industrial","None - gas",0,500,0,15,0,592.58000000000004,0,0,0,1,1,0,"NULL",100,100,"NULL","NULL","NULL","NULL","NULL","NULL","NULL","NULL","NULL","NULL","NULL","NULL","No Attributes ","NULL","NULL","F","NULL","NULL","NULL","NULL","NULL","F","NULL","NULL","NULL","NULL","NULL","F","NULL","NULL","NULL","NULL","NULL","F","NULL","NULL","NULL","NULL","NULL","F","NULL","NULL","NULL","NULL","NULL","F","NULL","NULL","NULL","NULL","NULL","F","NULL","NULL","NULL","NULL","NULL","F","NULL","NULL","NULL","NULL","NULL","F","NULL","NULL","NULL","NULL","NULL","F","NULL","NULL","NULL","NULL","NULL","F","NULL","NULL","NULL","NULL","NULL","F","NULL","NULL","NULL","NULL","NULL","F","NULL","NULL","NULL","NULL","NULL","F","NULL","NULL","NULL","NULL","NULL","F","NULL","NULL","NULL","NULL","NULL","F","NULL","NULL","NULL","NULL","NULL","F","NULL","NULL","NULL",44952.607310150466,44952.607310150466]
[15307,"Yes","Prescriptive","CPUMPVSDCOOL0P75HP","Comm Pump VSD_Cooling_New Pump_0.75 HP (0.50 to 0.75 HP)","Pump","Pumps","ELE","N/A",864,284,2,5116,"OR","NBE","New Buildings","2023-01-01","2025-12-31","Units",0,0,269.69,0,0,0,"Other Cooling","None - gas",0,150,0,15,0,240.34,0,0,0,1,1,0,"NULL",100,100,"NULL","NULL","NULL","NULL","NULL","NULL","NULL","NULL","NULL","NULL","NULL","NULL","No Attributes ","NULL","NULL","F","NULL","NULL","NULL","NULL","NULL","F","NULL","NULL","NULL","NULL","NULL","F","NULL","NULL","NULL","NULL","NULL","F","NULL","NULL","NULL","NULL","NULL","F","NULL","NULL","NULL","NULL","NULL","F","NULL","NULL","NULL","NULL","NULL","F","NULL","NULL","NULL","NULL","NULL","F","NULL","NULL","NULL","NULL","NULL","F","NULL","NULL","NULL","NULL","NULL","F","NULL","NULL","NULL","NULL","NULL","F","NULL","NULL","NULL","NULL","NULL","F","NULL","NULL","NULL","NULL","NULL","F","NULL","NULL","NULL","NULL","NULL","F","NULL","NULL","NULL","NULL","NULL","F","NULL","NULL","NULL","NULL","NULL","F","NULL","NULL","NULL","NULL","NULL","F","NULL","NULL","NULL",44952.607310150466,44952.607310150466]
[15308,"Yes","Prescriptive","CPUMPVSDCOOL1P5HP","Comm Pump VSD_Cooling_New Pump_1.5 HP (1.26 to 1.75 HP)","Pump","Pumps","ELE","N/A",864,284,2,5118,"OR","NBE","New Buildings","2023-01-01","2025-12-31","Units",0,0,539.39,0,0,0,"Other Cooling","None - gas",0,250,0,15,0,334.21,0,0,0,1,1,0,"NULL",100,100,"NULL","NULL","NULL","NULL","NULL","NULL","NULL","NULL","NULL","NULL","NULL","NULL","No Attributes ","NULL","NULL","F","NULL","NULL","NULL","NULL","NULL","F","NULL","NULL","NULL","NULL","NULL","F","NULL","NULL","NULL","NULL","NULL","F","NULL","NULL","NULL","NULL","NULL","F","NULL","NULL","NULL","NULL","NULL","F","NULL","NULL","NULL","NULL","NULL","F","NULL","NULL","NULL","NULL","NULL","F","NULL","NULL","NULL","NULL","NULL","F","NULL","NULL","NULL","NULL","NULL","F","NULL","NULL","NULL","NULL","NULL","F","NULL","NULL","NULL","NULL","NULL","F","NULL","NULL","NULL","NULL","NULL","F","NULL","NULL","NULL","NULL","NULL","F","NULL","NULL","NULL","NULL","NULL","F","NULL","NULL","NULL","NULL","NULL","F","NULL","NULL","NULL","NULL","NULL","F","NULL","NULL","NULL",44952.607310150466,44952.607310150466]
[15309,"Yes","Prescriptive","CPUMPVSDHEAT7P5HP","Commercial Pump VSD_Heating_New Pump_7.5 HP (6.01 to 8.00 HP)","Pump","Pumps","ELE","N/A",864,284,2,5106,"OR","NBE","New Buildings","2023-01-01","2025-12-31","Units",0,0,2739.76,0,0,0,"Other Heating","None - gas",0,600,0,15,0,718.63,0,0,0,1,1,0,"NULL",100,100,"NULL","NULL","NULL","NULL","NULL","NULL","NULL","NULL","NULL","NULL","NULL","NULL","No Attributes ","NULL","NULL","F","NULL","NULL","NULL","NULL","NULL","F","NULL","NULL","NULL","NULL","NULL","F","NULL","NULL","NULL","NULL","NULL","F","NULL","NULL","NULL","NULL","NULL","F","NULL","NULL","NULL","NULL","NULL","F","NULL","NULL","NULL","NULL","NULL","F","NULL","NULL","NULL","NULL","NULL","F","NULL","NULL","NULL","NULL","NULL","F","NULL","NULL","NULL","NULL","NULL","F","NULL","NULL","NULL","NULL","NULL","F","NULL","NULL","NULL","NULL","NULL","F","NULL","NULL","NULL","NULL","NULL","F","NULL","NULL","NULL","NULL","NULL","F","NULL","NULL","NULL","NULL","NULL","F","NULL","NULL","NULL","NULL","NULL","F","NULL","NULL","NULL","NULL","NULL","F","NULL","NULL","NULL",44952.607310150466,44952.607310150466]
[15310,"Yes","Prescriptive","CPUMPVSDCOOL5HP","Comm Pump VSD_Cooling_New Pump_5 HP (4.51 to 6.00 HP)","Pump","Pumps","ELE","N/A",864,284,2,5122,"OR","NBE","New Buildings","2023-01-01","2025-12-31","Units",0,0,1797.97,0,0,0,"Other Cooling","None - gas",0,500,0,15,0,592.58000000000004,0,0,0,1,1,0,"NULL",100,100,"NULL","NULL","NULL","NULL","NULL","NULL","NULL","NULL","NULL","NULL","NULL","NULL","No Attributes ","NULL","NULL","F","NULL","NULL","NULL","NULL","NULL","F","NULL","NULL","NULL","NULL","NULL","F","NULL","NULL","NULL","NULL","NULL","F","NULL","NULL","NULL","NULL","NULL","F","NULL","NULL","NULL","NULL","NULL","F","NULL","NULL","NULL","NULL","NULL","F","NULL","NULL","NULL","NULL","NULL","F","NULL","NULL","NULL","NULL","NULL","F","NULL","NULL","NULL","NULL","NULL","F","NULL","NULL","NULL","NULL","NULL","F","NULL","NULL","NULL","NULL","NULL","F","NULL","NULL","NULL","NULL","NULL","F","NULL","NULL","NULL","NULL","NULL","F","NULL","NULL","NULL","NULL","NULL","F","NULL","NULL","NULL","NULL","NULL","F","NULL","NULL","NULL","NULL","NULL","F","NULL","NULL","NULL",44952.607310150466,44952.607310150466]
[15311,"Yes","Prescriptive","CPUMPVSDHEAT3HP","Commercial Pump VSD_Heating_New Pump_3 HP (2.51 to 3.50 HP)","Pump","Pumps","ELE","N/A",864,284,2,5103,"OR","NBE","New Buildings","2023-01-01","2025-12-31","Units",0,0,1095.9000000000001,0,0,0,"Other Heating","None - gas",0,350,0,15,0,464.75,0,0,0,1,1,0,"NULL",100,100,"NULL","NULL","NULL","NULL","NULL","NULL","NULL","NULL","NULL","NULL","NULL","NULL","No Attributes ","NULL","NULL","F","NULL","NULL","NULL","NULL","NULL","F","NULL","NULL","NULL","NULL","NULL","F","NULL","NULL","NULL","NULL","NULL","F","NULL","NULL","NULL","NULL","NULL","F","NULL","NULL","NULL","NULL","NULL","F","NULL","NULL","NULL","NULL","NULL","F","NULL","NULL","NULL","NULL","NULL","F","NULL","NULL","NULL","NULL","NULL","F","NULL","NULL","NULL","NULL","NULL","F","NULL","NULL","NULL","NULL","NULL","F","NULL","NULL","NULL","NULL","NULL","F","NULL","NULL","NULL","NULL","NULL","F","NULL","NULL","NULL","NULL","NULL","F","NULL","NULL","NULL","NULL","NULL","F","NULL","NULL","NULL","NULL","NULL","F","NULL","NULL","NULL","NULL","NULL","F","NULL","NULL","NULL",44952.607310150466,44952.607310150466]
[15312,"Yes","Prescriptive","CPUMPVSDHEAT1P5HP","Commercial Pump VSD_Heating_New Pump_1.5 HP (1.26 to 1.75 HP)","Pump","Pumps","ELE","N/A",864,284,2,5101,"OR","NBE","New Buildings","2023-01-01","2025-12-31","Units",0,0,547.95000000000005,0,0,0,"Other Heating","None - gas",0,250,0,15,0,334.21,0,0,0,1,1,0,"NULL",100,100,"NULL","NULL","NULL","NULL","NULL","NULL","NULL","NULL","NULL","NULL","NULL","NULL","No Attributes ","NULL","NULL","F","NULL","NULL","NULL","NULL","NULL","F","NULL","NULL","NULL","NULL","NULL","F","NULL","NULL","NULL","NULL","NULL","F","NULL","NULL","NULL","NULL","NULL","F","NULL","NULL","NULL","NULL","NULL","F","NULL","NULL","NULL","NULL","NULL","F","NULL","NULL","NULL","NULL","NULL","F","NULL","NULL","NULL","NULL","NULL","F","NULL","NULL","NULL","NULL","NULL","F","NULL","NULL","NULL","NULL","NULL","F","NULL","NULL","NULL","NULL","NULL","F","NULL","NULL","NULL","NULL","NULL","F","NULL","NULL","NULL","NULL","NULL","F","NULL","NULL","NULL","NULL","NULL","F","NULL","NULL","NULL","NULL","NULL","F","NULL","NULL","NULL","NULL","NULL","F","NULL","NULL","NULL",44952.607310150466,44952.607310150466]
[15313,"Yes","Prescriptive","CPUMPVSDHEAT1HP","Commercial Pump VSD_Heating_New Pump_1 HP (0.76 to 1.25 HP)","Pump","Pumps","ELE","N/A",864,284,2,5100,"OR","NBE","New Buildings","2023-01-01","2025-12-31","Units",0,0,365.3,0,0,0,"Other Heating","None - gas",0,200,0,15,0,275.58999999999997,0,0,0,1,1,0,"NULL",100,100,"NULL","NULL","NULL","NULL","NULL","NULL","NULL","NULL","NULL","NULL","NULL","NULL","No Attributes ","NULL","NULL","F","NULL","NULL","NULL","NULL","NULL","F","NULL","NULL","NULL","NULL","NULL","F","NULL","NULL","NULL","NULL","NULL","F","NULL","NULL","NULL","NULL","NULL","F","NULL","NULL","NULL","NULL","NULL","F","NULL","NULL","NULL","NULL","NULL","F","NULL","NULL","NULL","NULL","NULL","F","NULL","NULL","NULL","NULL","NULL","F","NULL","NULL","NULL","NULL","NULL","F","NULL","NULL","NULL","NULL","NULL","F","NULL","NULL","NULL","NULL","NULL","F","NULL","NULL","NULL","NULL","NULL","F","NULL","NULL","NULL","NULL","NULL","F","NULL","NULL","NULL","NULL","NULL","F","NULL","NULL","NULL","NULL","NULL","F","NULL","NULL","NULL","NULL","NULL","F","NULL","NULL","NULL",44952.607310150466,44952.607310150466]
[15314,"Yes","Prescriptive","CPUMPVSDPB1P5HP","Comm Pump VSD_Pressure Boost_New Pump_1.5 HP (1.26 to 1.75 HP)","Pump","Pumps","ELE","N/A",864,284,2,5107,"OR","NBE","New Buildings","2023-01-01","2025-12-31","Units",0,0,417.71,0,0,0,"3-Shift Industrial","None - gas",0,250,0,15,0,334.21,0,0,0,1,1,0,"NULL",100,100,"NULL","NULL","NULL","NULL","NULL","NULL","NULL","NULL","NULL","NULL","NULL","NULL","No Attributes ","NULL","NULL","F","NULL","NULL","NULL","NULL","NULL","F","NULL","NULL","NULL","NULL","NULL","F","NULL","NULL","NULL","NULL","NULL","F","NULL","NULL","NULL","NULL","NULL","F","NULL","NULL","NULL","NULL","NULL","F","NULL","NULL","NULL","NULL","NULL","F","NULL","NULL","NULL","NULL","NULL","F","NULL","NULL","NULL","NULL","NULL","F","NULL","NULL","NULL","NULL","NULL","F","NULL","NULL","NULL","NULL","NULL","F","NULL","NULL","NULL","NULL","NULL","F","NULL","NULL","NULL","NULL","NULL","F","NULL","NULL","NULL","NULL","NULL","F","NULL","NULL","NULL","NULL","NULL","F","NULL","NULL","NULL","NULL","NULL","F","NULL","NULL","NULL","NULL","NULL","F","NULL","NULL","NULL",44952.607310150466,44952.607310150466]
[15315,"Yes","Prescriptive","CPUMPVSDCOOLT20HP","Comm Pump VSD_Cooling Tower_New Pump_20 HP (17.51 to 22.50 HP)","Pump","Pumps","ELE","N/A",864,284,2,5098,"OR","NBE","New Buildings","2023-01-01","2025-12-31","Units",0,0,3593.63,0,0,0,"Other Cooling","None - gas",0,1000,0,15,0,1145.8699999999999,0,0,0,1,1,0,"NULL",100,100,"NULL","NULL","NULL","NULL","NULL","NULL","NULL","NULL","NULL","NULL","NULL","NULL","No Attributes ","NULL","NULL","F","NULL","NULL","NULL","NULL","NULL","F","NULL","NULL","NULL","NULL","NULL","F","NULL","NULL","NULL","NULL","NULL","F","NULL","NULL","NULL","NULL","NULL","F","NULL","NULL","NULL","NULL","NULL","F","NULL","NULL","NULL","NULL","NULL","F","NULL","NULL","NULL","NULL","NULL","F","NULL","NULL","NULL","NULL","NULL","F","NULL","NULL","NULL","NULL","NULL","F","NULL","NULL","NULL","NULL","NULL","F","NULL","NULL","NULL","NULL","NULL","F","NULL","NULL","NULL","NULL","NULL","F","NULL","NULL","NULL","NULL","NULL","F","NULL","NULL","NULL","NULL","NULL","F","NULL","NULL","NULL","NULL","NULL","F","NULL","NULL","NULL","NULL","NULL","F","NULL","NULL","NULL",44952.607310150466,44952.607310150466]
[15316,"Yes","Prescriptive","CPUMPVSDCOOLT10HP","Comm Pump VSD_Cooling Tower_New Pump_10 HP (8.01 to 12.50 HP)","Pump","Pumps","ELE","N/A",864,284,2,5096,"OR","NBE","New Buildings","2023-01-01","2025-12-31","Units",0,0,1796.82,0,0,0,"Other Cooling","None - gas",0,700,0,15,0,824.02,0,0,0,1,1,0,"NULL",100,100,"NULL","NULL","NULL","NULL","NULL","NULL","NULL","NULL","NULL","NULL","NULL","NULL","No Attributes ","NULL","NULL","F","NULL","NULL","NULL","NULL","NULL","F","NULL","NULL","NULL","NULL","NULL","F","NULL","NULL","NULL","NULL","NULL","F","NULL","NULL","NULL","NULL","NULL","F","NULL","NULL","NULL","NULL","NULL","F","NULL","NULL","NULL","NULL","NULL","F","NULL","NULL","NULL","NULL","NULL","F","NULL","NULL","NULL","NULL","NULL","F","NULL","NULL","NULL","NULL","NULL","F","NULL","NULL","NULL","NULL","NULL","F","NULL","NULL","NULL","NULL","NULL","F","NULL","NULL","NULL","NULL","NULL","F","NULL","NULL","NULL","NULL","NULL","F","NULL","NULL","NULL","NULL","NULL","F","NULL","NULL","NULL","NULL","NULL","F","NULL","NULL","NULL","NULL","NULL","F","NULL","NULL","NULL",44952.607310150466,44952.607310150466]
[15317,"Yes","Prescriptive","CPUMPVSDCOOLT4HP","Comm Pump VSD_Cooling Tower_New Pump_4 HP (3.51 to 4.50 HP)","Pump","Pumps","ELE","N/A",864,284,2,5093,"OR","NBE","New Buildings","2023-01-01","2025-12-31","Units",0,0,718.73,0,0,0,"Other Cooling","None - gas",0,450,0,15,0,532.9,0,0,0,1,1,0,"NULL",100,100,"NULL","NULL","NULL","NULL","NULL","NULL","NULL","NULL","NULL","NULL","NULL","NULL","No Attributes ","NULL","NULL","F","NULL","NULL","NULL","NULL","NULL","F","NULL","NULL","NULL","NULL","NULL","F","NULL","NULL","NULL","NULL","NULL","F","NULL","NULL","NULL","NULL","NULL","F","NULL","NULL","NULL","NULL","NULL","F","NULL","NULL","NULL","NULL","NULL","F","NULL","NULL","NULL","NULL","NULL","F","NULL","NULL","NULL","NULL","NULL","F","NULL","NULL","NULL","NULL","NULL","F","NULL","NULL","NULL","NULL","NULL","F","NULL","NULL","NULL","NULL","NULL","F","NULL","NULL","NULL","NULL","NULL","F","NULL","NULL","NULL","NULL","NULL","F","NULL","NULL","NULL","NULL","NULL","F","NULL","NULL","NULL","NULL","NULL","F","NULL","NULL","NULL","NULL","NULL","F","NULL","NULL","NULL",44952.607310150466,44952.607310150466]
[15318,"Yes","Prescriptive","CPUMPVSDCOOLT3HP","Comm Pump VSD_Cooling Tower_New Pump_3 HP (2.51 to 3.50 HP)","Pump","Pumps","ELE","N/A",864,284,2,5092,"OR","NBE","New Buildings","2023-01-01","2025-12-31","Units",0,0,539.04,0,0,0,"Other Cooling","None - gas",0,350,0,15,0,464.75,0,0,0,1,1,0,"NULL",100,100,"NULL","NULL","NULL","NULL","NULL","NULL","NULL","NULL","NULL","NULL","NULL","NULL","No Attributes ","NULL","NULL","F","NULL","NULL","NULL","NULL","NULL","F","NULL","NULL","NULL","NULL","NULL","F","NULL","NULL","NULL","NULL","NULL","F","NULL","NULL","NULL","NULL","NULL","F","NULL","NULL","NULL","NULL","NULL","F","NULL","NULL","NULL","NULL","NULL","F","NULL","NULL","NULL","NULL","NULL","F","NULL","NULL","NULL","NULL","NULL","F","NULL","NULL","NULL","NULL","NULL","F","NULL","NULL","NULL","NULL","NULL","F","NULL","NULL","NULL","NULL","NULL","F","NULL","NULL","NULL","NULL","NULL","F","NULL","NULL","NULL","NULL","NULL","F","NULL","NULL","NULL","NULL","NULL","F","NULL","NULL","NULL","NULL","NULL","F","NULL","NULL","NULL","NULL","NULL","F","NULL","NULL","NULL",44952.607310150466,44952.607310150466]
[15319,"Yes","Prescriptive","CPUMPVSDCOOLT2HP","Comm Pump VSD_Cooling Tower_New Pump_2 HP (1.76 to 2.50 HP)","Pump","Pumps","ELE","N/A",864,284,2,5091,"OR","NBE","New Buildings","2023-01-01","2025-12-31","Units",0,0,359.36,0,0,0,"Other Cooling","None - gas",0,300,0,15,0,383.22,0,0,0,1,1,0,"NULL",100,100,"NULL","NULL","NULL","NULL","NULL","NULL","NULL","NULL","NULL","NULL","NULL","NULL","No Attributes ","NULL","NULL","F","NULL","NULL","NULL","NULL","NULL","F","NULL","NULL","NULL","NULL","NULL","F","NULL","NULL","NULL","NULL","NULL","F","NULL","NULL","NULL","NULL","NULL","F","NULL","NULL","NULL","NULL","NULL","F","NULL","NULL","NULL","NULL","NULL","F","NULL","NULL","NULL","NULL","NULL","F","NULL","NULL","NULL","NULL","NULL","F","NULL","NULL","NULL","NULL","NULL","F","NULL","NULL","NULL","NULL","NULL","F","NULL","NULL","NULL","NULL","NULL","F","NULL","NULL","NULL","NULL","NULL","F","NULL","NULL","NULL","NULL","NULL","F","NULL","NULL","NULL","NULL","NULL","F","NULL","NULL","NULL","NULL","NULL","F","NULL","NULL","NULL","NULL","NULL","F","NULL","NULL","NULL",44952.607310150466,44952.607310150466]
[15320,"Yes","Prescriptive","CPUMPVSDCOOLT1P5HP","Comm Pump VSD_Cooling Tower_New Pump_1.5 HP (1.26 to 1.75 HP)","Pump","Pumps","ELE","N/A",864,284,2,5090,"OR","NBE","New Buildings","2023-01-01","2025-12-31","Units",0,0,269.52,0,0,0,"Other Cooling","None - gas",0,250,0,15,0,334.21,0,0,0,1,1,0,"NULL",100,100,"NULL","NULL","NULL","NULL","NULL","NULL","NULL","NULL","NULL","NULL","NULL","NULL","No Attributes ","NULL","NULL","F","NULL","NULL","NULL","NULL","NULL","F","NULL","NULL","NULL","NULL","NULL","F","NULL","NULL","NULL","NULL","NULL","F","NULL","NULL","NULL","NULL","NULL","F","NULL","NULL","NULL","NULL","NULL","F","NULL","NULL","NULL","NULL","NULL","F","NULL","NULL","NULL","NULL","NULL","F","NULL","NULL","NULL","NULL","NULL","F","NULL","NULL","NULL","NULL","NULL","F","NULL","NULL","NULL","NULL","NULL","F","NULL","NULL","NULL","NULL","NULL","F","NULL","NULL","NULL","NULL","NULL","F","NULL","NULL","NULL","NULL","NULL","F","NULL","NULL","NULL","NULL","NULL","F","NULL","NULL","NULL","NULL","NULL","F","NULL","NULL","NULL","NULL","NULL","F","NULL","NULL","NULL",44952.607310150466,44952.607310150466]
[18010,"Yes","Prescriptive","2STAGASGVALVEOPLDRY","Two-stage Gas Valve on Clothes Dryers in On-Premises Laundry","Clothes Dryer","Appliance","GAS","N/A",923,291,1,5687,"OR","NBE","New Buildings","2024-01-01","2026-12-31","Units",0,0,0,351.82,0,0,"None - ele","Clotheswasher",0,700,0,10,0,875,0,0,0,1,1,0,100,"NULL","NULL",100,100,100,100,"NULL","NULL","NULL","NULL","NULL","NULL",100,"NULL","Clothes Dryer","MANUFACTURER","Manufacturer Name","T","Alphanumeric",40,"ED","MODEL","Model","T","Alphanumeric",20,"ED","VOLUME","Volume (cubic feet)","F","Decimal",10,"ED","CAPACITY","Capacity (lbs)","F","Alphanumeric",10,"ED","NULL","NULL","F","NULL","NULL","NULL","NULL","NULL","F","NULL","NULL","NULL","NULL","NULL","F","NULL","NULL","NULL","NULL","NULL","F","NULL","NULL","NULL","NULL","NULL","F","NULL","NULL","NULL","NULL","NULL","F","NULL","NULL","NULL","NULL","NULL","F","NULL","NULL","NULL","NULL","NULL","F","NULL","NULL","NULL","NULL","NULL","F","NULL","NULL","NULL","NULL","NULL","F","NULL","NULL","NULL","NULL","NULL","F","NULL","NULL","NULL","NULL","NULL","F","NULL","NULL","NULL","NULL","NULL","F","NULL","NULL","NULL",45253.110922256943,45253.110922256943]

{"sheet":"EquipOpt Lookups","index":7,"n_rows":1063,"n_cols":15,"rows_kept":1063,"cut":false,"hidden":true,"merged":[]}
[null,"Zipcode","CoolingZone","HeatingZone","Combined",null,"Electric",null,"Gas",null,"Fuel/DHW Type",null,"Code Year",null,"Building Type"]
[null,97001,2,2,{"$f":"\"CZ\"&C2&\" \"&\"HZ\"&D2","v":"CZ2 HZ2"},null,"Select Electric Utility",null,"Select Gas Utility",null,"Select Type",null,"Select Code Year",null,"Select Building Type"]
[null,97002,2,1,{"$f":"\"CZ\"&C3&\" \"&\"HZ\"&D3","v":"CZ2 HZ1"},null,"Pacific Power",null,"Cascade Natural Gas",null,"Electric",null,"2019 Code Year",null,"Lodging (Hotel/Motel/Dormitory)"]
[null,97003,2,1,"CZ2 HZ1",null,"Portland General Electric",null,"NW Natural",null,"Gas",null,"2021 Code Year",null,"Multifamily"]
[null,97004,2,1,"CZ2 HZ1",null,"Other",null,"Avista",null,null,null,null,null,"Commercial and Other"]
[null,97005,2,1,"CZ2 HZ1",null,null,null,"None"]
[null,97006,2,1,"CZ2 HZ1"]
[null,97007,2,1,"CZ2 HZ1"]
[null,97008,2,1,"CZ2 HZ1"]
[null,97009,2,1,"CZ2 HZ1"]
[null,97011,1,1,"CZ1 HZ1",null,"DryerType",null,"HeatPumpWaterHeaterType",null,"Reach-In Glass Door Space Heat",null,null,null,"BaseboardTypes"]
[null,97013,2,1,"CZ2 HZ1",null,"<Select Dryer Type>",null,"<Select type>",null,"<Select Space Heat Type>",null,null,null,"<Select Building Type>"]
[null,97014,2,1,"CZ2 HZ1",null,"Electric Dryer",null,"Tier 1",null,"Electric Resistance",null,null,null,"Dorm"]
[null,97015,2,1,"CZ2 HZ1",null,"Gas Dryer",null,"Tier 2",null,"Heat Pump",null,null,null,"Lodging"]
[null,97016,1,1,"CZ1 HZ1",null,null,null,"Tier 2, ducted",null,"Natural Gas",null,null,null,"Multifamily"]
[null,97017,1,1,"CZ1 HZ1",null,null,null,"Tier 3"]
[null,97018,2,1,"CZ2 HZ1",null,null,null,"Tier 3, ducted"]
[null,97019,1,1,"CZ1 HZ1",null,null,null,"Tier 4 & up"]
[null,97020,2,1,"CZ2 HZ1",null,null,null,"Tier 4 & up, ducted"]
[null,97021,2,1,"CZ2 HZ1"]
[null,97022,2,1,"CZ2 HZ1"]
[null,97023,1,1,"CZ1 HZ1"]
[null,97024,2,1,"CZ2 HZ1"]
[null,97026,2,1,"CZ2 HZ1"]
[null,97027,2,1,"CZ2 HZ1"]
[null,97028,1,3,"CZ1 HZ3"]
[null,97029,2,2,"CZ2 HZ2"]
[null,97030,1,1,"CZ1 HZ1"]
[null,97031,2,1,"CZ2 HZ1"]
[null,97032,2,1,"CZ2 HZ1"]
[null,97033,2,2,"CZ2 HZ2"]
[null,97034,2,1,"CZ2 HZ1"]
[null,97035,2,1,"CZ2 HZ1"]
[null,97036,2,1,"CZ2 HZ1"]
[null,97037,2,2,"CZ2 HZ2"]
[null,97038,2,1,"CZ2 HZ1"]
[null,97039,2,2,"CZ2 HZ2"]
[null,97040,3,1,"CZ3 HZ1"]
[null,97041,1,2,"CZ1 HZ2"]
[null,97042,2,1,"CZ2 HZ1"]
[null,97044,2,1,"CZ2 HZ1"]
[null,97045,2,1,"CZ2 HZ1"]
[null,97048,1,1,"CZ1 HZ1"]
[null,97049,1,2,"CZ1 HZ2"]
[null,97050,2,1,"CZ2 HZ1"]
[null,97051,2,1,"CZ2 HZ1"]
[null,97053,2,1,"CZ2 HZ1"]
[null,97054,2,1,"CZ2 HZ1"]
[null,97055,1,1,"CZ1 HZ1"]
[null,97056,2,1,"CZ2 HZ1"]
[null,97058,3,1,"CZ3 HZ1"]
[null,97060,1,1,"CZ1 HZ1"]
[null,97062,2,1,"CZ2 HZ1"]
[null,97063,2,2,"CZ2 HZ2"]
[null,97064,1,1,"CZ1 HZ1"]
[null,97065,2,1,"CZ2 HZ1"]
[null,97067,1,1,"CZ1 HZ1"]
[null,97068,2,1,"CZ2 HZ1"]
[null,97070,2,1,"CZ2 HZ1",null,"≥"]
[null,97071,2,1,"CZ2 HZ1",null,"≤"]
[null,97075,2,1,"CZ2 HZ1"]
[null,97078,2,1,"CZ2 HZ1"]
[null,97080,1,1,"CZ1 HZ1"]
[null,97086,2,1,"CZ2 HZ1"]
[null,97089,2,1,"CZ2 HZ1"]
[null,97101,1,1,"CZ1 HZ1"]
[null,97102,1,1,{"$f":"\"CZ\"&C67&\" \"&\"HZ\"&D67","v":"CZ1 HZ1"}]
[null,97103,1,1,"CZ1 HZ1"]
[null,97106,2,1,"CZ2 HZ1"]
[null,97107,1,1,"CZ1 HZ1"]
[null,97108,1,1,"CZ1 HZ1"]
[null,97109,1,1,"CZ1 HZ1"]
[null,97110,1,1,"CZ1 HZ1"]
[null,97111,2,1,"CZ2 HZ1"]
[null,97112,1,1,"CZ1 HZ1"]
[null,97113,2,1,"CZ2 HZ1"]
[null,97114,1,1,"CZ1 HZ1"]
[null,97115,2,1,"CZ2 HZ1"]
[null,97116,2,1,"CZ2 HZ1"]
[null,97117,1,1,"CZ1 HZ1"]
[null,97118,1,1,"CZ1 HZ1"]
[null,97119,2,1,"CZ2 HZ1"]
[null,97121,1,1,"CZ1 HZ1"]
[null,97122,1,1,"CZ1 HZ1"]
[null,97123,1,1,"CZ1 HZ1"]
[null,97124,1,1,"CZ1 HZ1"]
[null,97125,1,1,"CZ1 HZ1"]
[null,97127,2,1,"CZ2 HZ1"]
[null,97128,2,1,"CZ2 HZ1"]
[null,97130,1,1,"CZ1 HZ1"]
[null,97131,1,1,"CZ1 HZ1"]
[null,97132,2,1,"CZ2 HZ1"]
[null,97133,1,1,"CZ1 HZ1"]
[null,97134,1,1,"CZ1 HZ1"]
[null,97135,1,1,"CZ1 HZ1"]
[null,97136,1,1,"CZ1 HZ1"]
[null,97137,1,1,"CZ1 HZ1"]
[null,97138,1,1,"CZ1 HZ1"]
[null,97140,2,1,"CZ2 HZ1"]
[null,97141,1,1,"CZ1 HZ1"]
[null,97144,1,1,"CZ1 HZ1"]
[null,97146,1,1,"CZ1 HZ1"]
[null,97147,1,1,"CZ1 HZ1"]
[null,97148,2,1,"CZ2 HZ1"]
[null,97149,1,1,"CZ1 HZ1"]
[null,97201,2,1,"CZ2 HZ1"]
[null,97202,2,1,"CZ2 HZ1"]
[null,97203,2,1,"CZ2 HZ1"]
[null,97204,2,1,"CZ2 HZ1"]
[null,97205,2,1,"CZ2 HZ1"]
[null,97206,2,1,"CZ2 HZ1"]
[null,97207,2,1,"CZ2 HZ1"]
[null,97208,2,1,"CZ2 HZ1"]
[null,97209,2,1,"CZ2 HZ1"]
[null,97210,2,1,"CZ2 HZ1"]
[null,97211,2,1,"CZ2 HZ1"]
[null,97212,2,1,"CZ2 HZ1"]
[null,97213,2,1,"CZ2 HZ1"]
[null,97214,2,1,"CZ2 HZ1"]
[null,97215,2,1,"CZ2 HZ1"]
[null,97216,2,1,"CZ2 HZ1"]
[null,97217,2,1,"CZ2 HZ1"]
[null,97218,2,1,"CZ2 HZ1"]
[null,97219,2,1,"CZ2 HZ1"]
[null,97220,2,1,"CZ2 HZ1"]
[null,97221,2,1,"CZ2 HZ1"]
[null,97222,2,1,"CZ2 HZ1"]
[null,97223,2,1,"CZ2 HZ1"]
[null,97224,2,1,"CZ2 HZ1"]
[null,97225,2,1,"CZ2 HZ1"]
[null,97227,2,1,{"$f":"\"CZ\"&C131&\" \"&\"HZ\"&D131","v":"CZ2 HZ1"}]
[null,97228,2,1,"CZ2 HZ1"]
[null,97229,2,1,"CZ2 HZ1"]
[null,97230,1,1,"CZ1 HZ1"]
[null,97231,2,1,"CZ2 HZ1"]
[null,97232,2,1,"CZ2 HZ1"]
[null,97233,2,1,"CZ2 HZ1"]
[null,97236,2,1,"CZ2 HZ1"]
[null,97238,2,1,"CZ2 HZ1"]
[null,97239,2,1,"CZ2 HZ1"]
[null,97240,2,1,"CZ2 HZ1"]
[null,97242,2,1,"CZ2 HZ1"]
[null,97250,2,1,"CZ2 HZ1"]
[null,97266,2,1,"CZ2 HZ1"]
[null,97267,2,1,"CZ2 HZ1"]
[null,97268,2,1,"CZ2 HZ1"]
[null,97269,2,1,"CZ2 HZ1"]
[null,97280,2,1,"CZ2 HZ1"]
[null,97281,2,1,"CZ2 HZ1"]
[null,97282,2,1,"CZ2 HZ1"]
[null,97283,2,1,"CZ2 HZ1"]
[null,97286,2,1,"CZ2 HZ1"]
[null,97290,2,1,"CZ2 HZ1"]
[null,97291,2,1,"CZ2 HZ1"]
[null,97292,2,1,"CZ2 HZ1"]
[null,97293,2,1,"CZ2 HZ1"]
[null,97294,2,1,"CZ2 HZ1"]
[null,97296,2,1,"CZ2 HZ1"]
[null,97298,2,1,"CZ2 HZ1"]
[null,97301,2,1,"CZ2 HZ1"]
[null,97302,2,1,"CZ2 HZ1"]
[null,97303,2,1,"CZ2 HZ1"]
[null,97304,1,1,"CZ1 HZ1"]
[null,97305,2,1,"CZ2 HZ1"]
[null,97306,1,1,"CZ1 HZ1"]
[null,97307,2,1,"CZ2 HZ1"]
[null,97308,2,1,"CZ2 HZ1"]
[null,97309,2,1,"CZ2 HZ1"]
[null,97317,2,1,"CZ2 HZ1"]
[null,97321,1,1,"CZ1 HZ1"]
[null,97322,1,1,"CZ1 HZ1"]
[null,97324,1,1,"CZ1 HZ1"]
[null,97325,1,1,"CZ1 HZ1"]
[null,97326,1,1,"CZ1 HZ1"]
[null,97327,2,1,"CZ2 HZ1"]
[null,97329,2,1,"CZ2 HZ1"]
[null,97330,1,1,"CZ1 HZ1"]
[null,97331,1,1,"CZ1 HZ1"]
[null,97333,1,1,"CZ1 HZ1"]
[null,97335,2,1,"CZ2 HZ1"]
[null,97336,1,1,"CZ1 HZ1"]
[null,97338,1,1,"CZ1 HZ1"]
[null,97339,1,1,"CZ1 HZ1"]
[null,97341,1,1,"CZ1 HZ1"]
[null,97342,2,1,"CZ2 HZ1"]
[null,97343,1,1,"CZ1 HZ1"]
[null,97344,1,1,"CZ1 HZ1"]
[null,97345,1,1,"CZ1 HZ1"]
[null,97346,1,1,"CZ1 HZ1"]
[null,97347,1,1,"CZ1 HZ1"]
[null,97348,1,1,"CZ1 HZ1"]
[null,97350,1,2,"CZ1 HZ2"]
[null,97351,2,1,"CZ2 HZ1"]
[null,97352,1,1,"CZ1 HZ1"]
[null,97355,2,1,{"$f":"\"CZ\"&C195&\" \"&\"HZ\"&D195","v":"CZ2 HZ1"}]
[null,97357,1,1,"CZ1 HZ1"]
[null,97358,1,1,"CZ1 HZ1"]
[null,97360,1,1,"CZ1 HZ1"]
[null,97361,1,1,"CZ1 HZ1"]
[null,97362,2,1,"CZ2 HZ1"]
[null,97364,1,1,"CZ1 HZ1"]
[null,97365,1,1,"CZ1 HZ1"]
[null,97366,1,1,"CZ1 HZ1"]
[null,97367,1,1,"CZ1 HZ1"]
[null,97368,1,1,"CZ1 HZ1"]
[null,97369,1,1,"CZ1 HZ1"]
[null,97370,1,1,"CZ1 HZ1"]
[null,97371,1,1,"CZ1 HZ1"]
[null,97374,1,1,"CZ1 HZ1"]
[null,97375,1,2,"CZ1 HZ2"]
[null,97376,1,1,"CZ1 HZ1"]
[null,97377,1,1,"CZ1 HZ1"]
[null,97378,1,1,"CZ1 HZ1"]
[null,97380,1,1,"CZ1 HZ1"]
[null,97381,2,1,"CZ2 HZ1"]
[null,97383,1,1,"CZ1 HZ1"]
[null,97385,1,1,"CZ1 HZ1"]
[null,97386,1,1,"CZ1 HZ1"]
[null,97388,1,1,"CZ1 HZ1"]
[null,97389,1,1,"CZ1 HZ1"]
[null,97390,1,1,"CZ1 HZ1"]
[null,97391,1,1,"CZ1 HZ1"]
[null,97392,2,1,"CZ2 HZ1"]
[null,97394,1,1,"CZ1 HZ1"]
[null,97396,1,1,"CZ1 HZ1"]
[null,97401,1,1,"CZ1 HZ1"]
[null,97402,1,1,"CZ1 HZ1"]
[null,97403,1,1,"CZ1 HZ1"]
[null,97404,1,1,"CZ1 HZ1"]
[null,97405,1,1,"CZ1 HZ1"]
[null,97406,3,1,"CZ3 HZ1"]
[null,97408,1,1,"CZ1 HZ1"]
[null,97410,2,1,"CZ2 HZ1"]
[null,97411,1,1,"CZ1 HZ1"]
[null,97412,1,1,"CZ1 HZ1"]
[null,97413,3,1,"CZ3 HZ1"]
[null,97414,1,1,"CZ1 HZ1"]
[null,97415,1,1,"CZ1 HZ1"]
[null,97416,1,1,"CZ1 HZ1"]
[null,97417,3,1,"CZ3 HZ1"]
[null,97419,1,1,"CZ1 HZ1"]
[null,97420,1,1,"CZ1 HZ1"]
[null,97423,1,1,"CZ1 HZ1"]
[null,97424,1,1,"CZ1 HZ1"]
[null,97426,1,1,"CZ1 HZ1"]
[null,97429,2,1,"CZ2 HZ1"]
[null,97430,1,2,"CZ1 HZ2"]
[null,97431,1,1,"CZ1 HZ1"]
[null,97432,3,1,"CZ3 HZ1"]
[null,97434,2,1,"CZ2 HZ1"]
[null,97435,1,1,"CZ1 HZ1"]
[null,97436,2,1,"CZ2 HZ1"]
[null,97437,1,1,"CZ1 HZ1"]
[null,97438,1,1,"CZ1 HZ1"]
[null,97439,1,1,"CZ1 HZ1"]
[null,97440,1,1,"CZ1 HZ1"]
[null,97441,1,1,"CZ1 HZ1"]
[null,97442,2,1,"CZ2 HZ1"]
[null,97443,1,1,{"$f":"\"CZ\"&C259&\" \"&\"HZ\"&D259","v":"CZ1 HZ1"}]
[null,97444,1,1,"CZ1 HZ1"]
[null,97446,1,1,"CZ1 HZ1"]
[null,97447,1,1,"CZ1 HZ1"]
[null,97448,1,1,"CZ1 HZ1"]
[null,97449,1,1,"CZ1 HZ1"]
[null,97450,1,1,"CZ1 HZ1"]
[null,97451,1,1,"CZ1 HZ1"]
[null,97452,1,1,"CZ1 HZ1"]
[null,97453,1,1,"CZ1 HZ1"]
[null,97454,2,1,"CZ2 HZ1"]
[null,97455,1,1,"CZ1 HZ1"]
[null,97456,1,1,"CZ1 HZ1"]
[null,97457,3,1,"CZ3 HZ1"]
[null,97458,1,1,"CZ1 HZ1"]
[null,97459,1,1,"CZ1 HZ1"]
[null,97461,1,1,"CZ1 HZ1"]
[null,97462,2,1,"CZ2 HZ1"]
[null,97463,1,1,"CZ1 HZ1"]
[null,97465,3,1,"CZ3 HZ1"]
[null,97466,1,1,"CZ1 HZ1"]
[null,97467,1,1,"CZ1 HZ1"]
[null,97469,3,1,"CZ3 HZ1"]
[null,97470,1,1,"CZ1 HZ1"]
[null,97471,3,1,"CZ3 HZ1"]
[null,97473,2,1,"CZ2 HZ1"]
[null,97475,1,1,"CZ1 HZ1"]
[null,97476,3,1,"CZ3 HZ1"]
[null,97477,1,1,"CZ1 HZ1"]
[null,97478,1,1,"CZ1 HZ1"]
[null,97479,3,1,"CZ3 HZ1"]
[null,97480,1,1,"CZ1 HZ1"]
[null,97481,3,1,"CZ3 HZ1"]
[null,97484,2,1,"CZ2 HZ1"]
[null,97486,3,1,"CZ3 HZ1"]
[null,97487,1,1,"CZ1 HZ1"]
[null,97488,1,1,"CZ1 HZ1"]
[null,97489,2,1,"CZ2 HZ1"]
[null,97490,1,1,"CZ1 HZ1"]
[null,97492,1,1,"CZ1 HZ1"]
[null,97493,1,1,"CZ1 HZ1"]
[null,97494,1,1,"CZ1 HZ1"]
[null,97495,2,1,"CZ2 HZ1"]
[null,97496,3,1,"CZ3 HZ1"]
[null,97497,2,1,"CZ2 HZ1"]
[null,97498,1,1,"CZ1 HZ1"]
[null,97499,2,1,"CZ2 HZ1"]
[null,97501,3,1,"CZ3 HZ1"]
[null,97502,3,1,"CZ3 HZ1"]
[null,97503,3,1,"CZ3 HZ1"]
[null,97504,3,1,"CZ3 HZ1"]
[null,97520,2,1,"CZ2 HZ1"]
[null,97522,2,1,"CZ2 HZ1"]
[null,97523,3,1,"CZ3 HZ1"]
[null,97524,3,1,"CZ3 HZ1"]
[null,97525,3,1,"CZ3 HZ1"]
[null,97526,3,1,"CZ3 HZ1"]
[null,97527,3,1,"CZ3 HZ1"]
[null,97528,3,1,"CZ3 HZ1"]
[null,97530,2,1,"CZ2 HZ1"]
[null,97531,3,1,"CZ3 HZ1"]
[null,97532,3,1,"CZ3 HZ1"]
[null,97533,3,1,"CZ3 HZ1"]
[null,97534,3,1,"CZ3 HZ1"]
[null,97535,3,1,{"$f":"\"CZ\"&C323&\" \"&\"HZ\"&D323","v":"CZ3 HZ1"}]
[null,97536,2,1,"CZ2 HZ1"]
[null,97537,3,1,"CZ3 HZ1"]
[null,97538,3,1,"CZ3 HZ1"]
[null,97539,2,1,"CZ2 HZ1"]
[null,97540,2,1,"CZ2 HZ1"]
[null,97541,2,1,"CZ2 HZ1"]
[null,97543,3,1,"CZ3 HZ1"]
[null,97544,3,1,"CZ3 HZ1"]
[null,97601,1,2,"CZ1 HZ2"]
[null,97602,1,2,"CZ1 HZ2"]
[null,97603,1,2,"CZ1 HZ2"]
[null,97620,1,2,"CZ1 HZ2"]
[null,97621,1,2,"CZ1 HZ2"]
[null,97622,2,2,"CZ2 HZ2"]
[null,97623,1,2,"CZ1 HZ2"]
[null,97624,1,3,"CZ1 HZ3"]
[null,97625,1,2,"CZ1 HZ2"]
[null,97626,1,2,"CZ1 HZ2"]
[null,97627,1,2,"CZ1 HZ2"]
[null,97630,2,2,"CZ2 HZ2"]
[null,97632,1,2,"CZ1 HZ2"]
[null,97633,1,2,"CZ1 HZ2"]
[null,97634,1,2,"CZ1 HZ2"]
[null,97635,2,2,"CZ2 HZ2"]
[null,97636,1,2,"CZ1 HZ2"]
[null,97637,1,2,"CZ1 HZ2"]
[null,97638,1,2,"CZ1 HZ2"]
[null,97639,1,2,"CZ1 HZ2"]
[null,97640,2,2,"CZ2 HZ2"]
[null,97641,1,2,"CZ1 HZ2"]
[null,97701,1,2,"CZ1 HZ2"]
[null,97702,1,2,"CZ1 HZ2"]
[null,97703,1,2,"CZ1 HZ2"]
[null,97707,1,3,"CZ1 HZ3"]
[null,97708,1,2,"CZ1 HZ2"]
[null,97709,1,2,"CZ1 HZ2"]
[null,97710,3,2,"CZ3 HZ2"]
[null,97711,2,2,"CZ2 HZ2"]
[null,97712,1,3,"CZ1 HZ3"]
[null,97720,2,2,"CZ2 HZ2"]
[null,97721,1,2,"CZ1 HZ2"]
[null,97722,1,2,"CZ1 HZ2"]
[null,97730,1,2,"CZ1 HZ2"]
[null,97731,1,3,"CZ1 HZ3"]
[null,97732,1,2,"CZ1 HZ2"]
[null,97733,1,3,"CZ1 HZ3"]
[null,97734,2,2,"CZ2 HZ2"]
[null,97735,1,2,"CZ1 HZ2"]
[null,97736,3,2,"CZ3 HZ2"]
[null,97737,1,2,"CZ1 HZ2"]
[null,97738,2,2,"CZ2 HZ2"]
[null,97739,1,2,"CZ1 HZ2"]
[null,97741,1,2,"CZ1 HZ2"]
[null,97750,2,2,"CZ2 HZ2"]
[null,97751,1,2,"CZ1 HZ2"]
[null,97752,1,2,"CZ1 HZ2"]
[null,97753,1,2,"CZ1 HZ2"]
[null,97754,2,2,"CZ2 HZ2"]
[null,97756,2,2,"CZ2 HZ2"]
[null,97758,2,2,"CZ2 HZ2"]
[null,97759,1,2,"CZ1 HZ2"]
[null,97760,2,2,"CZ2 HZ2"]
[null,97801,3,1,"CZ3 HZ1"]
[null,97810,2,1,{"$f":"\"CZ\"&C387&\" \"&\"HZ\"&D387","v":"CZ2 HZ1"}]
[null,97812,2,1,"CZ2 HZ1"]
[null,97813,2,1,"CZ2 HZ1"]
[null,97814,2,2,"CZ2 HZ2"]
[null,97817,1,3,"CZ1 HZ3"]
[null,97818,3,1,"CZ3 HZ1"]
[null,97819,1,3,"CZ1 HZ3"]
[null,97820,1,2,"CZ1 HZ2"]
[null,97823,2,2,"CZ2 HZ2"]
[null,97824,2,2,"CZ2 HZ2"]
[null,97825,1,2,"CZ1 HZ2"]
[null,97826,3,1,"CZ3 HZ1"]
[null,97827,1,2,"CZ1 HZ2"]
[null,97828,1,3,"CZ1 HZ3"]
[null,97830,2,2,"CZ2 HZ2"]
[null,97833,2,2,"CZ2 HZ2"]
[null,97834,2,2,"CZ2 HZ2"]
[null,97835,2,1,"CZ2 HZ1"]
[null,97836,2,2,"CZ2 HZ2"]
[null,97837,1,3,"CZ1 HZ3"]
[null,97838,3,1,"CZ3 HZ1"]
[null,97839,2,1,"CZ2 HZ1"]
[null,97840,2,2,"CZ2 HZ2"]
[null,97841,1,2,"CZ1 HZ2"]
[null,97842,1,2,"CZ1 HZ2"]
[null,97843,2,1,"CZ2 HZ1"]
[null,97844,3,1,"CZ3 HZ1"]
[null,97845,1,2,"CZ1 HZ2"]
[null,97846,1,3,"CZ1 HZ3"]
[null,97848,1,3,"CZ1 HZ3"]
[null,97850,2,2,"CZ2 HZ2"]
[null,97856,1,2,"CZ1 HZ2"]
[null,97857,1,3,"CZ1 HZ3"]
[null,97859,1,3,"CZ1 HZ3"]
[null,97862,3,1,"CZ3 HZ1"]
[null,97864,1,2,"CZ1 HZ2"]
[null,97865,1,2,"CZ1 HZ2"]
[null,97867,2,2,"CZ2 HZ2"]
[null,97868,2,1,"CZ2 HZ1"]
[null,97869,1,3,"CZ1 HZ3"]
[null,97870,2,2,"CZ2 HZ2"]
[null,97873,1,3,"CZ1 HZ3"]
[null,97874,2,1,"CZ2 HZ1"]
[null,97875,3,1,"CZ3 HZ1"]
[null,97876,1,2,"CZ1 HZ2"]
[null,97877,1,3,"CZ1 HZ3"]
[null,97880,1,3,"CZ1 HZ3"]
[null,97882,3,1,"CZ3 HZ1"]
[null,97883,2,2,"CZ2 HZ2"]
[null,97884,1,3,"CZ1 HZ3"]
[null,97885,1,2,"CZ1 HZ2"]
[null,97886,1,3,"CZ1 HZ3"]
[null,97901,3,1,"CZ3 HZ1"]
[null,97902,2,2,"CZ2 HZ2"]
[null,97903,3,2,"CZ3 HZ2"]
[null,97904,2,2,"CZ2 HZ2"]
[null,97905,2,2,"CZ2 HZ2"]
[null,97906,3,1,"CZ3 HZ1"]
[null,97907,3,1,"CZ3 HZ1"]
[null,97908,2,2,"CZ2 HZ2"]
[null,97909,3,2,"CZ3 HZ2"]
[null,97910,2,2,"CZ2 HZ2"]
[null,97911,2,2,"CZ2 HZ2"]
[null,97913,3,1,"CZ3 HZ1"]
[null,97914,3,1,{"$f":"\"CZ\"&C451&\" \"&\"HZ\"&D451","v":"CZ3 HZ1"}]
[null,97917,2,2,"CZ2 HZ2"]
[null,97918,3,2,"CZ3 HZ2"]
[null,97920,3,2,"CZ3 HZ2"]
[null,98001,1,1,"CZ1 HZ1"]
[null,98002,1,1,"CZ1 HZ1"]
[null,98003,1,1,"CZ1 HZ1"]
[null,98004,1,1,"CZ1 HZ1"]
[null,98005,1,1,"CZ1 HZ1"]
[null,98006,1,1,"CZ1 HZ1"]
[null,98007,1,1,"CZ1 HZ1"]
[null,98008,1,1,"CZ1 HZ1"]
[null,98009,1,1,"CZ1 HZ1"]
[null,98010,1,1,"CZ1 HZ1"]
[null,98011,1,1,"CZ1 HZ1"]
[null,98012,1,1,"CZ1 HZ1"]
[null,98014,1,1,"CZ1 HZ1"]
[null,98015,1,1,"CZ1 HZ1"]
[null,98019,1,1,"CZ1 HZ1"]
[null,98020,1,1,"CZ1 HZ1"]
[null,98021,1,1,"CZ1 HZ1"]
[null,98022,1,1,"CZ1 HZ1"]
[null,98023,1,1,"CZ1 HZ1"]
[null,98024,1,1,"CZ1 HZ1"]
[null,98025,1,1,"CZ1 HZ1"]
[null,98026,1,1,"CZ1 HZ1"]
[null,98027,1,1,"CZ1 HZ1"]
[null,98028,1,1,"CZ1 HZ1"]
[null,98029,1,1,"CZ1 HZ1"]
[null,98030,1,1,"CZ1 HZ1"]
[null,98031,1,1,"CZ1 HZ1"]
[null,98032,1,1,"CZ1 HZ1"]
[null,98033,1,1,"CZ1 HZ1"]
[null,98034,1,1,"CZ1 HZ1"]
[null,98035,1,1,"CZ1 HZ1"]
[null,98036,1,1,"CZ1 HZ1"]
[null,98037,1,1,"CZ1 HZ1"]
[null,98038,1,1,"CZ1 HZ1"]
[null,98039,1,1,"CZ1 HZ1"]
[null,98040,1,1,"CZ1 HZ1"]
[null,98041,1,1,"CZ1 HZ1"]
[null,98042,1,1,"CZ1 HZ1"]
[null,98043,1,1,"CZ1 HZ1"]
[null,98045,1,1,"CZ1 HZ1"]
[null,98046,1,1,"CZ1 HZ1"]
[null,98047,1,1,"CZ1 HZ1"]
[null,98050,1,1,"CZ1 HZ1"]
[null,98051,1,1,"CZ1 HZ1"]
[null,98052,1,1,"CZ1 HZ1"]
[null,98053,1,1,"CZ1 HZ1"]
[null,98055,1,1,"CZ1 HZ1"]
[null,98056,1,1,"CZ1 HZ1"]
[null,98057,1,1,"CZ1 HZ1"]
[null,98058,1,1,"CZ1 HZ1"]
[null,98059,1,1,"CZ1 HZ1"]
[null,98061,1,1,"CZ1 HZ1"]
[null,98062,1,1,"CZ1 HZ1"]
[null,98063,1,1,"CZ1 HZ1"]
[null,98064,1,1,"CZ1 HZ1"]
[null,98065,1,1,"CZ1 HZ1"]
[null,98070,1,1,"CZ1 HZ1"]
[null,98071,1,1,"CZ1 HZ1"]
[null,98072,1,1,"CZ1 HZ1"]
[null,98073,1,1,"CZ1 HZ1"]
[null,98074,1,1,{"$f":"\"CZ\"&C515&\" \"&\"HZ\"&D515","v":"CZ1 HZ1"}]
[null,98075,1,1,"CZ1 HZ1"]
[null,98077,1,1,"CZ1 HZ1"]
[null,98082,1,1,"CZ1 HZ1"]
[null,98083,1,1,"CZ1 HZ1"]
[null,98087,1,1,"CZ1 HZ1"]
[null,98089,1,1,"CZ1 HZ1"]
[null,98092,1,1,"CZ1 HZ1"]
[null,98093,1,1,"CZ1 HZ1"]
[null,98101,1,1,"CZ1 HZ1"]
[null,98102,1,1,"CZ1 HZ1"]
[null,98103,1,1,"CZ1 HZ1"]
[null,98104,1,1,"CZ1 HZ1"]
[null,98105,1,1,"CZ1 HZ1"]
[null,98106,1,1,"CZ1 HZ1"]
[null,98107,1,1,"CZ1 HZ1"]
[null,98108,1,1,"CZ1 HZ1"]
[null,98109,1,1,"CZ1 HZ1"]
[null,98110,1,1,"CZ1 HZ1"]
[null,98111,1,1,"CZ1 HZ1"]
[null,98112,1,1,"CZ1 HZ1"]
[null,98113,1,1,"CZ1 HZ1"]
[null,98114,1,1,"CZ1 HZ1"]
[null,98115,1,1,"CZ1 HZ1"]
[null,98116,1,1,"CZ1 HZ1"]
[null,98117,1,1,"CZ1 HZ1"]
[null,98118,1,1,"CZ1 HZ1"]
[null,98119,1,1,"CZ1 HZ1"]
[null,98121,1,1,"CZ1 HZ1"]
[null,98122,1,1,"CZ1 HZ1"]
[null,98124,1,1,"CZ1 HZ1"]
[null,98125,1,1,"CZ1 HZ1"]
[null,98126,1,1,"CZ1 HZ1"]
[null,98127,1,1,"CZ1 HZ1"]
[null,98133,1,1,"CZ1 HZ1"]
[null,98134,1,1,"CZ1 HZ1"]
[null,98136,1,1,"CZ1 HZ1"]
[null,98138,1,1,"CZ1 HZ1"]
[null,98139,1,1,"CZ1 HZ1"]
[null,98144,1,1,"CZ1 HZ1"]
[null,98145,1,1,"CZ1 HZ1"]
[null,98146,1,1,"CZ1 HZ1"]
[null,98148,1,1,"CZ1 HZ1"]
[null,98155,1,1,"CZ1 HZ1"]
[null,98164,1,1,"CZ1 HZ1"]
[null,98165,1,1,"CZ1 HZ1"]
[null,98166,1,1,"CZ1 HZ1"]
[null,98168,1,1,"CZ1 HZ1"]
[null,98175,1,1,"CZ1 HZ1"]
[null,98177,1,1,"CZ1 HZ1"]
[null,98178,1,1,"CZ1 HZ1"]
[null,98188,1,1,"CZ1 HZ1"]
[null,98194,1,1,"CZ1 HZ1"]
[null,98198,1,1,"CZ1 HZ1"]
[null,98199,1,1,"CZ1 HZ1"]
[null,98201,1,1,"CZ1 HZ1"]
[null,98203,1,1,"CZ1 HZ1"]
[null,98204,1,1,"CZ1 HZ1"]
[null,98206,1,1,"CZ1 HZ1"]
[null,98208,1,1,"CZ1 HZ1"]
[null,98213,1,1,"CZ1 HZ1"]
[null,98220,1,1,"CZ1 HZ1"]
[null,98221,1,1,"CZ1 HZ1"]
[null,98222,1,1,"CZ1 HZ1"]
[null,98223,1,1,{"$f":"\"CZ\"&C579&\" \"&\"HZ\"&D579","v":"CZ1 HZ1"}]
[null,98225,1,1,"CZ1 HZ1"]
[null,98226,1,1,"CZ1 HZ1"]
[null,98227,1,1,"CZ1 HZ1"]
[null,98228,1,1,"CZ1 HZ1"]
[null,98229,1,2,"CZ1 HZ2"]
[null,98230,1,1,"CZ1 HZ1"]
[null,98231,1,1,"CZ1 HZ1"]
[null,98232,1,1,"CZ1 HZ1"]
[null,98233,1,1,"CZ1 HZ1"]
[null,98236,1,1,"CZ1 HZ1"]
[null,98237,1,2,"CZ1 HZ2"]
[null,98239,1,1,"CZ1 HZ1"]
[null,98240,1,1,"CZ1 HZ1"]
[null,98241,1,1,"CZ1 HZ1"]
[null,98243,1,1,"CZ1 HZ1"]
[null,98244,1,2,"CZ1 HZ2"]
[null,98245,1,1,"CZ1 HZ1"]
[null,98247,1,1,"CZ1 HZ1"]
[null,98248,1,1,"CZ1 HZ1"]
[null,98249,1,1,"CZ1 HZ1"]
[null,98250,1,1,"CZ1 HZ1"]
[null,98251,1,1,"CZ1 HZ1"]
[null,98252,1,1,"CZ1 HZ1"]
[null,98253,1,1,"CZ1 HZ1"]
[null,98255,1,1,"CZ1 HZ1"]
[null,98257,1,1,"CZ1 HZ1"]
[null,98258,1,1,"CZ1 HZ1"]
[null,98259,1,1,"CZ1 HZ1"]
[null,98260,1,1,"CZ1 HZ1"]
[null,98261,1,1,"CZ1 HZ1"]
[null,98262,1,1,"CZ1 HZ1"]
[null,98264,1,1,"CZ1 HZ1"]
[null,98266,1,1,"CZ1 HZ1"]
[null,98267,1,1,"CZ1 HZ1"]
[null,98270,1,1,"CZ1 HZ1"]
[null,98271,1,1,"CZ1 HZ1"]
[null,98272,1,1,"CZ1 HZ1"]
[null,98273,1,1,"CZ1 HZ1"]
[null,98274,1,1,"CZ1 HZ1"]
[null,98275,1,1,"CZ1 HZ1"]
[null,98276,1,1,"CZ1 HZ1"]
[null,98277,1,1,"CZ1 HZ1"]
[null,98279,1,1,"CZ1 HZ1"]
[null,98281,1,1,"CZ1 HZ1"]
[null,98282,1,1,"CZ1 HZ1"]
[null,98283,2,3,"CZ2 HZ3"]
[null,98284,1,1,"CZ1 HZ1"]
[null,98286,1,1,"CZ1 HZ1"]
[null,98287,1,1,"CZ1 HZ1"]
[null,98290,1,1,"CZ1 HZ1"]
[null,98291,1,1,"CZ1 HZ1"]
[null,98292,1,1,"CZ1 HZ1"]
[null,98293,1,1,"CZ1 HZ1"]
[null,98294,1,1,"CZ1 HZ1"]
[null,98295,1,1,"CZ1 HZ1"]
[null,98296,1,1,"CZ1 HZ1"]
[null,98297,1,1,"CZ1 HZ1"]
[null,98303,1,1,"CZ1 HZ1"]
[null,98304,1,1,"CZ1 HZ1"]
[null,98305,1,1,"CZ1 HZ1"]
[null,98310,1,1,"CZ1 HZ1"]
[null,98311,1,1,"CZ1 HZ1"]
[null,98312,1,1,"CZ1 HZ1"]
[null,98315,1,1,{"$f":"\"CZ\"&C643&\" \"&\"HZ\"&D643","v":"CZ1 HZ1"}]
[null,98320,1,1,"CZ1 HZ1"]
[null,98321,1,1,"CZ1 HZ1"]
[null,98322,1,1,"CZ1 HZ1"]
[null,98323,1,3,"CZ1 HZ3"]
[null,98324,1,1,"CZ1 HZ1"]
[null,98325,1,1,"CZ1 HZ1"]
[null,98326,1,1,"CZ1 HZ1"]
[null,98327,1,1,"CZ1 HZ1"]
[null,98328,1,1,"CZ1 HZ1"]
[null,98329,1,1,"CZ1 HZ1"]
[null,98330,1,1,"CZ1 HZ1"]
[null,98331,1,1,"CZ1 HZ1"]
[null,98332,1,1,"CZ1 HZ1"]
[null,98333,1,1,"CZ1 HZ1"]
[null,98335,1,1,"CZ1 HZ1"]
[null,98336,1,1,"CZ1 HZ1"]
[null,98337,1,1,"CZ1 HZ1"]
[null,98338,1,1,"CZ1 HZ1"]
[null,98339,1,1,"CZ1 HZ1"]
[null,98340,1,1,"CZ1 HZ1"]
[null,98342,1,1,"CZ1 HZ1"]
[null,98345,1,1,"CZ1 HZ1"]
[null,98346,1,1,"CZ1 HZ1"]
[null,98349,1,1,"CZ1 HZ1"]
[null,98351,1,1,"CZ1 HZ1"]
[null,98353,1,1,"CZ1 HZ1"]
[null,98354,1,1,"CZ1 HZ1"]
[null,98355,1,1,"CZ1 HZ1"]
[null,98356,1,1,"CZ1 HZ1"]
[null,98358,1,1,"CZ1 HZ1"]
[null,98359,1,1,"CZ1 HZ1"]
[null,98360,1,1,"CZ1 HZ1"]
[null,98361,1,1,"CZ1 HZ1"]
[null,98362,1,2,"CZ1 HZ2"]
[null,98363,1,1,"CZ1 HZ1"]
[null,98365,1,1,"CZ1 HZ1"]
[null,98366,1,1,"CZ1 HZ1"]
[null,98367,1,1,"CZ1 HZ1"]
[null,98368,1,1,"CZ1 HZ1"]
[null,98370,1,1,"CZ1 HZ1"]
[null,98371,1,1,"CZ1 HZ1"]
[null,98372,1,1,"CZ1 HZ1"]
[null,98373,1,1,"CZ1 HZ1"]
[null,98374,1,1,"CZ1 HZ1"]
[null,98375,1,1,"CZ1 HZ1"]
[null,98376,1,1,"CZ1 HZ1"]
[null,98377,1,1,"CZ1 HZ1"]
[null,98380,1,1,"CZ1 HZ1"]
[null,98381,1,1,"CZ1 HZ1"]
[null,98382,1,1,"CZ1 HZ1"]
[null,98383,1,1,"CZ1 HZ1"]
[null,98385,1,1,"CZ1 HZ1"]
[null,98387,1,1,"CZ1 HZ1"]
[null,98388,1,1,"CZ1 HZ1"]
[null,98390,1,1,"CZ1 HZ1"]
[null,98391,1,1,"CZ1 HZ1"]
[null,98392,1,1,"CZ1 HZ1"]
[null,98393,1,1,"CZ1 HZ1"]
[null,98394,1,1,"CZ1 HZ1"]
[null,98395,1,1,"CZ1 HZ1"]
[null,98401,1,1,"CZ1 HZ1"]
[null,98402,1,1,"CZ1 HZ1"]
[null,98403,1,1,"CZ1 HZ1"]
[null,98404,1,1,{"$f":"\"CZ\"&C707&\" \"&\"HZ\"&D707","v":"CZ1 HZ1"}]
[null,98405,1,1,"CZ1 HZ1"]
[null,98406,1,1,"CZ1 HZ1"]
[null,98407,1,1,"CZ1 HZ1"]
[null,98408,1,1,"CZ1 HZ1"]
[null,98409,1,1,"CZ1 HZ1"]
[null,98411,1,1,"CZ1 HZ1"]
[null,98417,1,1,"CZ1 HZ1"]
[null,98418,1,1,"CZ1 HZ1"]
[null,98419,1,1,"CZ1 HZ1"]
[null,98421,1,1,"CZ1 HZ1"]
[null,98422,1,1,"CZ1 HZ1"]
[null,98424,1,1,"CZ1 HZ1"]
[null,98433,1,1,"CZ1 HZ1"]
[null,98438,1,1,"CZ1 HZ1"]
[null,98439,1,1,"CZ1 HZ1"]
[null,98443,1,1,"CZ1 HZ1"]
[null,98444,1,1,"CZ1 HZ1"]
[null,98445,1,1,"CZ1 HZ1"]
[null,98446,1,1,"CZ1 HZ1"]
[null,98448,1,1,"CZ1 HZ1"]
[null,98464,1,1,"CZ1 HZ1"]
[null,98465,1,1,"CZ1 HZ1"]
[null,98466,1,1,"CZ1 HZ1"]
[null,98467,1,1,"CZ1 HZ1"]
[null,98490,1,1,"CZ1 HZ1"]
[null,98496,1,1,"CZ1 HZ1"]
[null,98498,1,1,"CZ1 HZ1"]
[null,98499,1,1,"CZ1 HZ1"]
[null,98501,1,1,"CZ1 HZ1"]
[null,98502,1,1,"CZ1 HZ1"]
[null,98503,1,1,"CZ1 HZ1"]
[null,98506,1,1,"CZ1 HZ1"]
[null,98507,1,1,"CZ1 HZ1"]
[null,98508,1,1,"CZ1 HZ1"]
[null,98509,1,1,"CZ1 HZ1"]
[null,98511,1,1,"CZ1 HZ1"]
[null,98512,1,1,"CZ1 HZ1"]
[null,98513,1,1,"CZ1 HZ1"]
[null,98516,1,1,"CZ1 HZ1"]
[null,98520,1,1,"CZ1 HZ1"]
[null,98524,1,1,"CZ1 HZ1"]
[null,98526,1,1,"CZ1 HZ1"]
[null,98528,1,1,"CZ1 HZ1"]
[null,98530,1,1,"CZ1 HZ1"]
[null,98531,1,1,"CZ1 HZ1"]
[null,98532,1,1,"CZ1 HZ1"]
[null,98533,1,1,"CZ1 HZ1"]
[null,98535,1,1,"CZ1 HZ1"]
[null,98536,1,1,"CZ1 HZ1"]
[null,98537,1,1,"CZ1 HZ1"]
[null,98538,1,1,"CZ1 HZ1"]
[null,98540,1,1,"CZ1 HZ1"]
[null,98541,1,1,"CZ1 HZ1"]
[null,98542,1,1,"CZ1 HZ1"]
[null,98546,1,1,"CZ1 HZ1"]
[null,98547,1,1,"CZ1 HZ1"]
[null,98548,1,1,"CZ1 HZ1"]
[null,98550,1,1,"CZ1 HZ1"]
[null,98552,1,1,"CZ1 HZ1"]
[null,98555,1,1,"CZ1 HZ1"]
[null,98557,1,1,"CZ1 HZ1"]
[null,98558,1,1,"CZ1 HZ1"]
[null,98559,1,1,"CZ1 HZ1"]
[null,98560,1,1,{"$f":"\"CZ\"&C771&\" \"&\"HZ\"&D771","v":"CZ1 HZ1"}]
[null,98563,1,1,"CZ1 HZ1"]
[null,98564,1,1,"CZ1 HZ1"]
[null,98565,1,1,"CZ1 HZ1"]
[null,98568,1,1,"CZ1 HZ1"]
[null,98569,1,1,"CZ1 HZ1"]
[null,98570,1,1,"CZ1 HZ1"]
[null,98572,1,1,"CZ1 HZ1"]
[null,98575,1,1,"CZ1 HZ1"]
[null,98576,1,1,"CZ1 HZ1"]
[null,98577,1,1,"CZ1 HZ1"]
[null,98579,1,1,"CZ1 HZ1"]
[null,98580,1,1,"CZ1 HZ1"]
[null,98581,1,1,"CZ1 HZ1"]
[null,98582,1,1,"CZ1 HZ1"]
[null,98584,1,1,"CZ1 HZ1"]
[null,98585,1,1,"CZ1 HZ1"]
[null,98586,1,1,"CZ1 HZ1"]
[null,98588,1,1,"CZ1 HZ1"]
[null,98589,1,1,"CZ1 HZ1"]
[null,98590,1,1,"CZ1 HZ1"]
[null,98591,1,1,"CZ1 HZ1"]
[null,98592,1,1,"CZ1 HZ1"]
[null,98593,1,1,"CZ1 HZ1"]
[null,98595,1,1,"CZ1 HZ1"]
[null,98596,1,1,"CZ1 HZ1"]
[null,98597,1,1,"CZ1 HZ1"]
[null,98601,1,1,"CZ1 HZ1"]
[null,98602,1,2,"CZ1 HZ2"]
[null,98603,1,2,"CZ1 HZ2"]
[null,98604,1,1,"CZ1 HZ1"]
[null,98605,3,1,"CZ3 HZ1"]
[null,98606,1,1,"CZ1 HZ1"]
[null,98607,1,1,"CZ1 HZ1"]
[null,98609,1,1,"CZ1 HZ1"]
[null,98610,2,1,"CZ2 HZ1"]
[null,98611,1,1,"CZ1 HZ1"]
[null,98612,1,1,"CZ1 HZ1"]
[null,98613,2,2,"CZ2 HZ2"]
[null,98614,1,1,"CZ1 HZ1"]
[null,98616,2,1,"CZ2 HZ1"]
[null,98617,3,1,"CZ3 HZ1"]
[null,98619,1,2,"CZ1 HZ2"]
[null,98620,2,2,"CZ2 HZ2"]
[null,98621,1,1,"CZ1 HZ1"]
[null,98622,1,1,"CZ1 HZ1"]
[null,98624,1,1,"CZ1 HZ1"]
[null,98625,1,1,"CZ1 HZ1"]
[null,98626,1,1,"CZ1 HZ1"]
[null,98628,2,1,"CZ2 HZ1"]
[null,98629,1,1,"CZ1 HZ1"]
[null,98631,1,1,"CZ1 HZ1"]
[null,98632,1,1,"CZ1 HZ1"]
[null,98635,2,1,"CZ2 HZ1"]
[null,98638,1,1,"CZ1 HZ1"]
[null,98639,2,1,"CZ2 HZ1"]
[null,98640,1,1,"CZ1 HZ1"]
[null,98641,1,1,"CZ1 HZ1"]
[null,98642,1,1,"CZ1 HZ1"]
[null,98643,1,1,"CZ1 HZ1"]
[null,98644,1,1,"CZ1 HZ1"]
[null,98645,1,1,"CZ1 HZ1"]
[null,98647,1,1,"CZ1 HZ1"]
[null,98648,2,1,"CZ2 HZ1"]
[null,98649,1,1,{"$f":"\"CZ\"&C835&\" \"&\"HZ\"&D835","v":"CZ1 HZ1"}]
[null,98650,1,2,"CZ1 HZ2"]
[null,98651,1,2,"CZ1 HZ2"]
[null,98660,2,1,"CZ2 HZ1"]
[null,98661,1,1,"CZ1 HZ1"]
[null,98662,1,1,"CZ1 HZ1"]
[null,98663,1,1,"CZ1 HZ1"]
[null,98664,1,1,"CZ1 HZ1"]
[null,98665,1,1,"CZ1 HZ1"]
[null,98666,2,1,"CZ2 HZ1"]
[null,98668,1,1,"CZ1 HZ1"]
[null,98670,1,2,"CZ1 HZ2"]
[null,98671,1,1,"CZ1 HZ1"]
[null,98672,2,1,"CZ2 HZ1"]
[null,98673,2,1,"CZ2 HZ1"]
[null,98674,2,1,"CZ2 HZ1"]
[null,98675,1,2,"CZ1 HZ2"]
[null,98682,1,1,"CZ1 HZ1"]
[null,98683,1,1,"CZ1 HZ1"]
[null,98684,1,1,"CZ1 HZ1"]
[null,98685,2,1,"CZ2 HZ1"]
[null,98686,1,1,"CZ1 HZ1"]
[null,98687,1,1,"CZ1 HZ1"]
[null,98801,3,1,"CZ3 HZ1"]
[null,98802,3,1,"CZ3 HZ1"]
[null,98807,3,1,"CZ3 HZ1"]
[null,98812,3,1,"CZ3 HZ1"]
[null,98813,3,1,"CZ3 HZ1"]
[null,98814,2,2,"CZ2 HZ2"]
[null,98815,3,1,"CZ3 HZ1"]
[null,98816,3,2,"CZ3 HZ2"]
[null,98822,2,3,"CZ2 HZ3"]
[null,98823,3,1,"CZ3 HZ1"]
[null,98826,2,3,"CZ2 HZ3"]
[null,98827,3,2,"CZ3 HZ2"]
[null,98828,3,1,"CZ3 HZ1"]
[null,98830,1,2,"CZ1 HZ2"]
[null,98831,3,2,"CZ3 HZ2"]
[null,98832,2,2,"CZ2 HZ2"]
[null,98833,1,3,"CZ1 HZ3"]
[null,98834,3,2,"CZ3 HZ2"]
[null,98837,3,1,"CZ3 HZ1"]
[null,98840,3,2,"CZ3 HZ2"]
[null,98841,3,1,"CZ3 HZ1"]
[null,98843,3,2,"CZ3 HZ2"]
[null,98844,1,3,"CZ1 HZ3"]
[null,98845,3,1,"CZ3 HZ1"]
[null,98846,3,2,"CZ3 HZ2"]
[null,98847,2,2,"CZ2 HZ2"]
[null,98848,3,1,"CZ3 HZ1"]
[null,98849,1,3,"CZ1 HZ3"]
[null,98850,3,1,"CZ3 HZ1"]
[null,98851,3,1,"CZ3 HZ1"]
[null,98853,3,1,"CZ3 HZ1"]
[null,98855,1,3,"CZ1 HZ3"]
[null,98856,2,2,"CZ2 HZ2"]
[null,98857,3,1,"CZ3 HZ1"]
[null,98858,2,3,"CZ2 HZ3"]
[null,98859,1,3,"CZ1 HZ3"]
[null,98860,2,2,"CZ2 HZ2"]
[null,98862,2,3,"CZ2 HZ3"]
[null,98901,3,1,"CZ3 HZ1"]
[null,98902,3,1,"CZ3 HZ1"]
[null,98903,3,1,"CZ3 HZ1"]
[null,98907,3,1,{"$f":"\"CZ\"&C899&\" \"&\"HZ\"&D899","v":"CZ3 HZ1"}]
[null,98908,3,1,"CZ3 HZ1"]
[null,98909,3,1,"CZ3 HZ1"]
[null,98921,3,1,"CZ3 HZ1"]
[null,98922,1,2,"CZ1 HZ2"]
[null,98923,2,1,"CZ2 HZ1"]
[null,98926,2,2,"CZ2 HZ2"]
[null,98930,3,1,"CZ3 HZ1"]
[null,98932,2,2,"CZ2 HZ2"]
[null,98933,3,1,"CZ3 HZ1"]
[null,98935,2,2,"CZ2 HZ2"]
[null,98936,3,1,"CZ3 HZ1"]
[null,98937,2,1,"CZ2 HZ1"]
[null,98938,2,2,"CZ2 HZ2"]
[null,98942,2,2,"CZ2 HZ2"]
[null,98944,2,2,"CZ2 HZ2"]
[null,98946,2,1,"CZ2 HZ1"]
[null,98947,1,2,"CZ1 HZ2"]
[null,98948,3,1,"CZ3 HZ1"]
[null,98951,3,1,"CZ3 HZ1"]
[null,98952,3,1,"CZ3 HZ1"]
[null,98953,3,1,"CZ3 HZ1"]
[null,99001,1,2,"CZ1 HZ2"]
[null,99003,2,2,"CZ2 HZ2"]
[null,99004,2,2,"CZ2 HZ2"]
[null,99005,2,2,"CZ2 HZ2"]
[null,99006,1,2,"CZ1 HZ2"]
[null,99008,1,2,"CZ1 HZ2"]
[null,99009,1,2,"CZ1 HZ2"]
[null,99011,1,2,"CZ1 HZ2"]
[null,99012,2,2,"CZ2 HZ2"]
[null,99013,2,2,"CZ2 HZ2"]
[null,99014,2,2,"CZ2 HZ2"]
[null,99016,2,2,"CZ2 HZ2"]
[null,99017,2,2,"CZ2 HZ2"]
[null,99018,2,2,"CZ2 HZ2"]
[null,99019,2,2,"CZ2 HZ2"]
[null,99021,2,2,"CZ2 HZ2"]
[null,99022,1,2,"CZ1 HZ2"]
[null,99023,2,2,"CZ2 HZ2"]
[null,99025,2,2,"CZ2 HZ2"]
[null,99026,2,2,"CZ2 HZ2"]
[null,99027,2,2,"CZ2 HZ2"]
[null,99029,1,2,"CZ1 HZ2"]
[null,99030,2,2,"CZ2 HZ2"]
[null,99031,2,2,"CZ2 HZ2"]
[null,99032,1,2,"CZ1 HZ2"]
[null,99033,2,2,"CZ2 HZ2"]
[null,99034,1,2,"CZ1 HZ2"]
[null,99036,2,2,"CZ2 HZ2"]
[null,99037,2,2,"CZ2 HZ2"]
[null,99040,1,3,"CZ1 HZ3"]
[null,99101,1,3,"CZ1 HZ3"]
[null,99103,2,2,"CZ2 HZ2"]
[null,99104,1,2,"CZ1 HZ2"]
[null,99105,2,1,"CZ2 HZ1"]
[null,99109,1,2,"CZ1 HZ2"]
[null,99110,1,2,"CZ1 HZ2"]
[null,99111,2,2,"CZ2 HZ2"]
[null,99113,1,2,"CZ1 HZ2"]
[null,99114,2,2,"CZ2 HZ2"]
[null,99115,1,2,"CZ1 HZ2"]
[null,99116,3,1,"CZ3 HZ1"]
[null,99117,1,3,"CZ1 HZ3"]
[null,99118,1,3,{"$f":"\"CZ\"&C963&\" \"&\"HZ\"&D963","v":"CZ1 HZ3"}]
[null,99119,1,2,"CZ1 HZ2"]
[null,99121,1,3,"CZ1 HZ3"]
[null,99122,1,3,"CZ1 HZ3"]
[null,99123,3,2,"CZ3 HZ2"]
[null,99125,2,2,"CZ2 HZ2"]
[null,99126,2,2,"CZ2 HZ2"]
[null,99128,1,2,"CZ1 HZ2"]
[null,99129,1,2,"CZ1 HZ2"]
[null,99130,2,2,"CZ2 HZ2"]
[null,99131,1,3,"CZ1 HZ3"]
[null,99133,3,2,"CZ3 HZ2"]
[null,99134,1,2,"CZ1 HZ2"]
[null,99135,2,2,"CZ2 HZ2"]
[null,99136,2,1,"CZ2 HZ1"]
[null,99137,1,3,"CZ1 HZ3"]
[null,99138,1,3,"CZ1 HZ3"]
[null,99139,1,2,"CZ1 HZ2"]
[null,99140,1,2,"CZ1 HZ2"]
[null,99141,2,2,"CZ2 HZ2"]
[null,99143,2,1,"CZ2 HZ1"]
[null,99144,2,2,"CZ2 HZ2"]
[null,99147,1,3,"CZ1 HZ3"]
[null,99148,1,2,"CZ1 HZ2"]
[null,99149,2,2,"CZ2 HZ2"]
[null,99150,1,3,"CZ1 HZ3"]
[null,99153,1,2,"CZ1 HZ2"]
[null,99154,1,2,"CZ1 HZ2"]
[null,99156,1,2,"CZ1 HZ2"]
[null,99157,1,2,"CZ1 HZ2"]
[null,99158,2,2,"CZ2 HZ2"]
[null,99159,2,2,"CZ2 HZ2"]
[null,99160,1,2,"CZ1 HZ2"]
[null,99161,1,2,"CZ1 HZ2"]
[null,99163,2,2,"CZ2 HZ2"]
[null,99166,1,3,"CZ1 HZ3"]
[null,99167,1,3,"CZ1 HZ3"]
[null,99169,2,2,"CZ2 HZ2"]
[null,99170,2,2,"CZ2 HZ2"]
[null,99171,2,2,"CZ2 HZ2"]
[null,99173,1,2,"CZ1 HZ2"]
[null,99176,2,2,"CZ2 HZ2"]
[null,99179,1,2,"CZ1 HZ2"]
[null,99180,1,2,"CZ1 HZ2"]
[null,99181,1,2,"CZ1 HZ2"]
[null,99185,1,2,"CZ1 HZ2"]
[null,99201,2,2,"CZ2 HZ2"]
[null,99202,2,2,"CZ2 HZ2"]
[null,99203,2,2,"CZ2 HZ2"]
[null,99204,2,2,"CZ2 HZ2"]
[null,99205,2,2,"CZ2 HZ2"]
[null,99206,2,2,"CZ2 HZ2"]
[null,99207,2,2,"CZ2 HZ2"]
[null,99208,2,2,"CZ2 HZ2"]
[null,99209,2,2,"CZ2 HZ2"]
[null,99210,2,2,"CZ2 HZ2"]
[null,99211,2,2,"CZ2 HZ2"]
[null,99212,2,2,"CZ2 HZ2"]
[null,99213,2,2,"CZ2 HZ2"]
[null,99214,2,2,"CZ2 HZ2"]
[null,99216,2,2,"CZ2 HZ2"]
[null,99217,2,2,"CZ2 HZ2"]
[null,99218,2,2,"CZ2 HZ2"]
[null,99219,2,2,"CZ2 HZ2"]
[null,99220,2,2,{"$f":"\"CZ\"&C1027&\" \"&\"HZ\"&D1027","v":"CZ2 HZ2"}]
[null,99223,2,2,"CZ2 HZ2"]
[null,99224,2,2,"CZ2 HZ2"]
[null,99228,2,2,"CZ2 HZ2"]
[null,99301,3,1,"CZ3 HZ1"]
[null,99302,3,1,"CZ3 HZ1"]
[null,99320,3,1,"CZ3 HZ1"]
[null,99321,3,1,"CZ3 HZ1"]
[null,99322,2,2,"CZ2 HZ2"]
[null,99323,3,1,"CZ3 HZ1"]
[null,99324,2,1,"CZ2 HZ1"]
[null,99326,3,1,"CZ3 HZ1"]
[null,99328,2,1,"CZ2 HZ1"]
[null,99329,2,1,"CZ2 HZ1"]
[null,99330,2,1,"CZ2 HZ1"]
[null,99336,3,1,"CZ3 HZ1"]
[null,99337,3,1,"CZ3 HZ1"]
[null,99338,3,1,"CZ3 HZ1"]
[null,99341,2,1,"CZ2 HZ1"]
[null,99343,2,1,"CZ2 HZ1"]
[null,99344,3,1,"CZ3 HZ1"]
[null,99347,2,1,"CZ2 HZ1"]
[null,99348,3,1,"CZ3 HZ1"]
[null,99349,2,2,"CZ2 HZ2"]
[null,99350,3,1,"CZ3 HZ1"]
[null,99352,3,1,"CZ3 HZ1"]
[null,99353,2,1,"CZ2 HZ1"]
[null,99354,3,1,"CZ3 HZ1"]
[null,99356,2,2,"CZ2 HZ2"]
[null,99357,3,1,"CZ3 HZ1"]
[null,99360,2,1,"CZ2 HZ1"]
[null,99361,2,1,"CZ2 HZ1"]
[null,99362,3,1,"CZ3 HZ1"]
[null,99371,3,1,"CZ3 HZ1"]
[null,99401,1,2,"CZ1 HZ2"]
[null,99402,2,1,"CZ2 HZ1"]
[null,99403,3,1,"CZ3 HZ1"]