{"text_format":"1","workbook":"xlsx","n_sheets":8,"sheets":["User Terms and Conditions","Instructions","Calculator","Hidden Cells","Incentives","Lists","Avoided Costs","Com LU Table"],"not_rendered":{"charts":0,"images":0,"macros":1,"external_links":3,"defined_names":134,"comments":1,"pivot_tables":0},"unopened":[],"bounds":{"document_bytes":16777216,"sheet_cells":100000,"rows_first":2000,"rows_last":500,"rows_between":2000,"halvings":0,"cell_chars":16384,"cell_head_chars":4096},"cells_cut":0,"cells_raw":0,"read":"whole","date_system":"1900"}

{"sheet":"User Terms and Conditions","index":0,"n_rows":15,"n_cols":1,"rows_kept":15,"cut":false,"hidden":false,"merged":[]}
["EXISTING BUILDINGS ATAC COST-EFFECTIVENESS CALCULATOR TOOL TERMS AND CONDITONS OF USE:"]
[]
["·         This Existing Buildings ATAC Cost-Effectiveness (C/E) Calculator tool and its information (the Tool) was developed and is made available by Energy Trust of Oregon, Inc. (Energy Trust) to its authorized Existing Buildings Allied Technical Assistance Contractors (ATACs) for informational purposes only. Use of this Tool is subject to acceptance of these Terms and Conditions of Use. "]
[]
["·         This Tool is intended for the sole purpose of assisting ATACs with an initial, high-level C/E review to help inform ATAC’s discussion with Energy Trust’s Existing Buildings program management contractor (PMC) about whether a potential custom measure may be a good candidate to propose for additional technical analysis under the Existing Buildings program. "]
[]
["·         ATAC will only allow its trained employees to access and use the Tool and will not distribute the Tool to any other entity. Details about Energy Trust’s Existing Buildings C/E criteria, program or incentives as may be included in the Tool are time sensitive and subject to change. "]
[]
["·         ATAC will use the most current version of the Tool at all times and will immediately discontinue its use of the Tool if its Existing Buildings ATAC status is terminated."]
[]
["·         To meet Energy Trust C/E criteria, a measure must pass both a utility system and total resource cost test. Changes to formula assumptions or an ATAC’s inputs or estimates such as business type, non-energy benefits, avoided costs, discount rates, measure description, measure life, costs or savings will impact C/E test results. While ATACs are expected to use the Tool according to Existing Buildings requirements, the inputs and estimates used by Energy Trust or its PMC may differ from those used by ATAC and C/E test results may vary. "]
[]
["·         Final determination about whether a proposed measure meets Energy Trust’s C/E criteria or may otherwise qualify for additional technical analysis and Energy Trust incentives rests solely with Energy Trust. "]
[]
["·         Actual cost or savings results from a customer’s program participation may vary from the estimates or examples provided in the Tool for a number of reasons. Energy Trust does not guarantee any particular cost or energy savings results from participation in its programs and shall not be responsible for any claims relating to errors, omissions or other inaccuracies resulting from the use of the Tool, or from the reliance on information procured therefrom. "]

{"sheet":"Instructions","index":1,"n_rows":8,"n_cols":1,"rows_kept":8,"cut":false,"hidden":false,"merged":[[11,0,11,9],[10,0,10,9],[9,0,9,9],[8,0,8,9],[7,0,7,9],[18,0,18,9],[12,0,12,9],[13,0,13,9],[14,0,14,9],[15,0,15,9],[16,0,16,9],[17,0,17,9],[6,0,6,9],[0,0,0,9],[3,0,3,9],[2,0,2,9],[4,0,4,9],[5,0,5,9],[1,0,1,9]]}
["Instructions for use of Energy Trust Cost Effectiveness Calculator"]
["1. Enter the site utility information in the upper-right section of the calculator."]
["2. Enter the measure name or description in the first column."]
["3. Select the business type."]
["4. Choose the best appropriate load profile descriptors for when the savings happen."]
["    For example, choose \"Res Ele Resistance Heating\" for weatherization measures at a home with resistance heat, since the savings primarily happen during the heating season."]
["If there are no savings for a particular fuel, choose \"None\" for the load profile for that fuel."]
["5. Enter the measure life, estimated savings, incremental measure cost, annual non-energy benefit value (if any), and incentive in the remaining columns."]

{"sheet":"Calculator","index":2,"n_rows":26,"n_cols":12,"rows_kept":26,"cut":false,"hidden":false,"merged":[[25,0,26,0],[0,0,0,5],[1,0,1,5],[2,0,2,5],[3,2,3,3],[3,4,3,5],[4,1,4,5],[5,1,5,5],[25,1,26,9],[6,1,6,5],[12,0,13,0],[12,1,13,1],[12,2,13,2],[12,4,12,5],[12,11,13,11],[7,1,7,5],[9,1,9,5],[10,2,10,3],[10,4,10,5],[12,6,13,6],[12,7,12,8],[0,6,10,11],[12,9,13,9],[12,10,13,10]]}
["Energy Trust of Oregon",null,null,null,null,null,"Please read the Terms and Conditions of Use and the Instructions carefully before using this Tool. \n\nOnly active, approved Existing Buildings ATACs are allowed to access this Tool subject to the Terms and Conditions of Use. This Tool is intended for the sole purpose of assisting ATACs with an initial, high-level C/E review to help inform ATAC’s discussion with Energy Trust’s Existing Buildings PMC about whether a potential custom measure may be a good candidate for additional technical analysis under the Existing Buildings program. Details about Energy Trust’s Existing Buildings C/E criteria, program or incentives as may be included in the Tool are time sensitive and subject to change. Final determination about whether a proposed measure meets Energy Trust’s C/E criteria or may otherwise qualify for additional technical analysis or Energy Trust incentives rests solely with Energy Trust. "]
["ATAC Cost-Effectiveness Calculator Tool"]
["Commercial Sector "]
["Version: ",{"$f":"version","v":"v2022.1"},"Today's Date:"]
["ATAC Name:"]
["Customer Name:"," "]
["Project Name:"," "]
["Site Address:"]
["City:",null,"State",null,"Zip:"," "]
["Sector","Commercial"]
["Electric Utility:",null,"Gas Utility:"]
[]
["#","Measure","Sub-sector",null,"Load Profile",null,"Measure Life (yrs)","Savings",null,"Measure Cost ($)","Non-Energy Benefits (Annual $)","Likelihood of Meeting Cost Effectiveness Criteria"]
[null,null,null,"RCx?","Electric","Gas",null,"kWh","therms"]
[1,null,null,null,null,null,null,null,null,null,null,{"$f":"IF(AND(N('Hidden Cells'!B15)>=0.95, N('Hidden Cells'!C15)>=0.95), \"Yes\", IF(AND(N('Hidden Cells'!C15)>=0.8, N('Hidden Cells'!C15)>=0.8), \"Maybe\", \"No\"))","v":"No"}]
[{"$f":"A15+1","v":2},null,null,null,null,null,null,null,null,null,null,{"$f":"IF(AND(N('Hidden Cells'!B16)>=0.95, N('Hidden Cells'!C16)>=0.95), \"Yes\", IF(AND(N('Hidden Cells'!C16)>=0.8, N('Hidden Cells'!C16)>=0.8), \"Maybe\", \"No\"))","v":"No"}]
[3,null,null,null,null,null,null,null,null,null,null,{"$f":"IF(AND(N('Hidden Cells'!B17)>=0.95, N('Hidden Cells'!C17)>=0.95), \"Yes\", IF(AND(N('Hidden Cells'!C17)>=0.8, N('Hidden Cells'!C17)>=0.8), \"Maybe\", \"No\"))","v":"No"}]
[4,null,null,null,null,null,null,null,null,null,null,{"$f":"IF(AND(N('Hidden Cells'!B18)>=0.95, N('Hidden Cells'!C18)>=0.95), \"Yes\", IF(AND(N('Hidden Cells'!C18)>=0.8, N('Hidden Cells'!C18)>=0.8), \"Maybe\", \"No\"))","v":"No"}]
[5,null,null,null,null,null,null,null,null,null,null,{"$f":"IF(AND(N('Hidden Cells'!B19)>=0.95, N('Hidden Cells'!C19)>=0.95), \"Yes\", IF(AND(N('Hidden Cells'!C19)>=0.8, N('Hidden Cells'!C19)>=0.8), \"Maybe\", \"No\"))","v":"No"}]
[6,null,null,null,null,null,null,null,null,null,null,{"$f":"IF(AND(N('Hidden Cells'!B20)>=0.95, N('Hidden Cells'!C20)>=0.95), \"Yes\", IF(AND(N('Hidden Cells'!C20)>=0.8, N('Hidden Cells'!C20)>=0.8), \"Maybe\", \"No\"))","v":"No"}]
[7,null,null,null,null,null,null,null,null,null,null,{"$f":"IF(AND(N('Hidden Cells'!B21)>=0.95, N('Hidden Cells'!C21)>=0.95), \"Yes\", IF(AND(N('Hidden Cells'!C21)>=0.8, N('Hidden Cells'!C21)>=0.8), \"Maybe\", \"No\"))","v":"No"}]
[8,null,null,null,null,null,null,null,null,null,null,{"$f":"IF(AND(N('Hidden Cells'!B22)>=0.95, N('Hidden Cells'!C22)>=0.95), \"Yes\", IF(AND(N('Hidden Cells'!C22)>=0.8, N('Hidden Cells'!C22)>=0.8), \"Maybe\", \"No\"))","v":"No"}]
[9,null,null,null,null,null,null,null,null,null,null,{"$f":"IF(AND(N('Hidden Cells'!B23)>=0.95, N('Hidden Cells'!C23)>=0.95), \"Yes\", IF(AND(N('Hidden Cells'!C23)>=0.8, N('Hidden Cells'!C23)>=0.8), \"Maybe\", \"No\"))","v":"No"}]
[10,null,null,null,null,null,null,null,null,null,null,{"$f":"IF(AND(N('Hidden Cells'!B24)>=0.95, N('Hidden Cells'!C24)>=0.95), \"Yes\", IF(AND(N('Hidden Cells'!C24)>=0.8, N('Hidden Cells'!C24)>=0.8), \"Maybe\", \"No\"))","v":"No"}]
[]
["Comments:"]

{"sheet":"Hidden Cells","index":3,"n_rows":24,"n_cols":15,"rows_kept":24,"cut":false,"hidden":true,"merged":[[12,1,13,1],[12,2,13,2],[12,5,12,6],[12,0,13,0],[12,14,13,14]]}
[]
[]
[]
[]
[]
[]
[]
[]
[]
[]
[]
[]
["Eligible Incentive ($)","Utility BCR ","TRC BCR",null,null,"Incentive Split",null,null,"Incentive Calculator",null,null,null,null,null,"Eligible Incentive"]
[null,null,null,null,"Full Ele Load Profile","Electric","Gas",null,"Measure","Project Type","Simple Payback","≥ Min Payback?","Incentive if C/E"]
[{"$f":"IFERROR(IF(AND(B15>=0.95, C15>=0.95), Incentives!H15, 0), \"\")","v":0},{"$f":"IFERROR((gas_eligible*INDEX('Avoided Costs'!$B$3:$G$72,MATCH(Calculator!$G15,'Avoided Costs'!$A$3:$A$72,0),MATCH(Calculator!$F15,'Avoided Costs'!$B$2:$G$2,0))*Calculator!I15+ele_eligible*VLOOKUP($E15,'Avoided Costs'!$L$4:$CF$184,MATCH(Calculator!$G15,'Avoided Costs'!$L$3:$CF$3,0),0)*Calculator!H15)/Incentives!F15, \"\")","v":""},{"$f":"IFERROR((IF(gas_eligible, INDEX('Avoided Costs'!$B$3:$G$72,MATCH(Calculator!$G15,'Avoided Costs'!$A$3:$A$72,0),MATCH(Calculator!$F15,'Avoided Costs'!$B$2:$G$2,0)), PV(discount,Calculator!G15,-gas_rate))*Calculator!I15+IF(ele_eligible, VLOOKUP($E15,'Avoided Costs'!$L$4:$CF$184,MATCH(Calculator!$G15,'Avoided Costs'!$L$3:$CF$3,0),0), PV(discount,Calculator!G15,-ele_rate))*Calculator!H15+PV(discount,Calculator!G15, -Calculator!K15))/Calculator!J15, \"\")","v":""},null,{"$f":"IF(OR(Calculator!$B$10=\"Residential\",Calculator!$B$10=\"Industrial\"),INDEX(ShapeNameList,MATCH(Calculator!E15, ShapeDescriptions,0)),INDEX(Com_LP_Table,MATCH(Calculator!$C15,'Com LU Table'!$B$3:$B$13,0),MATCH(Calculator!E15,'Com LU Table'!$C$2:$P$2,0)))","v":{"$error":"#N/A"}},{"$f":"IFERROR(ele_eligible*VLOOKUP($E15,'Avoided Costs'!$L$4:$CF$183,MATCH(Calculator!$G15,'Avoided Costs'!$L$3:$CF$3,0),0)*MAX(Calculator!H15,0)/(ele_eligible*VLOOKUP($E15,'Avoided Costs'!$L$4:$CF$183,MATCH(Calculator!$G15,'Avoided Costs'!$L$3:$CF$3,0),0)*MAX(Calculator!H15,0)+gas_eligible*INDEX('Avoided Costs'!$B$3:$G$72,MATCH(Calculator!$G15,'Avoided Costs'!$A$3:$A$72,0),MATCH(Calculator!$F15,'Avoided Costs'!$B$2:$G$2,0))*MAX(Calculator!I15,0))*A15, \"\")","v":""},{"$f":"IF(F15=\"\", \"\", A15-F15)","v":""},null,1,{"$f":"IF(AND(Calculator!I15>0,Calculator!J15>0, ele_eligible, gas_eligible), \"Dual Fuel\", IF(AND(Calculator!I15>0, ele_eligible), \"Electric Only\", IF(AND(Calculator!J15>0, gas_eligible), \"Gas Only\", \"\")))","v":""},{"$f":"IFERROR(Calculator!K15/(Calculator!I15*ele_rate+Calculator!J15*gas_rate), \"\")","v":""},{"$f":"IFERROR(IF(K15>=IF(Calculator!E15=\"Yes\", Calculator!$E$7, VLOOKUP(J15, Calculator!$A$4:$E$7, 5, FALSE)), \"Yes\", \"No\"), \"\")","v":""},{"$f":"IFERROR(MIN(ele_eligible*inc_per_kwh*Calculator!I15+gas_eligible*inc_per_therm*Calculator!J15, inc_cost_cap*Calculator!K15),\"\")","v":""},null,{"$f":"IFERROR(IF(AND('Hidden Cells'!L15=\"Yes\", Calculator!L15=\"Yes\"), 'Hidden Cells'!M15, 0), \"\")","v":0}]
[{"$f":"IFERROR(IF(AND(B16>=0.95, C16>=0.95), Incentives!H16, 0), \"\")","v":0},{"$f":"IFERROR((gas_eligible*INDEX('Avoided Costs'!$B$3:$G$72,MATCH(Calculator!$G16,'Avoided Costs'!$A$3:$A$72,0),MATCH(Calculator!$F16,'Avoided Costs'!$B$2:$G$2,0))*Calculator!I16+ele_eligible*VLOOKUP($E16,'Avoided Costs'!$L$4:$CF$184,MATCH(Calculator!$G16,'Avoided Costs'!$L$3:$CF$3,0),0)*Calculator!H16)/Incentives!F16, \"\")","v":""},{"$f":"IFERROR((IF(gas_eligible, INDEX('Avoided Costs'!$B$3:$G$72,MATCH(Calculator!$G16,'Avoided Costs'!$A$3:$A$72,0),MATCH(Calculator!$F16,'Avoided Costs'!$B$2:$G$2,0)), PV(discount,Calculator!G16,-gas_rate))*Calculator!I16+IF(ele_eligible, VLOOKUP($E16,'Avoided Costs'!$L$4:$CF$184,MATCH(Calculator!$G16,'Avoided Costs'!$L$3:$CF$3,0),0), PV(discount,Calculator!G16,-ele_rate))*Calculator!H16+PV(discount,Calculator!G16, -Calculator!K16))/Calculator!J16, \"\")","v":""},null,{"$f":"IF(OR(Calculator!$B$10=\"Residential\",Calculator!$B$10=\"Industrial\"),INDEX(ShapeNameList,MATCH(Calculator!E16, ShapeDescriptions,0)),INDEX(Com_LP_Table,MATCH(Calculator!$C16,'Com LU Table'!$B$3:$B$13,0),MATCH(Calculator!E16,'Com LU Table'!$C$2:$P$2,0)))","v":{"$error":"#N/A"}},{"$f":"IFERROR(ele_eligible*VLOOKUP($E16,'Avoided Costs'!$L$4:$CF$183,MATCH(Calculator!$G16,'Avoided Costs'!$L$3:$CF$3,0),0)*MAX(Calculator!H16,0)/(ele_eligible*VLOOKUP($E16,'Avoided Costs'!$L$4:$CF$183,MATCH(Calculator!$G16,'Avoided Costs'!$L$3:$CF$3,0),0)*MAX(Calculator!H16,0)+gas_eligible*INDEX('Avoided Costs'!$B$3:$G$72,MATCH(Calculator!$G16,'Avoided Costs'!$A$3:$A$72,0),MATCH(Calculator!$F16,'Avoided Costs'!$B$2:$G$2,0))*MAX(Calculator!I16,0))*A16, \"\")","v":""},"",null,2,{"$f":"IF(AND(Calculator!I16>0,Calculator!J16>0, ele_eligible, gas_eligible), \"Dual Fuel\", IF(AND(Calculator!I16>0, ele_eligible), \"Electric Only\", IF(AND(Calculator!J16>0, gas_eligible), \"Gas Only\", \"\")))","v":""},{"$f":"IFERROR(Calculator!K16/(Calculator!I16*ele_rate+Calculator!J16*gas_rate), \"\")","v":""},{"$f":"IFERROR(IF(K16>=IF(Calculator!E16=\"Yes\",#REF!, VLOOKUP( J16,#REF!, 5, FALSE)), \"Yes\", \"No\"), \"\")","v":""},{"$f":"IFERROR(MIN(ele_eligible*inc_per_kwh*Calculator!I16+gas_eligible*inc_per_therm*Calculator!J16, inc_cost_cap*Calculator!K16),\"\")","v":""},null,{"$f":"IFERROR(IF(AND('Hidden Cells'!L16=\"Yes\", Calculator!L16=\"Yes\"), 'Hidden Cells'!M16, 0), \"\")","v":0}]
[{"$f":"IFERROR(IF(AND(B17>=0.95, C17>=0.95), Incentives!H17, 0), \"\")","v":0},{"$f":"IFERROR((gas_eligible*INDEX('Avoided Costs'!$B$3:$G$72,MATCH(Calculator!$G17,'Avoided Costs'!$A$3:$A$72,0),MATCH(Calculator!$F17,'Avoided Costs'!$B$2:$G$2,0))*Calculator!I17+ele_eligible*VLOOKUP($E17,'Avoided Costs'!$L$4:$CF$184,MATCH(Calculator!$G17,'Avoided Costs'!$L$3:$CF$3,0),0)*Calculator!H17)/Incentives!F17, \"\")","v":""},{"$f":"IFERROR((IF(gas_eligible, INDEX('Avoided Costs'!$B$3:$G$72,MATCH(Calculator!$G17,'Avoided Costs'!$A$3:$A$72,0),MATCH(Calculator!$F17,'Avoided Costs'!$B$2:$G$2,0)), PV(discount,Calculator!G17,-gas_rate))*Calculator!I17+IF(ele_eligible, VLOOKUP($E17,'Avoided Costs'!$L$4:$CF$184,MATCH(Calculator!$G17,'Avoided Costs'!$L$3:$CF$3,0),0), PV(discount,Calculator!G17,-ele_rate))*Calculator!H17+PV(discount,Calculator!G17, -Calculator!K17))/Calculator!J17, \"\")","v":""},null,{"$f":"IF(OR(Calculator!$B$10=\"Residential\",Calculator!$B$10=\"Industrial\"),INDEX(ShapeNameList,MATCH(Calculator!E17, ShapeDescriptions,0)),INDEX(Com_LP_Table,MATCH(Calculator!$C17,'Com LU Table'!$B$3:$B$13,0),MATCH(Calculator!E17,'Com LU Table'!$C$2:$P$2,0)))","v":{"$error":"#N/A"}},{"$f":"IFERROR(ele_eligible*VLOOKUP($E17,'Avoided Costs'!$L$4:$CF$183,MATCH(Calculator!$G17,'Avoided Costs'!$L$3:$CF$3,0),0)*MAX(Calculator!H17,0)/(ele_eligible*VLOOKUP($E17,'Avoided Costs'!$L$4:$CF$183,MATCH(Calculator!$G17,'Avoided Costs'!$L$3:$CF$3,0),0)*MAX(Calculator!H17,0)+gas_eligible*INDEX('Avoided Costs'!$B$3:$G$72,MATCH(Calculator!$G17,'Avoided Costs'!$A$3:$A$72,0),MATCH(Calculator!$F17,'Avoided Costs'!$B$2:$G$2,0))*MAX(Calculator!I17,0))*A17, \"\")","v":""},"",null,3,{"$f":"IF(AND(Calculator!I17>0,Calculator!J17>0, ele_eligible, gas_eligible), \"Dual Fuel\", IF(AND(Calculator!I17>0, ele_eligible), \"Electric Only\", IF(AND(Calculator!J17>0, gas_eligible), \"Gas Only\", \"\")))","v":""},{"$f":"IFERROR(Calculator!K17/(Calculator!I17*ele_rate+Calculator!J17*gas_rate), \"\")","v":""},{"$f":"IFERROR(IF(K17>=IF(Calculator!E17=\"Yes\",#REF!, VLOOKUP( J17,#REF!, 5, FALSE)), \"Yes\", \"No\"), \"\")","v":""},{"$f":"IFERROR(MIN(ele_eligible*inc_per_kwh*Calculator!I17+gas_eligible*inc_per_therm*Calculator!J17, inc_cost_cap*Calculator!K17),\"\")","v":""},null,{"$f":"IFERROR(IF(AND('Hidden Cells'!L17=\"Yes\", Calculator!L17=\"Yes\"), 'Hidden Cells'!M17, 0), \"\")","v":0}]
[{"$f":"IFERROR(IF(AND(B18>=0.95, C18>=0.95), Incentives!H18, 0), \"\")","v":0},{"$f":"IFERROR((gas_eligible*INDEX('Avoided Costs'!$B$3:$G$72,MATCH(Calculator!$G18,'Avoided Costs'!$A$3:$A$72,0),MATCH(Calculator!$F18,'Avoided Costs'!$B$2:$G$2,0))*Calculator!I18+ele_eligible*VLOOKUP($E18,'Avoided Costs'!$L$4:$CF$184,MATCH(Calculator!$G18,'Avoided Costs'!$L$3:$CF$3,0),0)*Calculator!H18)/Incentives!F18, \"\")","v":""},{"$f":"IFERROR((IF(gas_eligible, INDEX('Avoided Costs'!$B$3:$G$72,MATCH(Calculator!$G18,'Avoided Costs'!$A$3:$A$72,0),MATCH(Calculator!$F18,'Avoided Costs'!$B$2:$G$2,0)), PV(discount,Calculator!G18,-gas_rate))*Calculator!I18+IF(ele_eligible, VLOOKUP($E18,'Avoided Costs'!$L$4:$CF$184,MATCH(Calculator!$G18,'Avoided Costs'!$L$3:$CF$3,0),0), PV(discount,Calculator!G18,-ele_rate))*Calculator!H18+PV(discount,Calculator!G18, -Calculator!K18))/Calculator!J18, \"\")","v":""},null,{"$f":"IF(OR(Calculator!$B$10=\"Residential\",Calculator!$B$10=\"Industrial\"),INDEX(ShapeNameList,MATCH(Calculator!E18, ShapeDescriptions,0)),INDEX(Com_LP_Table,MATCH(Calculator!$C18,'Com LU Table'!$B$3:$B$13,0),MATCH(Calculator!E18,'Com LU Table'!$C$2:$P$2,0)))","v":{"$error":"#N/A"}},{"$f":"IFERROR(ele_eligible*VLOOKUP($E18,'Avoided Costs'!$L$4:$CF$183,MATCH(Calculator!$G18,'Avoided Costs'!$L$3:$CF$3,0),0)*MAX(Calculator!H18,0)/(ele_eligible*VLOOKUP($E18,'Avoided Costs'!$L$4:$CF$183,MATCH(Calculator!$G18,'Avoided Costs'!$L$3:$CF$3,0),0)*MAX(Calculator!H18,0)+gas_eligible*INDEX('Avoided Costs'!$B$3:$G$72,MATCH(Calculator!$G18,'Avoided Costs'!$A$3:$A$72,0),MATCH(Calculator!$F18,'Avoided Costs'!$B$2:$G$2,0))*MAX(Calculator!I18,0))*A18, \"\")","v":""},"",null,4,{"$f":"IF(AND(Calculator!I18>0,Calculator!J18>0, ele_eligible, gas_eligible), \"Dual Fuel\", IF(AND(Calculator!I18>0, ele_eligible), \"Electric Only\", IF(AND(Calculator!J18>0, gas_eligible), \"Gas Only\", \"\")))","v":""},{"$f":"IFERROR(Calculator!K18/(Calculator!I18*ele_rate+Calculator!J18*gas_rate), \"\")","v":""},{"$f":"IFERROR(IF(K18>=IF(Calculator!E18=\"Yes\",#REF!, VLOOKUP( J18,#REF!, 5, FALSE)), \"Yes\", \"No\"), \"\")","v":""},{"$f":"IFERROR(MIN(ele_eligible*inc_per_kwh*Calculator!I18+gas_eligible*inc_per_therm*Calculator!J18, inc_cost_cap*Calculator!K18),\"\")","v":""},null,{"$f":"IFERROR(IF(AND('Hidden Cells'!L18=\"Yes\", Calculator!L18=\"Yes\"), 'Hidden Cells'!M18, 0), \"\")","v":0}]
[{"$f":"IFERROR(IF(AND(B19>=0.95, C19>=0.95), Incentives!H19, 0), \"\")","v":0},{"$f":"IFERROR((gas_eligible*INDEX('Avoided Costs'!$B$3:$G$72,MATCH(Calculator!$G19,'Avoided Costs'!$A$3:$A$72,0),MATCH(Calculator!$F19,'Avoided Costs'!$B$2:$G$2,0))*Calculator!I19+ele_eligible*VLOOKUP($E19,'Avoided Costs'!$L$4:$CF$184,MATCH(Calculator!$G19,'Avoided Costs'!$L$3:$CF$3,0),0)*Calculator!H19)/Incentives!F19, \"\")","v":""},{"$f":"IFERROR((IF(gas_eligible, INDEX('Avoided Costs'!$B$3:$G$72,MATCH(Calculator!$G19,'Avoided Costs'!$A$3:$A$72,0),MATCH(Calculator!$F19,'Avoided Costs'!$B$2:$G$2,0)), PV(discount,Calculator!G19,-gas_rate))*Calculator!I19+IF(ele_eligible, VLOOKUP($E19,'Avoided Costs'!$L$4:$CF$184,MATCH(Calculator!$G19,'Avoided Costs'!$L$3:$CF$3,0),0), PV(discount,Calculator!G19,-ele_rate))*Calculator!H19+PV(discount,Calculator!G19, -Calculator!K19))/Calculator!J19, \"\")","v":""},null,{"$f":"IF(OR(Calculator!$B$10=\"Residential\",Calculator!$B$10=\"Industrial\"),INDEX(ShapeNameList,MATCH(Calculator!E19, ShapeDescriptions,0)),INDEX(Com_LP_Table,MATCH(Calculator!$C19,'Com LU Table'!$B$3:$B$13,0),MATCH(Calculator!E19,'Com LU Table'!$C$2:$P$2,0)))","v":{"$error":"#N/A"}},{"$f":"IFERROR(ele_eligible*VLOOKUP($E19,'Avoided Costs'!$L$4:$CF$183,MATCH(Calculator!$G19,'Avoided Costs'!$L$3:$CF$3,0),0)*MAX(Calculator!H19,0)/(ele_eligible*VLOOKUP($E19,'Avoided Costs'!$L$4:$CF$183,MATCH(Calculator!$G19,'Avoided Costs'!$L$3:$CF$3,0),0)*MAX(Calculator!H19,0)+gas_eligible*INDEX('Avoided Costs'!$B$3:$G$72,MATCH(Calculator!$G19,'Avoided Costs'!$A$3:$A$72,0),MATCH(Calculator!$F19,'Avoided Costs'!$B$2:$G$2,0))*MAX(Calculator!I19,0))*A19, \"\")","v":""},"",null,5,{"$f":"IF(AND(Calculator!I19>0,Calculator!J19>0, ele_eligible, gas_eligible), \"Dual Fuel\", IF(AND(Calculator!I19>0, ele_eligible), \"Electric Only\", IF(AND(Calculator!J19>0, gas_eligible), \"Gas Only\", \"\")))","v":""},{"$f":"IFERROR(Calculator!K19/(Calculator!I19*ele_rate+Calculator!J19*gas_rate), \"\")","v":""},{"$f":"IFERROR(IF(K19>=IF(Calculator!E19=\"Yes\",#REF!, VLOOKUP( J19,#REF!, 5, FALSE)), \"Yes\", \"No\"), \"\")","v":""},{"$f":"IFERROR(MIN(ele_eligible*inc_per_kwh*Calculator!I19+gas_eligible*inc_per_therm*Calculator!J19, inc_cost_cap*Calculator!K19),\"\")","v":""},null,{"$f":"IFERROR(IF(AND('Hidden Cells'!L19=\"Yes\", Calculator!L19=\"Yes\"), 'Hidden Cells'!M19, 0), \"\")","v":0}]
[{"$f":"IFERROR(IF(AND(B20>=0.95, C20>=0.95), Incentives!H20, 0), \"\")","v":0},{"$f":"IFERROR((gas_eligible*INDEX('Avoided Costs'!$B$3:$G$72,MATCH(Calculator!$G20,'Avoided Costs'!$A$3:$A$72,0),MATCH(Calculator!$F20,'Avoided Costs'!$B$2:$G$2,0))*Calculator!I20+ele_eligible*VLOOKUP($E20,'Avoided Costs'!$L$4:$CF$184,MATCH(Calculator!$G20,'Avoided Costs'!$L$3:$CF$3,0),0)*Calculator!H20)/Incentives!F20, \"\")","v":""},{"$f":"IFERROR((IF(gas_eligible, INDEX('Avoided Costs'!$B$3:$G$72,MATCH(Calculator!$G20,'Avoided Costs'!$A$3:$A$72,0),MATCH(Calculator!$F20,'Avoided Costs'!$B$2:$G$2,0)), PV(discount,Calculator!G20,-gas_rate))*Calculator!I20+IF(ele_eligible, VLOOKUP($E20,'Avoided Costs'!$L$4:$CF$184,MATCH(Calculator!$G20,'Avoided Costs'!$L$3:$CF$3,0),0), PV(discount,Calculator!G20,-ele_rate))*Calculator!H20+PV(discount,Calculator!G20, -Calculator!K20))/Calculator!J20, \"\")","v":""},null,{"$f":"IF(OR(Calculator!$B$10=\"Residential\",Calculator!$B$10=\"Industrial\"),INDEX(ShapeNameList,MATCH(Calculator!E20, ShapeDescriptions,0)),INDEX(Com_LP_Table,MATCH(Calculator!$C20,'Com LU Table'!$B$3:$B$13,0),MATCH(Calculator!E20,'Com LU Table'!$C$2:$P$2,0)))","v":{"$error":"#N/A"}},{"$f":"IFERROR(ele_eligible*VLOOKUP($E20,'Avoided Costs'!$L$4:$CF$183,MATCH(Calculator!$G20,'Avoided Costs'!$L$3:$CF$3,0),0)*MAX(Calculator!H20,0)/(ele_eligible*VLOOKUP($E20,'Avoided Costs'!$L$4:$CF$183,MATCH(Calculator!$G20,'Avoided Costs'!$L$3:$CF$3,0),0)*MAX(Calculator!H20,0)+gas_eligible*INDEX('Avoided Costs'!$B$3:$G$72,MATCH(Calculator!$G20,'Avoided Costs'!$A$3:$A$72,0),MATCH(Calculator!$F20,'Avoided Costs'!$B$2:$G$2,0))*MAX(Calculator!I20,0))*A20, \"\")","v":""},"",null,6,{"$f":"IF(AND(Calculator!I20>0,Calculator!J20>0, ele_eligible, gas_eligible), \"Dual Fuel\", IF(AND(Calculator!I20>0, ele_eligible), \"Electric Only\", IF(AND(Calculator!J20>0, gas_eligible), \"Gas Only\", \"\")))","v":""},{"$f":"IFERROR(Calculator!K20/(Calculator!I20*ele_rate+Calculator!J20*gas_rate), \"\")","v":""},{"$f":"IFERROR(IF(K20>=IF(Calculator!E20=\"Yes\",#REF!, VLOOKUP( J20,#REF!, 5, FALSE)), \"Yes\", \"No\"), \"\")","v":""},{"$f":"IFERROR(MIN(ele_eligible*inc_per_kwh*Calculator!I20+gas_eligible*inc_per_therm*Calculator!J20, inc_cost_cap*Calculator!K20),\"\")","v":""},null,{"$f":"IFERROR(IF(AND('Hidden Cells'!L20=\"Yes\", Calculator!L20=\"Yes\"), 'Hidden Cells'!M20, 0), \"\")","v":0}]
[{"$f":"IFERROR(IF(AND(B21>=0.95, C21>=0.95), Incentives!H21, 0), \"\")","v":0},{"$f":"IFERROR((gas_eligible*INDEX('Avoided Costs'!$B$3:$G$72,MATCH(Calculator!$G21,'Avoided Costs'!$A$3:$A$72,0),MATCH(Calculator!$F21,'Avoided Costs'!$B$2:$G$2,0))*Calculator!I21+ele_eligible*VLOOKUP($E21,'Avoided Costs'!$L$4:$CF$184,MATCH(Calculator!$G21,'Avoided Costs'!$L$3:$CF$3,0),0)*Calculator!H21)/Incentives!F21, \"\")","v":""},{"$f":"IFERROR((IF(gas_eligible, INDEX('Avoided Costs'!$B$3:$G$72,MATCH(Calculator!$G21,'Avoided Costs'!$A$3:$A$72,0),MATCH(Calculator!$F21,'Avoided Costs'!$B$2:$G$2,0)), PV(discount,Calculator!G21,-gas_rate))*Calculator!I21+IF(ele_eligible, VLOOKUP($E21,'Avoided Costs'!$L$4:$CF$184,MATCH(Calculator!$G21,'Avoided Costs'!$L$3:$CF$3,0),0), PV(discount,Calculator!G21,-ele_rate))*Calculator!H21+PV(discount,Calculator!G21, -Calculator!K21))/Calculator!J21, \"\")","v":""},null,{"$f":"IF(OR(Calculator!$B$10=\"Residential\",Calculator!$B$10=\"Industrial\"),INDEX(ShapeNameList,MATCH(Calculator!E21, ShapeDescriptions,0)),INDEX(Com_LP_Table,MATCH(Calculator!$C21,'Com LU Table'!$B$3:$B$13,0),MATCH(Calculator!E21,'Com LU Table'!$C$2:$P$2,0)))","v":{"$error":"#N/A"}},{"$f":"IFERROR(ele_eligible*VLOOKUP($E21,'Avoided Costs'!$L$4:$CF$183,MATCH(Calculator!$G21,'Avoided Costs'!$L$3:$CF$3,0),0)*MAX(Calculator!H21,0)/(ele_eligible*VLOOKUP($E21,'Avoided Costs'!$L$4:$CF$183,MATCH(Calculator!$G21,'Avoided Costs'!$L$3:$CF$3,0),0)*MAX(Calculator!H21,0)+gas_eligible*INDEX('Avoided Costs'!$B$3:$G$72,MATCH(Calculator!$G21,'Avoided Costs'!$A$3:$A$72,0),MATCH(Calculator!$F21,'Avoided Costs'!$B$2:$G$2,0))*MAX(Calculator!I21,0))*A21, \"\")","v":""},"",null,7,{"$f":"IF(AND(Calculator!I21>0,Calculator!J21>0, ele_eligible, gas_eligible), \"Dual Fuel\", IF(AND(Calculator!I21>0, ele_eligible), \"Electric Only\", IF(AND(Calculator!J21>0, gas_eligible), \"Gas Only\", \"\")))","v":""},{"$f":"IFERROR(Calculator!K21/(Calculator!I21*ele_rate+Calculator!J21*gas_rate), \"\")","v":""},{"$f":"IFERROR(IF(K21>=IF(Calculator!E21=\"Yes\",#REF!, VLOOKUP( J21,#REF!, 5, FALSE)), \"Yes\", \"No\"), \"\")","v":""},{"$f":"IFERROR(MIN(ele_eligible*inc_per_kwh*Calculator!I21+gas_eligible*inc_per_therm*Calculator!J21, inc_cost_cap*Calculator!K21),\"\")","v":""},null,{"$f":"IFERROR(IF(AND('Hidden Cells'!L21=\"Yes\", Calculator!L21=\"Yes\"), 'Hidden Cells'!M21, 0), \"\")","v":0}]
[{"$f":"IFERROR(IF(AND(B22>=0.95, C22>=0.95), Incentives!H22, 0), \"\")","v":0},{"$f":"IFERROR((gas_eligible*INDEX('Avoided Costs'!$B$3:$G$72,MATCH(Calculator!$G22,'Avoided Costs'!$A$3:$A$72,0),MATCH(Calculator!$F22,'Avoided Costs'!$B$2:$G$2,0))*Calculator!I22+ele_eligible*VLOOKUP($E22,'Avoided Costs'!$L$4:$CF$184,MATCH(Calculator!$G22,'Avoided Costs'!$L$3:$CF$3,0),0)*Calculator!H22)/Incentives!F22, \"\")","v":""},{"$f":"IFERROR((IF(gas_eligible, INDEX('Avoided Costs'!$B$3:$G$72,MATCH(Calculator!$G22,'Avoided Costs'!$A$3:$A$72,0),MATCH(Calculator!$F22,'Avoided Costs'!$B$2:$G$2,0)), PV(discount,Calculator!G22,-gas_rate))*Calculator!I22+IF(ele_eligible, VLOOKUP($E22,'Avoided Costs'!$L$4:$CF$184,MATCH(Calculator!$G22,'Avoided Costs'!$L$3:$CF$3,0),0), PV(discount,Calculator!G22,-ele_rate))*Calculator!H22+PV(discount,Calculator!G22, -Calculator!K22))/Calculator!J22, \"\")","v":""},null,{"$f":"IF(OR(Calculator!$B$10=\"Residential\",Calculator!$B$10=\"Industrial\"),INDEX(ShapeNameList,MATCH(Calculator!E22, ShapeDescriptions,0)),INDEX(Com_LP_Table,MATCH(Calculator!$C22,'Com LU Table'!$B$3:$B$13,0),MATCH(Calculator!E22,'Com LU Table'!$C$2:$P$2,0)))","v":{"$error":"#N/A"}},{"$f":"IFERROR(ele_eligible*VLOOKUP($E22,'Avoided Costs'!$L$4:$CF$183,MATCH(Calculator!$G22,'Avoided Costs'!$L$3:$CF$3,0),0)*MAX(Calculator!H22,0)/(ele_eligible*VLOOKUP($E22,'Avoided Costs'!$L$4:$CF$183,MATCH(Calculator!$G22,'Avoided Costs'!$L$3:$CF$3,0),0)*MAX(Calculator!H22,0)+gas_eligible*INDEX('Avoided Costs'!$B$3:$G$72,MATCH(Calculator!$G22,'Avoided Costs'!$A$3:$A$72,0),MATCH(Calculator!$F22,'Avoided Costs'!$B$2:$G$2,0))*MAX(Calculator!I22,0))*A22, \"\")","v":""},"",null,8,{"$f":"IF(AND(Calculator!I22>0,Calculator!J22>0, ele_eligible, gas_eligible), \"Dual Fuel\", IF(AND(Calculator!I22>0, ele_eligible), \"Electric Only\", IF(AND(Calculator!J22>0, gas_eligible), \"Gas Only\", \"\")))","v":""},{"$f":"IFERROR(Calculator!K22/(Calculator!I22*ele_rate+Calculator!J22*gas_rate), \"\")","v":""},{"$f":"IFERROR(IF(K22>=IF(Calculator!E22=\"Yes\",#REF!, VLOOKUP( J22,#REF!, 5, FALSE)), \"Yes\", \"No\"), \"\")","v":""},{"$f":"IFERROR(MIN(ele_eligible*inc_per_kwh*Calculator!I22+gas_eligible*inc_per_therm*Calculator!J22, inc_cost_cap*Calculator!K22),\"\")","v":""},null,{"$f":"IFERROR(IF(AND('Hidden Cells'!L22=\"Yes\", Calculator!L22=\"Yes\"), 'Hidden Cells'!M22, 0), \"\")","v":0}]
[{"$f":"IFERROR(IF(AND(B23>=0.95, C23>=0.95), Incentives!H23, 0), \"\")","v":0},{"$f":"IFERROR((gas_eligible*INDEX('Avoided Costs'!$B$3:$G$72,MATCH(Calculator!$G23,'Avoided Costs'!$A$3:$A$72,0),MATCH(Calculator!$F23,'Avoided Costs'!$B$2:$G$2,0))*Calculator!I23+ele_eligible*VLOOKUP($E23,'Avoided Costs'!$L$4:$CF$184,MATCH(Calculator!$G23,'Avoided Costs'!$L$3:$CF$3,0),0)*Calculator!H23)/Incentives!F23, \"\")","v":""},{"$f":"IFERROR((IF(gas_eligible, INDEX('Avoided Costs'!$B$3:$G$72,MATCH(Calculator!$G23,'Avoided Costs'!$A$3:$A$72,0),MATCH(Calculator!$F23,'Avoided Costs'!$B$2:$G$2,0)), PV(discount,Calculator!G23,-gas_rate))*Calculator!I23+IF(ele_eligible, VLOOKUP($E23,'Avoided Costs'!$L$4:$CF$184,MATCH(Calculator!$G23,'Avoided Costs'!$L$3:$CF$3,0),0), PV(discount,Calculator!G23,-ele_rate))*Calculator!H23+PV(discount,Calculator!G23, -Calculator!K23))/Calculator!J23, \"\")","v":""},null,{"$f":"IF(OR(Calculator!$B$10=\"Residential\",Calculator!$B$10=\"Industrial\"),INDEX(ShapeNameList,MATCH(Calculator!E23, ShapeDescriptions,0)),INDEX(Com_LP_Table,MATCH(Calculator!$C23,'Com LU Table'!$B$3:$B$13,0),MATCH(Calculator!E23,'Com LU Table'!$C$2:$P$2,0)))","v":{"$error":"#N/A"}},{"$f":"IFERROR(ele_eligible*VLOOKUP($E23,'Avoided Costs'!$L$4:$CF$183,MATCH(Calculator!$G23,'Avoided Costs'!$L$3:$CF$3,0),0)*MAX(Calculator!H23,0)/(ele_eligible*VLOOKUP($E23,'Avoided Costs'!$L$4:$CF$183,MATCH(Calculator!$G23,'Avoided Costs'!$L$3:$CF$3,0),0)*MAX(Calculator!H23,0)+gas_eligible*INDEX('Avoided Costs'!$B$3:$G$72,MATCH(Calculator!$G23,'Avoided Costs'!$A$3:$A$72,0),MATCH(Calculator!$F23,'Avoided Costs'!$B$2:$G$2,0))*MAX(Calculator!I23,0))*A23, \"\")","v":""},"",null,9,{"$f":"IF(AND(Calculator!I23>0,Calculator!J23>0, ele_eligible, gas_eligible), \"Dual Fuel\", IF(AND(Calculator!I23>0, ele_eligible), \"Electric Only\", IF(AND(Calculator!J23>0, gas_eligible), \"Gas Only\", \"\")))","v":""},{"$f":"IFERROR(Calculator!K23/(Calculator!I23*ele_rate+Calculator!J23*gas_rate), \"\")","v":""},{"$f":"IFERROR(IF(K23>=IF(Calculator!E23=\"Yes\",#REF!, VLOOKUP( J23,#REF!, 5, FALSE)), \"Yes\", \"No\"), \"\")","v":""},{"$f":"IFERROR(MIN(ele_eligible*inc_per_kwh*Calculator!I23+gas_eligible*inc_per_therm*Calculator!J23, inc_cost_cap*Calculator!K23),\"\")","v":""},null,{"$f":"IFERROR(IF(AND('Hidden Cells'!L23=\"Yes\", Calculator!L23=\"Yes\"), 'Hidden Cells'!M23, 0), \"\")","v":0}]
[{"$f":"IFERROR(IF(AND(B24>=0.95, C24>=0.95), Incentives!H24, 0), \"\")","v":0},{"$f":"IFERROR((gas_eligible*INDEX('Avoided Costs'!$B$3:$G$72,MATCH(Calculator!$G24,'Avoided Costs'!$A$3:$A$72,0),MATCH(Calculator!$F24,'Avoided Costs'!$B$2:$G$2,0))*Calculator!I24+ele_eligible*VLOOKUP($E24,'Avoided Costs'!$L$4:$CF$184,MATCH(Calculator!$G24,'Avoided Costs'!$L$3:$CF$3,0),0)*Calculator!H24)/Incentives!F24, \"\")","v":""},{"$f":"IFERROR((IF(gas_eligible, INDEX('Avoided Costs'!$B$3:$G$72,MATCH(Calculator!$G24,'Avoided Costs'!$A$3:$A$72,0),MATCH(Calculator!$F24,'Avoided Costs'!$B$2:$G$2,0)), PV(discount,Calculator!G24,-gas_rate))*Calculator!I24+IF(ele_eligible, VLOOKUP($E24,'Avoided Costs'!$L$4:$CF$184,MATCH(Calculator!$G24,'Avoided Costs'!$L$3:$CF$3,0),0), PV(discount,Calculator!G24,-ele_rate))*Calculator!H24+PV(discount,Calculator!G24, -Calculator!K24))/Calculator!J24, \"\")","v":""},null,{"$f":"IF(OR(Calculator!$B$10=\"Residential\",Calculator!$B$10=\"Industrial\"),INDEX(ShapeNameList,MATCH(Calculator!E24, ShapeDescriptions,0)),INDEX(Com_LP_Table,MATCH(Calculator!$C24,'Com LU Table'!$B$3:$B$13,0),MATCH(Calculator!E24,'Com LU Table'!$C$2:$P$2,0)))","v":{"$error":"#N/A"}},{"$f":"IFERROR(ele_eligible*VLOOKUP($E24,'Avoided Costs'!$L$4:$CF$183,MATCH(Calculator!$G24,'Avoided Costs'!$L$3:$CF$3,0),0)*MAX(Calculator!H24,0)/(ele_eligible*VLOOKUP($E24,'Avoided Costs'!$L$4:$CF$183,MATCH(Calculator!$G24,'Avoided Costs'!$L$3:$CF$3,0),0)*MAX(Calculator!H24,0)+gas_eligible*INDEX('Avoided Costs'!$B$3:$G$72,MATCH(Calculator!$G24,'Avoided Costs'!$A$3:$A$72,0),MATCH(Calculator!$F24,'Avoided Costs'!$B$2:$G$2,0))*MAX(Calculator!I24,0))*A24, \"\")","v":""},"",null,10,{"$f":"IF(AND(Calculator!I24>0,Calculator!J24>0, ele_eligible, gas_eligible), \"Dual Fuel\", IF(AND(Calculator!I24>0, ele_eligible), \"Electric Only\", IF(AND(Calculator!J24>0, gas_eligible), \"Gas Only\", \"\")))","v":""},{"$f":"IFERROR(Calculator!K24/(Calculator!I24*ele_rate+Calculator!J24*gas_rate), \"\")","v":""},{"$f":"IFERROR(IF(K24>=IF(Calculator!E24=\"Yes\",#REF!, VLOOKUP( J24,#REF!, 5, FALSE)), \"Yes\", \"No\"), \"\")","v":""},{"$f":"IFERROR(MIN(ele_eligible*inc_per_kwh*Calculator!I24+gas_eligible*inc_per_therm*Calculator!J24, inc_cost_cap*Calculator!K24),\"\")","v":""},null,{"$f":"IFERROR(IF(AND('Hidden Cells'!L24=\"Yes\", Calculator!L24=\"Yes\"), 'Hidden Cells'!M24, 0), \"\")","v":0}]

{"sheet":"Incentives","index":4,"n_rows":24,"n_cols":8,"rows_kept":24,"cut":false,"hidden":true,"merged":[]}
[]
["Existing Buildings Program 2017 Incentive Rules",null,null,null,null,null,"Utility Eligibility"]
["Project Type","$/kWh","$/therm","% of Cost Cap","Minimum Simple Payback (yrs)",null,"Electric","Gas"]
["Electric Only",0.22,0,0.6,1,null,{"$f":"ele_eligible","v":true},{"$f":"gas_eligible","v":true}]
["Gas Only",0,3,0.75,1]
["Dual Fuel",0.22,3,0.65,1]
["RCx Ele Only",0.15,0,0.6,0]
["RCx Gas Only",0,1.8,0.75,0]
["RCx Dual Fuel",0.15,1.8,0.75,0]
[]
[]
[]
["Incentive Calculator"]
["Measure","Project Type","Cost Cap","Simple Payback","≥ Min Payback?","Incentive if C/E","Cost Effective?","Eligible Incentive"]
[{"$f":"A20","v":0},{"$f":"IF(Calculator!E15=\"No\",\n  IF(AND(Calculator!I15>0,Calculator!J15>0, ele_eligible, gas_eligible),\"Dual Fuel\",\n  IF( AND(Calculator!I15>0, ele_eligible),\"Electric Only\",\n  IF(AND(Calculator!J15>0, gas_eligible),\"Gas Only\",\"\"))),\n  IF( AND(Calculator!I15>0,Calculator!J15>0, ele_eligible, gas_eligible),\"RCx Dual Fuel\",\n  IF( AND(Calculator!I15>0, ele_eligible),\"RCx Ele Only\",\n  IF( AND(Calculator!J15>0, gas_eligible),\"RCx Gas Only\",\"\"))))","v":""},{"$f":"VLOOKUP(B15, $A$4:$D$9, 4, FALSE)","v":{"$error":"#N/A"}},{"$f":"IFERROR(Calculator!J15/(Calculator!H15*ele_rate+Calculator!I15*gas_rate), \"\")","v":""},{"$f":"IFERROR(IF(D15>=IF(Calculator!D15=\"Yes\", Incentives!$E$9, VLOOKUP(B15, $A$4:$E$9, 5, FALSE)), \"Yes\", \"No\"), \"\")","v":""},{"$f":"IF(Calculator!D15=\"No\",(IFERROR(MIN(ele_eligible*inc_per_kwh*MAX(0, Calculator!H15)+gas_eligible*inc_per_therm*MAX(0, Calculator!I15),C15*Calculator!J15),\"\")),(IFERROR(MIN(ele_eligible*RCx_Ele_Only*MAX(0, Calculator!H15)+gas_eligible*RCx_Gas_Only*MAX(0, Calculator!I15),C15*Calculator!J15),\"\")))","v":""},{"$f":"IF(AND(N('Hidden Cells'!B15)>=0.95, N('Hidden Cells'!C15)>=0.95), \"Yes\", \"No\")","v":"No"},{"$f":"IFERROR(IF(AND(E15=\"Yes\", G15=\"Yes\"), F15, 0), \"\")","v":0}]
[0,{"$f":"IF(Calculator!E16=\"No\",\n  IF(AND(Calculator!I16>0,Calculator!J16>0, ele_eligible, gas_eligible),\"Dual Fuel\",\n  IF( AND(Calculator!I16>0, ele_eligible),\"Electric Only\",\n  IF(AND(Calculator!J16>0, gas_eligible),\"Gas Only\",\"\"))),\n  IF( AND(Calculator!I16>0,Calculator!J16>0, ele_eligible, gas_eligible),\"RCx Dual Fuel\",\n  IF( AND(Calculator!I16>0, ele_eligible),\"RCx Ele Only\",\n  IF( AND(Calculator!J16>0, gas_eligible),\"RCx Gas Only\",\"\"))))","v":""},{"$f":"VLOOKUP(B16, $A$4:$D$9, 4, FALSE)","v":{"$error":"#N/A"}},{"$f":"IFERROR(Calculator!J16/(Calculator!H16*ele_rate+Calculator!I16*gas_rate), \"\")","v":""},{"$f":"IFERROR(IF(D16>=IF(Calculator!D16=\"Yes\", Incentives!$E$9, VLOOKUP(B16, $A$4:$E$9, 5, FALSE)), \"Yes\", \"No\"), \"\")","v":""},{"$f":"IF(Calculator!D16=\"No\",(IFERROR(MIN(ele_eligible*inc_per_kwh*MAX(0, Calculator!H16)+gas_eligible*inc_per_therm*MAX(0, Calculator!I16),C16*Calculator!J16),\"\")),(IFERROR(MIN(ele_eligible*RCx_Ele_Only*MAX(0, Calculator!H16)+gas_eligible*RCx_Gas_Only*MAX(0, Calculator!I16),C16*Calculator!J16),\"\")))","v":""},{"$f":"IF(AND(N('Hidden Cells'!B16)>=0.95, N('Hidden Cells'!C16)>=0.95), \"Yes\", \"No\")","v":"No"},{"$f":"IFERROR(IF(AND(E16=\"Yes\", G16=\"Yes\"), F16, 0), \"\")","v":0}]
[0,{"$f":"IF(Calculator!E17=\"No\",\n  IF(AND(Calculator!I17>0,Calculator!J17>0, ele_eligible, gas_eligible),\"Dual Fuel\",\n  IF( AND(Calculator!I17>0, ele_eligible),\"Electric Only\",\n  IF(AND(Calculator!J17>0, gas_eligible),\"Gas Only\",\"\"))),\n  IF( AND(Calculator!I17>0,Calculator!J17>0, ele_eligible, gas_eligible),\"RCx Dual Fuel\",\n  IF( AND(Calculator!I17>0, ele_eligible),\"RCx Ele Only\",\n  IF( AND(Calculator!J17>0, gas_eligible),\"RCx Gas Only\",\"\"))))","v":""},{"$error":"#N/A"},{"$f":"IFERROR(Calculator!J17/(Calculator!H17*ele_rate+Calculator!I17*gas_rate), \"\")","v":""},{"$f":"IFERROR(IF(D17>=IF(Calculator!D17=\"Yes\", Incentives!$E$9, VLOOKUP(B17, $A$4:$E$9, 5, FALSE)), \"Yes\", \"No\"), \"\")","v":""},{"$f":"IF(Calculator!D17=\"No\",(IFERROR(MIN(ele_eligible*inc_per_kwh*MAX(0, Calculator!H17)+gas_eligible*inc_per_therm*MAX(0, Calculator!I17),C17*Calculator!J17),\"\")),(IFERROR(MIN(ele_eligible*RCx_Ele_Only*MAX(0, Calculator!H17)+gas_eligible*RCx_Gas_Only*MAX(0, Calculator!I17),C17*Calculator!J17),\"\")))","v":""},{"$f":"IF(AND(N('Hidden Cells'!B17)>=0.95, N('Hidden Cells'!C17)>=0.95), \"Yes\", \"No\")","v":"No"},0]
[0,{"$f":"IF(Calculator!E18=\"No\",\n  IF(AND(Calculator!I18>0,Calculator!J18>0, ele_eligible, gas_eligible),\"Dual Fuel\",\n  IF( AND(Calculator!I18>0, ele_eligible),\"Electric Only\",\n  IF(AND(Calculator!J18>0, gas_eligible),\"Gas Only\",\"\"))),\n  IF( AND(Calculator!I18>0,Calculator!J18>0, ele_eligible, gas_eligible),\"RCx Dual Fuel\",\n  IF( AND(Calculator!I18>0, ele_eligible),\"RCx Ele Only\",\n  IF( AND(Calculator!J18>0, gas_eligible),\"RCx Gas Only\",\"\"))))","v":""},{"$error":"#N/A"},{"$f":"IFERROR(Calculator!J18/(Calculator!H18*ele_rate+Calculator!I18*gas_rate), \"\")","v":""},{"$f":"IFERROR(IF(D18>=IF(Calculator!D18=\"Yes\", Incentives!$E$9, VLOOKUP(B18, $A$4:$E$9, 5, FALSE)), \"Yes\", \"No\"), \"\")","v":""},{"$f":"IF(Calculator!D18=\"No\",(IFERROR(MIN(ele_eligible*inc_per_kwh*MAX(0, Calculator!H18)+gas_eligible*inc_per_therm*MAX(0, Calculator!I18),C18*Calculator!J18),\"\")),(IFERROR(MIN(ele_eligible*RCx_Ele_Only*MAX(0, Calculator!H18)+gas_eligible*RCx_Gas_Only*MAX(0, Calculator!I18),C18*Calculator!J18),\"\")))","v":""},{"$f":"IF(AND(N('Hidden Cells'!B18)>=0.95, N('Hidden Cells'!C18)>=0.95), \"Yes\", \"No\")","v":"No"},0]
[0,{"$f":"IF(Calculator!E19=\"No\",\n  IF(AND(Calculator!I19>0,Calculator!J19>0, ele_eligible, gas_eligible),\"Dual Fuel\",\n  IF( AND(Calculator!I19>0, ele_eligible),\"Electric Only\",\n  IF(AND(Calculator!J19>0, gas_eligible),\"Gas Only\",\"\"))),\n  IF( AND(Calculator!I19>0,Calculator!J19>0, ele_eligible, gas_eligible),\"RCx Dual Fuel\",\n  IF( AND(Calculator!I19>0, ele_eligible),\"RCx Ele Only\",\n  IF( AND(Calculator!J19>0, gas_eligible),\"RCx Gas Only\",\"\"))))","v":""},{"$error":"#N/A"},{"$f":"IFERROR(Calculator!J19/(Calculator!H19*ele_rate+Calculator!I19*gas_rate), \"\")","v":""},{"$f":"IFERROR(IF(D19>=IF(Calculator!D19=\"Yes\", Incentives!$E$9, VLOOKUP(B19, $A$4:$E$9, 5, FALSE)), \"Yes\", \"No\"), \"\")","v":""},{"$f":"IF(Calculator!D19=\"No\",(IFERROR(MIN(ele_eligible*inc_per_kwh*MAX(0, Calculator!H19)+gas_eligible*inc_per_therm*MAX(0, Calculator!I19),C19*Calculator!J19),\"\")),(IFERROR(MIN(ele_eligible*RCx_Ele_Only*MAX(0, Calculator!H19)+gas_eligible*RCx_Gas_Only*MAX(0, Calculator!I19),C19*Calculator!J19),\"\")))","v":""},{"$f":"IF(AND(N('Hidden Cells'!B19)>=0.95, N('Hidden Cells'!C19)>=0.95), \"Yes\", \"No\")","v":"No"},0]
[0,{"$f":"IF(Calculator!E20=\"No\",\n  IF(AND(Calculator!I20>0,Calculator!J20>0, ele_eligible, gas_eligible),\"Dual Fuel\",\n  IF( AND(Calculator!I20>0, ele_eligible),\"Electric Only\",\n  IF(AND(Calculator!J20>0, gas_eligible),\"Gas Only\",\"\"))),\n  IF( AND(Calculator!I20>0,Calculator!J20>0, ele_eligible, gas_eligible),\"RCx Dual Fuel\",\n  IF( AND(Calculator!I20>0, ele_eligible),\"RCx Ele Only\",\n  IF( AND(Calculator!J20>0, gas_eligible),\"RCx Gas Only\",\"\"))))","v":""},{"$error":"#N/A"},{"$f":"IFERROR(Calculator!J20/(Calculator!H20*ele_rate+Calculator!I20*gas_rate), \"\")","v":""},{"$f":"IFERROR(IF(D20>=IF(Calculator!D20=\"Yes\", Incentives!$E$9, VLOOKUP(B20, $A$4:$E$9, 5, FALSE)), \"Yes\", \"No\"), \"\")","v":""},{"$f":"IF(Calculator!D20=\"No\",(IFERROR(MIN(ele_eligible*inc_per_kwh*MAX(0, Calculator!H20)+gas_eligible*inc_per_therm*MAX(0, Calculator!I20),C20*Calculator!J20),\"\")),(IFERROR(MIN(ele_eligible*RCx_Ele_Only*MAX(0, Calculator!H20)+gas_eligible*RCx_Gas_Only*MAX(0, Calculator!I20),C20*Calculator!J20),\"\")))","v":""},{"$f":"IF(AND(N('Hidden Cells'!B20)>=0.95, N('Hidden Cells'!C20)>=0.95), \"Yes\", \"No\")","v":"No"},0]
[0,{"$f":"IF(Calculator!E21=\"No\",\n  IF(AND(Calculator!I21>0,Calculator!J21>0, ele_eligible, gas_eligible),\"Dual Fuel\",\n  IF( AND(Calculator!I21>0, ele_eligible),\"Electric Only\",\n  IF(AND(Calculator!J21>0, gas_eligible),\"Gas Only\",\"\"))),\n  IF( AND(Calculator!I21>0,Calculator!J21>0, ele_eligible, gas_eligible),\"RCx Dual Fuel\",\n  IF( AND(Calculator!I21>0, ele_eligible),\"RCx Ele Only\",\n  IF( AND(Calculator!J21>0, gas_eligible),\"RCx Gas Only\",\"\"))))","v":""},{"$error":"#N/A"},{"$f":"IFERROR(Calculator!J21/(Calculator!H21*ele_rate+Calculator!I21*gas_rate), \"\")","v":""},{"$f":"IFERROR(IF(D21>=IF(Calculator!D21=\"Yes\", Incentives!$E$9, VLOOKUP(B21, $A$4:$E$9, 5, FALSE)), \"Yes\", \"No\"), \"\")","v":""},{"$f":"IF(Calculator!D21=\"No\",(IFERROR(MIN(ele_eligible*inc_per_kwh*MAX(0, Calculator!H21)+gas_eligible*inc_per_therm*MAX(0, Calculator!I21),C21*Calculator!J21),\"\")),(IFERROR(MIN(ele_eligible*RCx_Ele_Only*MAX(0, Calculator!H21)+gas_eligible*RCx_Gas_Only*MAX(0, Calculator!I21),C21*Calculator!J21),\"\")))","v":""},{"$f":"IF(AND(N('Hidden Cells'!B21)>=0.95, N('Hidden Cells'!C21)>=0.95), \"Yes\", \"No\")","v":"No"},0]
[0,{"$f":"IF(Calculator!E22=\"No\",\n  IF(AND(Calculator!I22>0,Calculator!J22>0, ele_eligible, gas_eligible),\"Dual Fuel\",\n  IF( AND(Calculator!I22>0, ele_eligible),\"Electric Only\",\n  IF(AND(Calculator!J22>0, gas_eligible),\"Gas Only\",\"\"))),\n  IF( AND(Calculator!I22>0,Calculator!J22>0, ele_eligible, gas_eligible),\"RCx Dual Fuel\",\n  IF( AND(Calculator!I22>0, ele_eligible),\"RCx Ele Only\",\n  IF( AND(Calculator!J22>0, gas_eligible),\"RCx Gas Only\",\"\"))))","v":""},{"$error":"#N/A"},{"$f":"IFERROR(Calculator!J22/(Calculator!H22*ele_rate+Calculator!I22*gas_rate), \"\")","v":""},{"$f":"IFERROR(IF(D22>=IF(Calculator!D22=\"Yes\", Incentives!$E$9, VLOOKUP(B22, $A$4:$E$9, 5, FALSE)), \"Yes\", \"No\"), \"\")","v":""},{"$f":"IF(Calculator!D22=\"No\",(IFERROR(MIN(ele_eligible*inc_per_kwh*MAX(0, Calculator!H22)+gas_eligible*inc_per_therm*MAX(0, Calculator!I22),C22*Calculator!J22),\"\")),(IFERROR(MIN(ele_eligible*RCx_Ele_Only*MAX(0, Calculator!H22)+gas_eligible*RCx_Gas_Only*MAX(0, Calculator!I22),C22*Calculator!J22),\"\")))","v":""},{"$f":"IF(AND(N('Hidden Cells'!B22)>=0.95, N('Hidden Cells'!C22)>=0.95), \"Yes\", \"No\")","v":"No"},0]
[0,{"$f":"IF(Calculator!E23=\"No\",\n  IF(AND(Calculator!I23>0,Calculator!J23>0, ele_eligible, gas_eligible),\"Dual Fuel\",\n  IF( AND(Calculator!I23>0, ele_eligible),\"Electric Only\",\n  IF(AND(Calculator!J23>0, gas_eligible),\"Gas Only\",\"\"))),\n  IF( AND(Calculator!I23>0,Calculator!J23>0, ele_eligible, gas_eligible),\"RCx Dual Fuel\",\n  IF( AND(Calculator!I23>0, ele_eligible),\"RCx Ele Only\",\n  IF( AND(Calculator!J23>0, gas_eligible),\"RCx Gas Only\",\"\"))))","v":""},{"$error":"#N/A"},{"$f":"IFERROR(Calculator!J23/(Calculator!H23*ele_rate+Calculator!I23*gas_rate), \"\")","v":""},{"$f":"IFERROR(IF(D23>=IF(Calculator!D23=\"Yes\", Incentives!$E$9, VLOOKUP(B23, $A$4:$E$9, 5, FALSE)), \"Yes\", \"No\"), \"\")","v":""},{"$f":"IF(Calculator!D23=\"No\",(IFERROR(MIN(ele_eligible*inc_per_kwh*MAX(0, Calculator!H23)+gas_eligible*inc_per_therm*MAX(0, Calculator!I23),C23*Calculator!J23),\"\")),(IFERROR(MIN(ele_eligible*RCx_Ele_Only*MAX(0, Calculator!H23)+gas_eligible*RCx_Gas_Only*MAX(0, Calculator!I23),C23*Calculator!J23),\"\")))","v":""},{"$f":"IF(AND(N('Hidden Cells'!B23)>=0.95, N('Hidden Cells'!C23)>=0.95), \"Yes\", \"No\")","v":"No"},0]
[0,{"$f":"IF(Calculator!E24=\"No\",\n  IF(AND(Calculator!I24>0,Calculator!J24>0, ele_eligible, gas_eligible),\"Dual Fuel\",\n  IF( AND(Calculator!I24>0, ele_eligible),\"Electric Only\",\n  IF(AND(Calculator!J24>0, gas_eligible),\"Gas Only\",\"\"))),\n  IF( AND(Calculator!I24>0,Calculator!J24>0, ele_eligible, gas_eligible),\"RCx Dual Fuel\",\n  IF( AND(Calculator!I24>0, ele_eligible),\"RCx Ele Only\",\n  IF( AND(Calculator!J24>0, gas_eligible),\"RCx Gas Only\",\"\"))))","v":""},{"$error":"#N/A"},{"$f":"IFERROR(Calculator!J24/(Calculator!H24*ele_rate+Calculator!I24*gas_rate), \"\")","v":""},{"$f":"IFERROR(IF(D24>=IF(Calculator!D24=\"Yes\", Incentives!$E$9, VLOOKUP(B24, $A$4:$E$9, 5, FALSE)), \"Yes\", \"No\"), \"\")","v":""},{"$f":"IF(Calculator!D24=\"No\",(IFERROR(MIN(ele_eligible*inc_per_kwh*MAX(0, Calculator!H24)+gas_eligible*inc_per_therm*MAX(0, Calculator!I24),C24*Calculator!J24),\"\")),(IFERROR(MIN(ele_eligible*RCx_Ele_Only*MAX(0, Calculator!H24)+gas_eligible*RCx_Gas_Only*MAX(0, Calculator!I24),C24*Calculator!J24),\"\")))","v":""},{"$f":"IF(AND(N('Hidden Cells'!B24)>=0.95, N('Hidden Cells'!C24)>=0.95), \"Yes\", \"No\")","v":"No"},0]

{"sheet":"Lists","index":5,"n_rows":24,"n_cols":14,"rows_kept":24,"cut":false,"hidden":true,"merged":[]}
["LOOKUPS"]
["Sector","Commercial","Industrial","Residential","Com End Use","Ind End Use","Res End Use","Gas Load Profiles","Electric Utility","Gas Utility","Yes/No","State","Electric Rate:","Gas Rate:"]
["Commercial","College","Not applicable","Not applicable","Compressed Air","Ag-Irrigation","Res Refrigerator","DHW","PGE","NWN","No","OR",7.7799999999999994E-2,0.78869999999999996]
["Industrial","Grocery",null,null,"Cooking","Flat","Res Freezer","Flat","PAC","NWN-Firm","Yes","WA"]
["Residential","Healthcare",null,null,"Cooling","1-Shift Industrial","Res Dryer","Res Heating","Other","CNG"]
[null,"Lodging",null,null,"Exterior Lighting","2-Shift Industrial","Res Clotheswasher","Com Heating",null,"Avista"]
[null,"Large Office",null,null,"Heating","3-Shift Industrial","Res Central AC","Clotheswasher",null,"Other"]
[null,"Other",null,null,"Hot Water","None","Res Window AC","None"]
[null,"Restaurant",null,null,"Indoor Lighting",null,"Res Water Heat"]
[null,"Retail",null,null,"Misc",null,"Res HP Water Heat Convert"]
[null,"School",null,null,"Motors",null,"Res Solar Water Heat"]
[null,"Small Office",null,null,"Office Equipment",null,"Res Air Source HP"]
[null,"Warehouse",null,null,"Process",null,"Res Ductless HP Convert"]
[null,null,null,null,"Refrigeration",null,"Res Ductless HP - Cooling"]
[null,null,null,null,"Ventilation",null,"Res Zonal Ele Heat"]
[null,null,null,null,"None",null,"Res Ele Resistance Heat"]
[null,null,null,null,null,null,"Res Lighting"]
[null,null,null,null,null,null,"Res Other"]
[null,null,null,null,null,null,"Res Whole Home"]
[null,null,null,null,null,null,"Res Spa Cover"]
[null,null,null,null,null,null,"Res Power Strip"]
[null,null,null,null,null,null,"Res Space Conditioning"]
[null,null,null,null,null,null,"Res EV Standby Mode"]
[null,null,null,null,null,null,"Res EV Charging Mode"]

{"sheet":"Avoided Costs","index":6,"n_rows":184,"n_cols":84,"rows_kept":184,"cut":false,"hidden":true,"merged":[[1,8,1,9],[1,13,1,20],[1,22,1,23],[8,8,8,9]]}
["Gas Avoided Costs",null,null,null,null,null,null,null,null,null,null,"Electric Avoided Costs"]
["Lifetime","DHW","FLAT","Res Heating","Com Heating","Clotheswasher","None",null,"Gas Avoided Cost Info",null,null,null,null,"Lifetime (yrs)",null,null,null,null,null,null,null,null,"Electric Avoided Cost Info"]
[1,0.52,0.48,0.86,0.84,0.49,0,null,"Updated on","2022-01-02",null,"Load Profile Name","Friendly Name",0,1,2,3,4,5,6,7,8,9,10,11,12,13,14,15,16,17,18,19,20,21,22,23,24,25,26,27,28,29,30,31,32,33,34,35,36,37,38,39,40,41,42,43,44,45,46,47,48,49,50,51,52,53,54,55,56,57,58,59,60,61,62,63,64,65,66,67,68,69,70]
[2,1.05,0.97,1.71,1.67,0.99,0,null,"Base Year","2022$",null,"R-All-Ref-Refrig-All-All-C","Res Refrigerator",0,6.3306684416918599E-2,0.1262355141592178,0.18751496331352657,0.24823776349243001,0.30730135938309899,0.36405100242069155,0.41848777087165762,0.47202369509346631,0.52486832832338937,0.57754386809383818,0.62932504486786811,0.6808284950627006,0.73057429589961942,0.77810241920060919,0.82353364930357142,0.86875312267126104,0.91293231654120865,0.95658952323596402,0.99902951639803117,1.0398076728074981,1.0791553937161931,1.1174055557246485,1.1549120218001827,1.1913843929189147,1.2267748424653331,1.2609515544114021,1.2936697841269886,1.3252864618952065,1.355855997949388,1.3624222436731084,1.3687057324039409,1.374718640280336,1.3804726191094219,1.3859788189458679,1.3912479096984478,1.3962901018061797,1.401115166024105,1.405732452357048,1.4101509081780459,1.4143790955665605,1.4184252079000677,1.4222970857311747,1.4260022319810379,1.4295478264785149,1.4329407398732297,1.4361875469495116,1.4392945393670065,1.4422677378526472,1.4451129038676147,1.4478355507718896,1.4504409545080379,1.452934163824926,1.4553200100611829,1.4576031165073615,1.4597879073649489,1.4618786163195781,1.4638792947450603,1.4657938195541342,1.4663681339448595,1.466917717093879,1.4674436339828927,1.4679469037331452,1.4684285015802767,1.4688893607641347,1.4693303743372044,1.4697523968951658,1.4701562462329281,1.4705427049293511,1.4709125218637273,1.4712664136669582]
[3,1.6,1.47,2.57,2.5099999999999998,1.51,0,null,"Discount Rate",4.4999999999999998E-2,null,"R-All-Ref-Freezer-All-All-R","Res Freezer",0,6.2355021525415021E-2,0.12439671725404881,0.18474492942311679,0.24460659220463776,0.30281090519871851,0.35872958491561424,0.41236066034754187,0.46509497529158,0.51715571438089114,0.56909322363984249,0.62012278486755834,0.67093377788294806,0.71995743970962989,0.7667692845303149,0.81147160127546114,0.85603371667525674,0.89955247232879409,0.94259043266610587,0.98442854085143194,1.0245937486348147,1.0633577427609915,1.1010756355655211,1.1380614502004249,1.1740494349285344,1.2089575541402895,1.2426816389615083,1.274963588931719,1.306168847253973,1.3363411674637617,1.3427360310253045,1.3488555176870678,1.3547114857844491,1.3603152830068233,1.3656777683870858,1.3708093333442748,1.3757199218200538,1.3804190495480719,1.3849158224935438,1.3892189544987801,1.3933367841688626,1.3972772910301856,1.4010481109931743,1.4046565511491442,1.4081096039299767,1.411413960658046,1.4145760245126577,1.4176019229381236,1.4204975195175167,1.4232684253351178,1.4259200098495686,1.4284574112988038,1.4308855466569237,1.4332091211623015,1.4354326374353903,1.4375604042038963,1.4395965446522274,1.441545004411396,1.4434095592048588,1.4439714959323617,1.4445092344275798,1.445023816719655,1.4455162399656596,1.4459874583828889,1.4464383850979408,1.4468698939161724,1.4472828210149586,1.4476779665640362,1.4480560962760722,1.4484179428904609,1.448764207593225]
[4,2.13,1.97,3.41,3.32,2.02,0,null,"Source","Link",null,"R-All-Plug-Dryer-All-All-R","Res Dryer",0,7.9262536078063217E-2,0.15739829170989728,0.23333957614626508,0.30806484752035834,0.38068148309929944,0.45053695965295382,0.51755344780014534,0.58299816068273158,0.64722920581049914,0.71085411150483035,0.77314874943181766,0.83466362497845192,0.89424889280468645,0.95149007994387713,1.0061176559456444,1.0599933278612073,1.1124501544155156,1.1640797702259442,1.2141403790449785,1.2623728391840132,1.3088329375052081,1.3537722121044593,1.3977516917492001,1.4403782094036601,1.4817169462526147,1.5215192030053222,1.5596273838465777,1.5963838069023666,1.6318684707232003,1.6426935581547102,1.6530524934958679,1.6629653502816648,1.6724513376364942,1.6815288374975752,1.6902154402354517,1.6985279787405965,1.7064825610421708,1.7140946015221459,1.7213788507852801,1.7283494242428248,1.7350198294653556,1.7414029923577294,1.747511282206891,1.7533565356510648,1.7589500796167814,1.7643027532681848,1.7694249290111546,1.7743265325929438,1.7790170623362829,1.7835056075452198,1.7878008661183651,1.7919111614036716,1.7958444583274098,1.7996083788285948,1.8032102166287718,1.8066569513657833,1.8099552621189043,1.8131115403515561,1.8140516737928094,1.8149513230188892,1.8158122313692047,1.8166360671111335,1.8174244266727877,1.8181788377365717,1.818900762199523,1.8195915990061748,1.8202526868594302,1.8208853068146986,1.8214906847623238,1.8220699938031135]
[5,2.65,2.44,4.21,4.0999999999999996,2.5099999999999998,0,null,"Inputs","Inputs received from OPUC in new Avoided Cost Input Template - Includes components from NWN's 2018 IRPs, CNG's 2018 IRP & 2020 IRP; Avista's 2018 IRP",null,"R-All-WH-Cwash-All-All-R","Res Clotheswasher",0,6.4337721155584324E-2,0.12824112313271077,0.19049997756664722,0.2522198257770788,0.3122200834156531,0.36983955436892862,0.42510618280063334,0.47946515507079079,0.53308600995616584,0.58652000992194286,0.63907631754798455,0.69128608525006552,0.74171387112939602,0.78980353017009275,0.83578396616079553,0.88157445043623273,0.9263126116078314,0.97046790561120622,1.0134352325027314,1.054685791925571,1.0944404262661087,1.1331180163825536,1.1710840248882224,1.207986168791936,1.2438118115834513,1.2783872912651191,1.31146604127983,1.3434726157700307,1.3743938566369394,1.3810669338671089,1.3874526537045919,1.3935633903911786,1.3994109853065724,1.4050067699146047,1.4103615877213342,1.4154858152875824,1.420389382336624,1.4250817909959941,1.429572134210702,1.4338691133635326,1.4379810551365764,1.4419159276466662,1.4456813558859862,1.4492846364977761,1.4527327519157565,1.4560323838946854,1.4591899264582535,1.4622114982894192,1.4651029545871854,1.4678698984127989,1.4705176915473575,1.4730514648818633,1.4754761283598592,1.4777963804919125,1.4800167174603849,1.4821414418321288,1.4841746708959984,1.4861203446413283,1.4866956607565198,1.4872462024935451,1.4877730366916557,1.4882771842496563,1.4887596221042023,1.4892212851229065,1.4896630679159248,1.4900858265695309,1.4904903803050391,1.4908775130662908,1.4912479750387808,1.4916024841033644]
[6,3.15,2.91,4.99,4.87,2.99,0,null,null,null,null,"R-All-HVAC-CAC-All-All-E","Res Central AC",0,0.24199737971431245,0.47496397089189074,0.69968298902239856,0.91701021059120713,1.1259206106586108,1.3256469838479965,1.5172381390987182,1.7021825829333073,1.8811541611883271,2.0541356427033253,2.2215939898589214,2.3834090275749187,2.5387968038228967,2.6871490345894826,2.8292352352904167,2.9671097069106853,3.1004663163980339,3.2292169607291399,3.3535456741352347,3.4722394380092592,3.5863850984018342,3.6960642866640647,3.8021780738855746,3.9042866897100708,4.002646446369714,4.0970588247976814,4.1873981557289488,4.2743105497326148,4.3576823229529245,4.4126318558714805,4.4652151409610079,4.5155340740610344,4.563686163151969,4.6097647173059721,4.6538590275011913,4.696054539649726,4.7364330201746396,4.7750727144568543,4.8120484984589726,4.8474320238198523,4.8812918567010763,4.9136936106544011,4.9447000737676303,4.9743713303353143,5.0027648772900353,5.0299357356199117,5.0559365569882146,5.0808177257617109,5.1046274566454377,5.1274118881131203,5.1492151718142516,5.1700795581311239,5.1900454780515757,5.2091516215161233,5.2274350123912869,5.2449310802144113,5.2616737288489803,5.2776954021834959,5.2803529393161721,5.2828960370507909,5.2853296233997069,5.2876584141642207,5.2898869220728466,5.292019465526077,5.2940601769645754,5.2960130108770134,5.2978817514630778,5.2996700199664897,5.301381281692243,5.3030188527216708]
[7,3.65,3.38,5.75,5.61,3.47,0,null,"Electric Avoided Cost Info",null,null,"R-All-HVAC-RAC-All-All-E","Res Window AC",0,0.25837111866333856,0.50698274279634403,0.74669643633137961,0.97839064829353917,1.2010412703799112,1.4139091523335818,1.6180594117878149,1.8150385596151806,2.0055251421675577,2.1895260174547304,2.367538433318559,2.5394447435928065,2.7044928763970346,2.8620682722464292,3.0129969369087126,3.1593381286011475,3.3008155401168193,3.4373252800382152,3.5690820300702399,3.6948779972789998,3.8157905671822685,3.9319848731460776,4.0443187279693404,4.152380946214727,4.2564502213932514,4.3563150742610688,4.4518751265274412,4.5437956385576772,4.6319577572912793,4.6913909678804231,4.7482648536116612,4.8026896246463391,4.8547707452536857,4.9046091381793762,4.9523013802135303,4.9979398893371227,5.0416131038094596,5.0834056535437533,5.1233985241028863,5.1616692136331572,5.198291883040115,5.2333374996974911,5.2668739749677069,5.29896629580045,5.3296766506643181,5.3590645500555789,5.3871869418175518,5.4140983214940812,5.4398508379309511,5.4644943943298703,5.4880767449508445,5.5106435876503417,5.5322386524345495,5.5529037861993418,5.5726790338211529,5.5916027157559007,5.609711502296328,5.6270404846316655,5.6298634693646479,5.6325648901617589,5.6351499818336368,5.6376237537684473,5.6399909996390791,5.6422563066923166,5.6444240646379971,5.6464984741553952,5.6484835550332884,5.6503831539595017,5.6522009519750176,5.6539404716070889]
[8,4.1900000000000004,3.88,6.7,6.53,3.97,0,null,"Updated on","2022-01-02",null,"Residential-res-Water Heating","Res Water Heat",0,6.5135780441267291E-2,0.12983346047056007,0.1928705114135634,0.25529901770031399,0.31604577813320162,0.37442077854871009,0.43041065473417689,0.48547269681225624,0.53975156004133029,0.59382978503673267,0.6470244338576473,0.69983122876940851,0.75092768713254765,0.79971014564765608,0.84636514215226366,0.89274446074746727,0.93804740752586047,0.98273881483965442,1.0262032715665292,1.0680237309507581,1.1082844409017518,1.1474271658470541,1.1858362893810481,1.2231467019608488,1.2593763559026228,1.2943237609143936,1.3277568879292561,1.3600970783076589,1.3913404235885565,1.3982055463566654,1.4047750418285398,1.4110616403662191,1.417077524134333,1.4228343507066907,1.4283432756563152,1.4336149741727027,1.4386596617481928,1.4434871139735421,1.4481066854810538,1.4525273280719737,1.4567576080632849,1.460805722887506,1.4646795169776696,1.468386496968257,1.4719338462415461,1.4753284388475647,1.4785768528246157,1.481685382946196,1.4846600529189997,1.4875066270556543,1.4902306214447971,1.4928373146401495,1.4953317578892902,1.4977187849219606,1.5000030213168609,1.5021888934650907,1.5042806371476072,1.5062823057433168,1.5069272920230199,1.5075445037739319,1.5081351370283933,1.5087003363149594,1.5092411968762665,1.5097587667913928,1.5102540490068248,1.5107280032799655,1.5111815480389519,1.5116155621623837,1.5120308866824139,1.5124283264145006]
[9,4.7300000000000004,4.38,7.64,7.43,4.46,0,null,"Base Year","2022$",null,"R-All-WH-WHConvert-All-All-N","Res HP Water Heat Convert",0,6.7952596827849071E-2,0.13536190649782523,0.20089686184586486,0.26577705079751057,0.3287563170438802,0.38924633508878742,0.44722572585321452,0.50418226010426814,0.56024465084883024,0.61605124062390904,0.67081517884973962,0.72519357633592885,0.77766003042914145,0.82767363685940964,0.87545036586195113,0.92302082342158542,0.96940509448144241,1.0151542291125617,1.0596167909886742,1.1022861981190866,1.1433520057096536,1.1833664891487061,1.2225812634578659,1.2606873974517487,1.2976546358638705,1.3333135821137321,1.3674324443081349,1.4004406887804102,1.4323309736614085,1.4400819356978356,1.4474991242494406,1.454596912337101,1.4613890540477805,1.4678887111871868,1.4741084787847047,1.4800604095000329,1.4857560369788159,1.4912063982025316,1.4964220548759437,1.5014131138935631,1.506189246924778,1.5107597091556055,1.5151333572233832,1.5193186663791509,1.5233237469109864,1.5271563598601112,1.5308239320602306,1.5343335705292445,1.5376920762412194,1.5409059573053103,1.5439814415771673,1.54692448872727,1.5497408017895691,1.5524358382128218,1.5550148204360303,1.5574827460084784,1.5598443972739791,1.5621043506380947,1.5627768239631246,1.5634203391066936,1.5640361430718317,1.5646254291628729,1.5651893392978407,1.5657289662212548,1.5662453556216511,1.5667395081579154,1.5672123813983598,1.567664891676297,1.5680979158657107,1.5685122930804603]
[10,5.25,4.87,8.5399999999999991,8.3000000000000007,4.95,0,null,"Discount Rate",4.4999999999999998E-2,null,"R-All-WH-SWH-All-All-C","Res Solar Water Heat",0,6.372603561035535E-2,0.12709696037360921,0.18883756283284603,0.24999709309676332,0.30954806504485571,0.3668065678991701,0.42171939026689892,0.47573290775243987,0.52900052253200325,0.58211788140040899,0.63436610716837127,0.68628217563783656,0.73653982654277639,0.78457026363355931,0.83050851466004527,0.87615948996490267,0.92075431780366146,0.96477828273113986,1.0075781031361597,1.0488049253122389,1.0884942160053135,1.1270826374828242,1.16493384688327,1.2017118570267846,1.2374291179703441,1.2718851675261371,1.304853257617145,1.3367337574600191,1.3675404460004132,1.3740889499865185,1.3803554609780069,1.386352122213881,1.3920905540185453,1.3975818763196595,1.4028367301963236,1.4078652984993516,1.4126773255835887,1.4172821361905146,1.421688653517716,1.4259054165102534,1.4299405964074183,1.4338020125769542,1.437497147667419,1.4410331621080552,1.4444169079842621,1.4476549423155607,1.4507535397617792,1.4537187047820843,1.4565561832704144,1.4592714736898689,1.4618698377276247,1.4643563104910271,1.4667357102646179,1.4690126478470018,1.4711915354856464,1.4732765954269331,1.4752718680980208,1.4771812199363825,1.4778078835253237,1.4784075616008654,1.478981416218609,1.4795305593934831,1.4800560552546065,1.4805589221073565,1.4810401344066386,1.4815006246451861,1.4819412851605425,1.4823629698642327,1.4827664958964724,1.4831526452096202]
[11,5.77,5.35,9.42,9.14,5.43,0,null,"Source","Link",null,"R-All-HVAC-ASHP-All-All-E","Res Air Source HP",0,9.033701971526148E-2,0.17904419710568939,0.26520174070267444,0.3495412838543564,0.43153971170471633,0.51032077551409305,0.58596959754819311,0.6597711170832945,0.73214848277057187,0.80347122106500057,0.87343163759713449,0.94221008478511015,1.0089105389771782,1.072730677601007,1.1340980890083869,1.1942370029138654,1.2529304207363552,1.3104162395082393,1.3661313473740746,1.4198487049549735,1.4715652770082777,1.5214771523103481,1.5702137895670554,1.6173688657950873,1.6630229554598077,1.7069523021161888,1.7490390991850875,1.7896099196638464,1.828733252775143,1.8424219918101514,1.8555212636139873,1.8680564519430169,1.8800518474731887,1.891530694870482,1.9025152378343992,1.9130267622017842,1.9230856371944971,1.932711354890873,1.9419225679974528,1.9507371259941799,1.9591721097231056,1.9672438644876278,1.9749680317264049,1.9823595793233209,1.9894328306122355,1.996201492132728,2.0026786801906158,2.0088769462747189,2.0148083013791238,2.0204842392780762,2.0259157587986043,2.0311133851340379,2.0360871902397157,2.0408468123504129,2.0454014746572997,2.0497600031806362,2.0539308438728243,2.0579220789849662,2.0590137465286826,2.0600584044652535,2.0610580771318285,2.062014701693144,2.0629301318953601,2.0638061416582461,2.0646444285126826,2.0654466168901338,2.0662142612704697,2.0669488491942363,2.0676518041452092,2.0683244883088197]
[12,6.28,5.82,10.28,9.9700000000000006,5.9,0,null,"Inputs","PAC and PGE avoided costs",null,"R-All-HVAC-ERconvertDHP-HZ1-All-N","Res Ductless HP Convert",0,6.4570274236578476E-2,0.128811075416851,0.1913711727670343,0.2531460658083004,0.31351306826547048,0.37167211665096056,0.42750288427956873,0.48233701805596779,0.53640668644113865,0.59029682038558451,0.64340906714677271,0.69608978716543091,0.74735793226911795,0.79650361351387655,0.84364813101411162,0.89018470462514265,0.93572958034751486,0.98065473052527741,1.024285125941097,1.0665535368218504,1.1072058886968601,1.1465813059967256,1.1851704165740169,1.2226233907630166,1.2589851588650232,1.2940224521607231,1.3275790550636799,1.3599745032667152,1.3912747274455541,1.3980698002495362,1.4045722622629162,1.4107947139503612,1.4167492131727966,1.4224472985531176,1.4279000118357215,1.4331179192831893,1.4381111321515796,1.4428893262840103,1.4474617608604992,1.4518372963403927,1.456024411632157,1.4600312205237975,1.46386548740575,1.467534642316709,1.4710457953415506,1.4744057503892458,1.477621018377471,1.4806978298494566,1.4836421470475292,1.4864596754667372,1.4891558749109555,1.4917359700728869,1.4942049606584673,1.4965676310752904,1.4988285597038293,1.5009921277694169,1.5030625278321801,1.5050437719113794,1.5057848139173549,1.5064939450235515,1.5071725393835482,1.5078219119768466,1.5084433211570363,1.5090379710902322,1.5096070140885058,1.5101515528428346,1.5106726425598958,1.5111712930068442,1.5116484704680389,1.5121050996175074]
[13,6.77,6.28,11.11,10.77,6.36,0,null,null,null,null,"R-All-HVAC-DHP_cool-All-All-N","Res Ductless HP - Cooling",0,0.22851987830931628,0.44860733965442362,0.66069807563381855,0.86604532059635786,1.0635282729460294,1.2522893171756879,1.4334912349737994,1.6083098285175594,1.7776061692872109,1.9413367004664348,2.0999947295789902,2.2534600272894565,2.4008164134668002,2.5414350903774743,2.6760421614423793,2.8068102469584884,2.9333845985976597,3.0556545587176172,3.1737978570358343,3.2864348509821801,3.3948988724048115,3.4991046089006201,3.6000556881605656,3.6972266853677698,3.7907965118890088,3.8806288462557772,3.9665898331175122,4.0493354292829871,4.1286946905086026,4.1800563201459786,4.2292062049664327,4.276239587569739,4.3212476091996974,4.3643174863575522,4.4055326798100447,4.4449730563196068,4.4827150434100975,4.518831777467982,4.5533932454659585,4.5864664205836396,4.6181153919881188,4.6484014890258987,4.6773834000668355,4.7051172862304114,4.731656890214694,4.7570536404388886,4.781356750701276,4.8046133155456658,4.8268684015211587,4.8481651345120609,4.8685447833071827,4.8880468395704568,4.9067090943678489,4.9245677113988444,4.9416572970744399,4.9580109675774011,4.9736604130347803,4.9886359589270093,4.9912061668102439,4.9936656958851096,4.9960193122246936,4.9982715766644876,5.0004268536403664,5.0024893196459921,5.0044629713260171,5.0063516332207776,5.0081589651774863,5.0098884694422789,5.0115434974468656,5.013127256302929]
[14,7.25,6.74,11.91,11.54,6.81,0,null,null,null,null,"R-All-HVAC-Zonal-All-All-E","Res Zonal Ele Heat",0,6.7384342377507969E-2,0.13425690304462129,0.19946276310461972,0.26373210396736185,0.32655876108125526,0.38703915529021748,0.445117126059832,0.50213184682433842,0.5583492431952306,0.61426233769921323,0.66942943510151831,0.72402044303627688,0.77717036068276946,0.82810364407041948,0.87708162646095933,0.92530924737600606,0.97255088766341258,1.0190747121016099,1.0642471562756186,1.108009521352187,1.1501349727739765,1.1908581853131193,1.2307763623892729,1.2694834829007955,1.3070526273558594,1.3432515397470604,1.3779208824891642,1.4113871253602479,1.4437099540319869,1.4511262570773134,1.4582231977905442,1.4650145286166023,1.4715134097898639,1.4777324348360472,1.4836836549759356,1.4893786024782212,1.4948283130067239,1.5000433470052912,1.5050338101618148,1.509809372991024,1.5143792895739994,1.5187524154907222,1.522937224980409,1.5269418273628845,1.5307739827528135,1.534441117097243,1.5379503365655964,1.5413084413200016,1.5445219386926383,1.5475970557956398,1.550539751587986,1.5533557284227668,1.5560504430971982,1.5586291174267977,1.5610967483642133,1.5634581176823146,1.5657178012403064,1.5678801778508245,1.5686704957742397,1.569426780868417,1.5701504986618882,1.5708430515743008,1.5715057816340257,1.5721399730787382,1.5727468548440138,1.5733276029447556,1.5738833427540782,1.5744151511840518,1.5749240587725435,1.5754110516801909]
[15,7.73,7.19,12.7,12.3,7.26,0,null,null,null,null,"R-All-HVAC-ER-All-All-E","Res Ele Resistance Heat",0,7.1970206521059177E-2,0.14323454407246461,0.21270929011034953,0.28103875664937689,0.34773021787569053,0.41193251364067518,0.47360045111956189,0.53406936745988531,0.59363354567569193,0.65274378571111535,0.71097791272053446,0.76853587476556395,0.82455334000346026,0.87819655802078955,0.92979394609313815,0.98055183003846147,1.030202472792539,1.0790578189439384,1.1264869096030548,1.1723804982407626,1.2165357842023659,1.2592174604187918,1.3010292763677245,1.3415420057105945,1.3808573771897175,1.4187125945407484,1.4549768044206273,1.4899625172071693,1.5237522712711258,1.5323488541110371,1.5405752491731532,1.5484473975579536,1.5559805539070446,1.563189315963591,1.5700876528598076,1.5766889321863309,1.5830059458959225,1.5890509350917037,1.594835613747954,1.6003711914094374,1.6056683949132491,1.6107374891752702,1.6155882970815101,1.6202302185228883,1.6246722486103315,1.6289229951054927,1.6329906951008619,1.6368832309815979,1.6406081457000059,1.6441726573922621,1.647583673365713,1.6508478034838481,1.6539713729748862,1.6569604346887985,1.6598207808265133,1.6625579541640396,1.6651772587932516,1.6676837704001528,1.6685773220299045,1.6694323953598105,1.6702506473501511,1.6710336636088503,1.6717829614640649,1.6724999929044615,1.6731861473928793,1.6738427545588295,1.6744710867750496,1.6750723616231074,1.6756477442528275,1.6761983496401196]
[16,8.1999999999999993,7.63,13.46,13.03,7.7,0,null,null,null,null,"R-All-Lgt-Lighting-All-All-R","Res Lighting",0,6.4082116775597039E-2,0.12777037476313016,0.18990628842604032,0.25138213750766364,0.31125369155076088,0.36883393905444062,0.42410547550170108,0.47844088487739983,0.53210738858358242,0.58557561432348793,0.63822546804233149,0.69056141008542116,0.74127057631235349,0.78970446319115251,0.83611796449639453,0.88220803124132219,0.92726912750576374,0.971777890809709,1.0150615276389023,1.0566970612673148,1.0968208910477537,1.1357967810473195,1.1740479552168541,1.2112019482594671,1.2472789522413676,1.282064569490097,1.3153821128096377,1.347569779505092,1.3786959043280407,1.3852553559870211,1.3915323432204951,1.3975390295683172,1.4032870547815439,1.4087875573779334,1.4140511962261528,1.4190881712005254,1.4239082429463366,1.4285207517940026,1.4329346358587551,1.4371584483609103,1.4412003742002937,1.4450682458169282,1.4487695583687314,1.4523114842556248,1.455700887018202,1.458944334637893,1.4620481122643918,1.4650182343950124,1.4678604565295779,1.4705802863234205,1.4731829942601118,1.4756736238646011,1.4780570014765526,1.4803377456028219,1.4825202758671945,1.484608821574728,1.486607429907296,1.4885199737662127,1.4891302584174839,1.4897142628684612,1.4902731188024108,1.4908079091698268,1.4913196702869709,1.4918093938440469,1.4922780288268946,1.4927264833559357,1.4931556264459269,1.4935662896899375,1.4939592688708092,1.4943353255032223]
[17,8.66,8.06,14.2,13.74,8.1300000000000008,0,null,null,null,null,"Residential-res-Other","Res Other",0,6.5232222864286649E-2,0.13000969792758607,0.1930818800064831,0.2555238392313508,0.31626997277756691,0.37465043501605017,0.43064466339607349,0.48567377586669713,0.53994262531627013,0.59400128281588294,0.64714420708726716,0.69994379306413312,0.75099661911356941,0.7997583423625908,0.84639981045164692,0.89276410929988237,0.93804820834968716,0.98275056939565397,1.0261965427066717,1.0679716672343256,1.1082281528536524,1.1473685065012202,1.185744375084318,1.2230353088491341,1.2592244598630462,1.2941415784804464,1.3275666820195204,1.3598759346887137,1.3911046806777716,1.3981019674264645,1.4047979356070319,1.4112055606602065,1.4173372592756845,1.4232049134531755,1.4288198935273295,1.4341930802011611,1.4393348856306651,1.4442552736014822,1.4489637788367138,1.4534695254732992,1.4577812447427589,1.4619072918905673,1.465855662366939,1.4696340073204046,1.4732496484241995,1.4767095920641946,1.4800205429158646,1.4831889169366015,1.4862208537985506,1.4891222287860617,1.4918986641808092,1.4945555401566442,1.49709800520529,1.499530986113085,1.5018591975081041,1.5040871509961609,1.5062191639033922,1.5082593676423695,1.5088716739036383,1.5094576129096371,1.5100183200924113,1.5105548819898029,1.5110683383509433,1.5115596841510774,1.5120298715196268,1.5124798115852245,1.5129103762412985,1.513322399835628,1.5137166807871396,1.5140939831330835]
[18,9.1,8.4700000000000006,14.9,14.43,8.5399999999999991,0,null,null,null,null,"R-All-Bld-Bldg-All-All-R","Res Whole Home",0,7.0516646340495065E-2,0.14030930304642278,0.2082489262925783,0.27530330293326882,0.34054395161751383,0.40326316449802191,0.46346940751862148,0.52250517695645249,0.58065875028604341,0.63841565399887323,0.69518911302843189,0.75142972038643541,0.80590990612367619,0.85800459008265517,0.90789698722906953,0.95728332755097023,1.005514904434039,1.0530358492565199,1.0991999992669388,1.1436383397116521,1.1864479515581092,1.2279658311763684,1.2686518091564252,1.3081272143584624,1.3464361648227288,1.3833559546746079,1.4187066093079075,1.4528472772308376,1.4858271732044837,1.4941602842668273,1.502134553226008,1.5097654326127836,1.5170677095379277,1.5240555343466782,1.5307424480392622,1.5371414085106345,1.5432648156602731,1.5491245354206928,1.5547319227512379,1.5600978436417119,1.5652326961684813,1.5701464306438584,1.574848568897808,1.5793482227293387,1.5836541115633394,1.5877745793470721,1.5917176107190651,1.5954908464817379,1.5991015984077406,1.6025568634087,1.6058633370938287,1.6090274267446694,1.6120552637311198,1.6149527153927949,1.6177253964087521,1.6203786796776105,1.6229177067291496,1.6253473976875603,1.6260745529051397,1.6267703952186128,1.6274362730305487,1.6280734766783345,1.6286832409345888,1.6292667473999041,1.6298251267925501,1.6303594611395797,1.6308707858735794,1.6313600918391291,1.6318283272128613,1.6322763993408345]
[19,9.51,8.86,15.58,15.08,8.93,0,null,null,null,null,"Residential-Spa Heater","Res Spa Cover",0,9.179084193149549E-2,0.18213904261994601,0.26961722611067612,0.35540251671163614,0.43827653934647826,0.51791721536707325,0.59425172950931471,0.6689484355832046,0.74198935756987972,0.81404587193820044,0.88418783401316281,0.95341236886139669,1.0201078070030791,1.083562601171796,1.1442811451044768,1.204326434773054,1.2625915242998651,1.3196592639928302,1.3750214856340035,1.4281740260821478,1.4791088292092132,1.5287725476971585,1.5770849042164736,1.6239507717827146,1.669280134916439,1.7129293244084449,1.754723080808795,1.7950847799939849,1.8339815901103529,1.8483537663049545,1.8621070449600754,1.8752680771659329,1.8878623663581411,1.8999143177382445,1.9114472855660947,1.9224836184157124,1.9330447024823318,1.9431510030245516,1.9528221040218907,1.9620767461246078,1.9709328629693132,1.9794076159307536,1.9875174273771081,1.995278012493237,2.0027044097335516,2.0098110099635176,2.01661158434626,2.0231193110283106,2.0293468006762061,2.0353061209134262,2.0410088197050245,2.0464659477352618,2.0516880798216137,2.0566853354066397,2.0614673981674296,2.0660435347806256,2.0704226128793781,2.0746131182370364,2.0755925744018158,2.0765298530283989,2.0774267703744114,2.0782850644854283,2.0791063985629563,2.0798923641873852,2.0806444844021494,2.0813642166650821,2.082052955672673,2.0827120360627123,2.0833427350005489,2.083946274653981]
[20,9.91,9.24,16.22,15.7,9.31,0,null,null,null,null,"Residential-Res-TV","Res Power Strip",0,7.0819251359492158E-2,0.14094244778493883,0.20915232188387436,0.27651493159109403,0.34196744289656322,0.4048638428964349,0.46516257236556124,0.52432617873828913,0.58253113647442989,0.64036640449570736,0.69711058102786161,0.75334621546394909,0.80770408790826032,0.8596620362950067,0.90934875946923377,0.95861621629161475,1.0066648675034231,1.0540071303532237,1.0999780155602403,1.1441957574720878,1.1867718578980901,1.2281322440621749,1.2686285586984578,1.3079442624053272,1.3460864398381784,1.382866354879988,1.4180654015933114,1.4520726453403667,1.4849286408646147,1.493472674838259,1.5016487839039476,1.5094728117180034,1.516959919674038,1.5241246162826831,1.5309807852861717,1.537541712562237,1.5438201118694765,1.54982814948406,1.5555774677755274,1.5610792077673623,1.5663440307260559,1.5713821388204994,1.5762032948917375,1.5808168413713908,1.5852317183854134,1.5894564810782579,1.5934993161910276,1.5973680579257357,1.6010702031264132,1.6046129258064874,1.6080030910505776,1.6112472683176495,1.6143517441713069,1.6173225344618882,1.6201653959839752,1.6228858376319057,1.6254891310749011,1.6279803209725046,1.6286617598011157,1.6293138543739494,1.6299378683192447,1.6305350108506278,1.6311064391103245,1.6316532604114697,1.6321765343838575,1.6326772750272907,1.633156452676509,1.6336149958815027,1.6340537932068555,1.6344736949536047]
[21,10.3,9.6,16.84,16.3,9.67,0,null,null,null,null,"Res-Conditioning-Synthetic-ETO","Res Space Conditioning",0,0.14300111710620908,0.28176029025866284,0.41606487294521616,0.54664468594311233,0.67272533137629464,0.7934790357886139,0.90937301387280778,1.0218074730003206,1.1312346104316737,1.2378701027467174,1.3417027555920085,1.4427616612992866,1.5402035127854754,1.633302050845558,1.722580751456942,1.8096525528192056,1.894211536010427,1.9763715777754451,2.0558892059027465,2.1321069406650697,2.2054458727715818,2.2760510756842285,2.344680903501017,2.410888826863312,2.4748372688352314,2.5362983431110693,2.5951241977991701,2.6517866634569223,2.7062675686857558,2.734187651481641,2.7609054340614354,2.7864726901186549,2.810938963857621,2.8343516660001722,2.856756165658116,2.8781958782494494,2.8987123496287164,2.918345336594522,2.9371328839302215,2.9551113981270625,2.9723157179326525,2.9887791818614464,3.0045336927980912,3.0196097798188037,3.0340366573505868,3.0478422817829145,3.0610534056416014,3.0736956294298183,3.0857934512367251,3.097370314209841,3.1084486519831582,3.1190499321490117,3.1291946978579621,3.1389026076272932,3.1481924734352651,3.1570822971749517,3.1655893055382878,3.1737299833979393,3.1753254098745765,3.1768521337756646,3.1783131135853182,3.1797111803888147,3.181049043358668,3.1823292950044602,3.1835544161966061,3.1847267809737794,3.1858486611433228,3.1869222306835554,3.1879495699565057,3.1889326697392333]
[22,10.66,9.9499999999999993,17.43,16.87,10.01,0,null,null,null,null,"R-All-Plug-EVSEStandbySave-All-All-U","Res EV Standby Mode",0,5.5020044366498599E-2,0.11005753898496558,0.16372868515060474,0.21713035417219084,0.26922561037763104,0.31934019017898996,0.36741692143732724,0.41483099963884262,0.46180819567277814,0.50887581252654002,0.55525944817107264,0.60161434644472433,0.64645290250444076,0.68934778648606554,0.73034616607470559,0.77126219455262812,0.81131129116724865,0.85103233217266572,0.88966568220736075,0.92686118843488607,0.96278264490434251,0.9977297722606534,1.0320412606137896,1.0654584887840801,1.0979139578101149,1.129285087107585,1.159325924306098,1.1883574769331007,1.2164582487575555,1.220844949300288,1.2250427488627114,1.2290597819368008,1.2329038327254029,1.2365823502264577,1.2401024626676584,1.2434709913195252,1.2466944637136561,1.2497791262917717,1.2527309565100642,1.2555556744223058,1.2582587537641639,1.2608454325602001,1.2633207232741106,1.265689422521872,1.2679561203666194,1.2701252092132678,1.2722008923201082,1.274187191943879,1.2760879571340904,1.277906871191709,1.2796474588066551,1.281313092887943,1.2829070010997019,1.2844322721157391,1.2858918616047699,1.2872885979579094,1.2886251877695261,1.2899042210820779,1.2904049325870468,1.2908840823525674,1.2913425988745966,1.291781370666012,1.2922012479783713,1.2926030444495284,1.2929875386803009,1.2933554757432411,1.2937075686264374,1.2940444996151421,1.2943669216139024,1.2946754594117593]
[23,11.02,10.28,18,17.420000000000002,10.34,0,null,null,null,null,"R-All-Plug-EVSEChargeSave-All-All-U","Res EV Charging Mode",0,7.5386653451502875E-2,0.1498886045275456,0.22226215563988236,0.29361402700612382,0.36287166988789588,0.42938660239704263,0.49315417043943321,0.55563295881224084,0.61701835369392155,0.67788644938721809,0.73752628321833702,0.79654242586631752,0.85351921269456499,0.90794595753451512,0.95999708489425373,1.0115435605888832,1.0617745605431896,1.1112029830964545,1.1591761293848575,1.2052787158903686,1.2496760257856288,1.2927803305284047,1.33494459079046,1.3758635203969924,1.4155279848621614,1.4537754212992973,1.4903783431083062,1.5257312159226053,1.5598679328269662,1.5697270052636589,1.5791615243418338,1.5881897722635321,1.5968292439589371,1.6050966809880329,1.6130081039823829,1.6205788436898949,1.6278235706827293,1.6347563237859202,1.6413905372817965,1.6477390669429224,1.6538142149439994,1.6596277537010111,1.6651909486837975,1.6705145802462724,1.6756089645165835,1.6804839733876946,1.6851490536471307,1.6896132452829551,1.6938851990014472,1.6979731929904349,1.701885148960758,1.7056286474969524,1.7092109427468993,1.7126389764789056,1.7159193915334574,1.7190585446957076,1.7220625190136507,1.7249371355858449,1.7256700273504106,1.7263713591825309,1.7270424901223589,1.7276847206867878,1.7282992953895904,1.7288874051530378,1.7294501896156671,1.7299887393406712,1.7305040979291917,1.7309972640426088,1.7314691933377444,1.7319208003187356]
[24,11.35,10.59,18.54,17.940000000000001,10.66,0,null,null,null,null,"A-Irr-Irr-Irrigation-All-All-E","Ag-Irrigation",0,6.7586084586229014E-2,0.13457946539816759,0.19910423008779549,0.26330230064759858,0.3251289648002284,0.38446753595594768,0.44133941658451592,0.49698711572988646,0.5516423902374904,0.60611329892065346,0.65916263471399961,0.71201567602581628,0.76247683679203027,0.81057597641689028,0.85598935758346284,0.90169518114894598,0.94599818209507369,0.98987816839404053,1.0324222466309085,1.0729104975507977,1.1119733228108819,1.1502942601084516,1.1877508641350436,1.2242566771560275,1.259559415860906,1.2937174519914389,1.3264073273080237,1.3580468612891663,1.3886260343174124,1.3971822212923541,1.4053699600243557,1.4132051167056967,1.420702874295497,1.4278777619412386,1.4347436831333362,1.4413139426473049,1.4476012723257439,1.4536178557500876,1.4593753518499377,1.4648849174957277,1.470157229118493,1.4752025033986511,1.4800305170638743,1.484650625834423,1.4890717825526512,1.4933025545318168,1.4973511401578128,1.5012253847759909,1.5049327958938643,1.5084805577291502,1.5118755451313375,1.5151243369037655,1.5182332285520219,1.5212082444833679,1.5240551496808281,1.5267794608745699,1.5293864572322176,1.5318811905888183,1.5324945721784358,1.5330815402067774,1.5336432320999276,1.5341807363038991,1.5346950943938238,1.5351873030923162,1.5356583162009216,1.5361090464483911,1.5365403672593663,1.5369531144469026,1.5373480878321046,1.5377260527940204]
[25,11.67,10.89,19.059999999999999,18.440000000000001,10.96,0,null,null,null,null,"DSI-0","Flat",0,6.0094988399107034E-2,0.11990470324101701,0.1781413872553205,0.23587347592740363,0.29207288228030465,0.34609725705195343,0.39791053439208013,0.44887695973662861,0.4992011965741589,0.54941264889993946,0.59878277350536702,0.64792680008498582,0.69542615902272886,0.74083177855575466,0.78423945299315911,0.82743508142297584,0.869640748954149,0.91136898527965016,0.9519249350322202,0.99093750809489645,1.0285686542496042,1.0651554399808598,1.1010286012009383,1.1359175794963856,1.1697787968507514,1.2024766025996727,1.2337793581081913,1.2640270014526909,1.2932768129839951,1.2993291010722983,1.3051207643146938,1.3106630257906704,1.3159666252892126,1.3210418401203534,1.3258985050305361,1.3305460312603758,1.3349934247817536,1.3392493037495792,1.3433219152020439,1.3472191510417231,1.3509485633284974,1.3545173789139273,1.3579325134454392,1.3612005847674602,1.3643279257454708,1.3673205965378252,1.3701843963391216,1.3729248746178739,1.3755473418702686,1.3780568799108377,1.3804583517199946,1.3827564108675132,1.3849555105302105,1.3870599121213083,1.3890736935481962,1.3910007571145961,1.3928448370824429,1.3946095069081335,1.3951732195372772,1.3957126574599026,1.3962288659983002,1.3967228454608818,1.3971955530805766,1.3976479048697585,1.3980807773952915,1.3984950094771413,1.3988914038138396,1.3992707285379526,1.3996337187045682,1.3999810777156836]
[26,11.98,11.18,19.559999999999999,18.920000000000002,11.25,0,null,null,null,null,"IndShift1","1-Shift Industrial",0,6.6223579500140739E-2,0.13185598704804147,0.1957884241528301,0.25905105489442964,0.32051734391637365,0.3795455127126684,0.43614057260698885,0.49176355551807716,0.54652692370416678,0.60100444592697821,0.65454280705778278,0.70762341766647019,0.75893126556395829,0.80784955566103156,0.85463885752194724,0.90115569912343507,0.94655622219772062,0.99128702481713349,1.0347914700930425,1.0765816085642359,1.1167853897881581,1.1559065415157124,1.1942830589913487,1.2315459485826759,1.2677259847717297,1.3026076947659255,1.3359700680085127,1.36825664629066,1.3994400700421452,1.4068662953988034,1.4139727311468016,1.4207731481305321,1.4272807241915182,1.4335080697044236,1.439467252013424,1.4451698188162951,1.4506268205415307,1.4558488317618516,1.4608459716856041,1.4656279237657497,1.4702039544644538,1.474582931209625,1.4787733395782099,1.4827832997395352,1.486620582190564,1.4902926228135585,1.4938065372853233,1.4971691348659595,1.500386931593841,1.5034661629123878,1.5064127957531028,1.5092325400982844,1.5119308600458266,1.5145129843975416,1.5169839167915271,1.5193484453982122,1.5216111521988676,1.5237764218645664,1.5244206008841179,1.525037040137277,1.5256269341594393,1.5261914260466756,1.5267316096708252,1.527248531799198,1.527743194123,1.5282165551984084,1.5286695323040622,1.5291030032185637,1.529517807921436,1.5299147502208352]
[27,12.27,11.46,20.03,19.38,11.52,0,null,null,null,null,"IndShift2","2-Shift Industrial",0,6.543335871741103E-2,0.13031470833668049,0.19351498654872099,0.25606806405470772,0.31685794581447319,0.37524279139736777,0.4312227237207657,0.48624852666879959,0.54044204187662848,0.59437213464162664,0.6473772522033544,0.69995290768801544,0.75077281684957708,0.7992392744321154,0.84559350889228091,0.89168425389311734,0.93667533388697921,0.98102050902119009,1.024147351908808,1.0655810169982269,1.1054529655936098,1.1442484612615853,1.1823046235813843,1.2192633335283425,1.255147235180605,1.2897495799859628,1.3228478411985434,1.3548740510206163,1.3858104994471234,1.3930533288199518,1.3999842660188306,1.4066167418072315,1.4129636085903901,1.4190371653206852,1.4248491813305373,1.4304109191390082,1.4357331562763009,1.4408262061684471,1.4456999381226536,1.4503637964520382,1.4548268187768081,1.4590976535373534,1.4631845767531864,1.4670955080602033,1.4708380260573488,1.4744193829924164,1.4778465188154475,1.4811260746269606,1.4842644055470686,1.4872675930304258,1.4901414566508631,1.4928915653785544,1.4955232483715604,1.4980416053026666,1.5004515162415242,1.5027576511112444,1.5049644787377709,1.5070762755095668,1.507709847779777,1.5083161370335667,1.5088963181376718,1.5094515153664803,1.5099828045806514,1.5104912153119154,1.5109777327581011,1.51144329969225,1.5118888182895218,1.5123151518754279,1.5127231265987828,1.5131135330326153]
[28,12.56,11.73,20.49,19.82,11.79,0,null,null,null,null,"IndShift3","3-Shift Industrial",0,6.1917216150334568E-2,0.12345253480703901,0.18339941936213125,0.24280685518255188,0.3005975583049641,0.35612716808165296,0.40937626858810133,0.46175616115023471,0.51342408845614695,0.56492979096158369,0.61557867443807768,0.66592186397239395,0.71458729147722488,0.76104735177315519,0.80547454214979897,0.84968381776364099,0.89286772230840528,0.93550447353350408,0.97696591091639562,1.016823836035988,1.0552244035327016,1.0925812292611563,1.1292278708819903,1.1648463282363546,1.1994291949484097,1.2328008862648296,1.2647335212140278,1.2956159119061568,1.3254647352831375,1.3318678092998917,1.3379951528565941,1.3438586395137255,1.3494696315301191,1.3548390018807352,1.3599771553263009,1.364894048575646,1.3695992095798042,1.3741017559952662,1.3784104128521679,1.382533529461643,1.3864790955951123,1.3902547569668529,1.3938678300498586,1.3973253162536916,1.4006339154918093,1.403800039164649,1.4068298225836346,1.4097291368601761,1.4125036002827034,1.4151585892037823,1.4176992484584034,1.4201305013336389,1.422457059108984,1.4246834301858688,1.4268139288240365,1.4288526835017088,1.4308036449157493,1.4326705936373192,1.4332531714482499,1.4338106621764133,1.4343441461268089,1.4348546570841254,1.4353431843160069,1.4358106744900565,1.4362580335082855,1.4366861282625718,1.4370957883145203,1.437487807502988,1.4378629454823826,1.438221929194722]
[29,12.83,11.98,20.92,20.239999999999998,12.04,0,null,null,null,null,"Commercial-Ref.warehouse-Refrig","Cold Storage",0,6.2079100805788962E-2,0.1237087041690348,0.18376560599971767,0.24325864826901455,0.30111649993281286,0.35668559294823038,0.41000373900151033,0.46242160340443833,0.51418404494806147,0.56573840703152145,0.6164337507575024,0.66684282285114382,0.71553386329200508,0.76202543716223781,0.8064937219920213,0.8507535597020609,0.8940049823890599,0.93673044202482414,0.97828446530097046,1.0181661116075338,1.056666014103175,1.0940798217177832,1.1307809562523288,1.1664624962567176,1.2010914748356429,1.2345234017879634,1.2665301143597398,1.2974605503983889,1.327366491421446,1.3338542732921141,1.340062676996103,1.346003733172169,1.3516889543932848,1.357129357475692,1.362335484827278,1.3673174248766427,1.3720848316224461,1.3766469433409183,1.3810126004877816,1.3851902628292778,1.3891880258354941,1.3930136363677583,1.3966745076904994,1.4001777338366632,1.4035301033545231,1.4067381124625229,1.4098079776376427,1.4127456476616804,1.4155568151487981,1.4182469275766618,1.4208211978425602,1.4232846143649511,1.425641950750014,1.4278977750419402,1.4300564585748838,1.4321221844437293,1.4340989556100889,1.4359906026592366,1.4365576030370837,1.4371001871307172,1.4376194063590746,1.4381162668646799,1.438591731463345,1.4390467215099145,1.4394821186836653,1.4398987666968239,1.4402974729295117,1.4406790099942846,1.4410441172333017,1.4413935021510216]
[30,13.08,12.22,21.34,20.64,12.28,0,null,null,null,null,"SIC 20-IND_SIC 20","Food Products",0,6.1630987819504664E-2,0.1228585996665741,0.18254716085089406,0.24164678401689807,0.29916580779052715,0.35442693000536973,0.40744112231475899,0.45954826486511885,0.51103951006790493,0.56233757412845431,0.61279464621839497,0.66301425570709382,0.71155196749747185,0.75789036180126013,0.8022647979962898,0.84640503293763725,0.88954551031455764,0.93218590135062107,0.9736456638272486,1.0134335677846549,1.0518505370352629,1.0891805555731424,1.1257974811893334,1.1613977633187769,1.1959439692615565,1.2292869287257235,1.2612208538658567,1.2920698491418192,1.3219136179372335,1.3282928415248771,1.3343973617044407,1.3402390078092863,1.3458290997756455,1.3511784700783815,1.3562974847221481,1.3611960633286233,1.365883698358743,1.3703694735071832,1.3746620813047334,1.3787698399626762,1.382700709491808,1.386462307127341,1.3900619220895734,1.3935065297089344,1.396802804942773,1.3999571353100826,1.4029756332692307,1.4058641480626737,1.4086282770516143,1.4112733765625622,1.4138045722668187,1.4162267691129971,1.418544660831828,1.4207627390316662,1.4228853019023249,1.4249164625441035,1.42686015693815,1.4287201515736012,1.4292911237955486,1.4298375086969335,1.4303603650618955,1.4308607060809977,1.4313395013145882,1.4317976785716127,1.4322361257075211,1.4326556923447544,1.4330571915191401,1.4334414012553944,1.4338090660747764,1.4341608984378218]
[31,13.33,12.46,21.74,21.02,12.51,0,null,null,null,null,"SIC 24-IND_SIC 24","Wood Products",0,6.2100019893281649E-2,0.12382396200786024,0.1839498588737136,0.24348579279254412,0.30142671977254132,0.35712020130762157,0.41052339648406427,0.46303767405339519,0.51484405683544987,0.56647540753341452,0.61723001530069033,0.66768674099993441,0.71647526613049994,0.76311291247614033,0.80772121344818448,0.85205659499664577,0.89536388493580044,0.93813492563575507,0.97969709411575612,1.0196845537607184,1.0582311127543342,1.0956974474258856,1.1324247092240218,1.1681205879007266,1.2027720631540313,1.2362145498298724,1.2682261661780951,1.2991584038112276,1.3290659538515346,1.3355947856882187,1.3418424716563373,1.3478211185157809,1.3535423116827128,1.3590171376797764,1.3642562056195504,1.3692696677628748,1.3740672391918936,1.3786582166359305,1.3830514964866836,1.3872555920376435,1.3912786499811458,1.3951284661950236,1.3988125008494521,1.4023378928632593,1.4057114737377159,1.4089397807946122,1.4120290698442737,1.4149853273080646,1.4178142818188693,1.4205214153220316,1.4231119736982636,1.4255909769291075,1.427963228824652,1.4302333263323501,1.43240566844498,1.4344844647250083,1.4364737434618777,1.4383773594780207,1.4389692415289117,1.4395356358359843,1.4400776399575852,1.4405963041887819,1.4410926335966259,1.4415675899677682,1.4420220936722108,1.442457025446797,1.4428732281019034,1.4432715081546368,1.4436526373917022,1.4440173543649706]
[32,13.57,12.68,22.12,21.39,12.73,0,null,null,null,null,"SIC 26-IND_SIC 26","Pulp & Paper",0,6.1468958988201899E-2,0.12257171290553687,0.18207483817519257,0.24102736800699112,0.29838486252877955,0.35350898421521976,0.40637359035750986,0.45835518689871763,0.509649229123876,0.56078139915841496,0.61102056731212862,0.66098943568702928,0.70926708282878692,0.75545447984402647,0.79958472728133689,0.8434768772406982,0.88634474624766024,0.92870453023236121,0.96986698380090863,1.0094554228659069,1.0476516388087791,1.0847703696563951,1.1211504473036962,1.1565229692896126,1.1908570383391945,1.22401205795919,1.255748080246212,1.2864063753369237,1.3160496437940772,1.3224797331803488,1.3286329287652978,1.3345211542054403,1.3401558196983998,1.3455478440935764,1.3507076760506833,1.355645314287149,1.3603703269536234,1.3648918701751298,1.3692187057937966,1.3733592183475445,1.3773214313176381,1.3811130226765795,1.3847413397664756,1.3882134135367112,1.3915359721685154,1.3947154541128257,1.3977580205667111,1.4006695674125345,1.4034557366429874,1.4061219272941385,1.4086733059076804,1.4111148165426486,1.4134511903560152,1.4156869547707203,1.4178264422489071,1.4198737986873631,1.4218329914514358,1.4237078170629887,1.4242797947990971,1.4248271419149903,1.4253509190593856,1.4258521412071326,1.4263317796260293,1.4267907637589445,1.4272299830248922,1.4276502885425455,1.4280524947795343,1.4284373811307198,1.4288056934285049,1.4291581453881079]
[33,13.79,12.89,22.48,21.75,12.95,0,null,null,null,null,"SIC 28-IND_SIC 28","Chemicals",0,5.8730163309354433E-2,0.11723563206082356,0.17424573460302417,0.23078715235176955,0.28587706534455459,0.33884373993984435,0.38964516084429152,0.43964602386841406,0.48904429674452676,0.53836815932440496,0.5869025146948057,0.63522897245274457,0.6819765259559597,0.7266817313304007,0.76943293032570981,0.81196820308387563,0.85355390093341965,0.89467878475097895,0.93466258936508262,0.97315746494835564,1.0102877955513441,1.0463738717350184,1.0817706819493422,1.1162004392648801,1.1496265677180915,1.1819056422963807,1.2128039715654997,1.2426645659378692,1.2715391482062508,1.2771998086122325,1.2826167085222626,1.2878003447998034,1.292760762290273,1.297507573285938,1.3020499761526028,1.3063967731541961,1.3105563875097876,1.3145368797160952,1.3183459631671075,1.3219910191010906,1.325479110903945,1.3288169977966289,1.3320111479331682,1.3350677509346416,1.3379927298834196,1.3407917528009108,1.3434702436310457,1.3460333927507919,1.3484861670280612,1.3508333194465008,1.3530793983158209,1.3552287560855054,1.3572855577789831,1.3592537890646079,1.3611372639790813,1.3629396323182901,1.3646643867098778,1.3663148693812532,1.3668610763850566,1.3673837625130982,1.3678839406260566,1.3683625799686003,1.3688206080475898,1.3692589124293979,1.369678342459836,1.3700797109100162,1.370463795551337,1.3708313406626489,1.3711830584725164,1.3715196305393755]
[34,14.01,13.09,22.83,22.08,13.15,0,null,null,null,null,"SIC 29-IND_SIC 29","Oil & Petroleum",0,5.8646096159532951E-2,0.11707517160288629,0.17396556516699488,0.23042230178821263,0.28537981844230181,0.33822049093142476,0.38889883616271109,0.43877143575924016,0.48804272553682049,0.53725604043791098,0.58565494008756369,0.6338815254106458,0.68048713150910656,0.72502884501886344,0.76759379679044326,0.81000570415292672,0.85144969709947371,0.89245836469492124,0.93232146389764992,0.97065655333844658,1.0076338188375478,1.0436157311088654,1.0789042012727232,1.1132389414726203,1.1465621769068561,1.1787456913630712,1.2095603203927374,1.2393420865999842,1.268148309821348,1.2738102984732373,1.2792284694319831,1.2844133220240845,1.2893749034519328,1.2941228282632706,1.2986662969822544,1.3030141139382196,1.307174704326703,1.3111561305357782,1.3149661077693429,1.3186120189976345,1.3221009292639423,1.3254395993752417,1.3286344990032792,1.3316918192214968,1.3346174845020882,1.3374171641964336,1.3400962835211663,1.3426600340711496,1.3451133838797462,1.3474610870458674,1.3497076929464618,1.3518575550522938,1.3539148393640947,1.3558835324854355,1.3577674493479621,1.3595702406039687,1.3612953997006259,1.3629462696495798,1.3634865450132361,1.3640035549306107,1.3644983012630265,1.364971742729453,1.3654247967643112,1.3658583412952756,1.3662732164445242,1.3666702261567236,1.3670501397569144,1.3674136934413075,1.3677615917038846,1.3680945087015661]
[35,14.22,13.29,23.17,22.4,13.34,0,null,null,null,null,"SIC 33-IND_SIC 33","Primary Metals",0,5.8848520734048129E-2,0.11749691353586587,0.17458300127903126,0.23120456396289124,0.28637323907455164,0.33941827207750103,0.39029172381897143,0.44034555247020796,0.48978783082707933,0.53916078787904909,0.58774380688611971,0.63612448618846884,0.68291278544232126,0.7276360426446643,0.77040305751372973,0.81295272961040554,0.85455141868956574,0.8956929053330408,0.93568108724035537,0.97417453316911085,1.0113077932305095,1.0473968241677794,1.0827963244096199,1.1172297276230228,1.150647196618326,1.1829198626982982,1.213813983683975,1.2436706802631199,1.2725432632393134,1.278283593082753,1.2837767316889148,1.2890333236565341,1.2940635552044952,1.2988771739106779,1.3034835076008049,1.3078914824238927,1.312109640149336,1.316146154719138,1.3200088480873697,1.3237052053775433,1.3272423893872791,1.3306272544683659,1.3338663598091189,1.3369659821447677,1.3399321279205081,1.3427705449307861,1.3454867334573679,1.348085956927781,1.3505732521147791,1.3529534388965956,1.3552311295968984,1.3574107379225471,1.3594964875164692,1.361492420142232,1.3634024035161678,1.3652301388022308,1.3669791677841092,1.3686528797284905,1.3692039122297575,1.3697312160587214,1.3702358130242369,1.370718680933821,1.3711807554884472,1.3716229320957447,1.3720460676051207,1.3724509819681596,1.3728384598275269,1.3732092520374481,1.3735640771187123,1.3739036226510224]
[36,14.41,13.48,23.49,22.71,13.53,0,null,null,null,null,"SIC 37-IND_SIC 37","Transportation & Equipment",0,6.1621328854968148E-2,0.12288611333599753,0.18253302703358062,0.24164166097306572,0.299151365795296,0.35442302174514201,0.40742105023452069,0.45953711614731313,0.51094418086783333,0.56220169103585138,0.61258168957781489,0.66267541028198362,0.71109003931550485,0.75735836688876956,0.80157812635786418,0.84556896640017498,0.88853337509410713,0.93097203742019508,0.9722203590488836,1.0118947604877144,1.0501349677702965,1.0873223865655386,1.1237835264452354,1.1592306029638624,1.1936377216217533,1.2268508880465505,1.2586361100376227,1.2893623561565342,1.3190638375975612,1.3254814351623405,1.3316226768511246,1.3374994631561812,1.3431231821083884,1.3485047313449503,1.3536545392268278,1.3585825850468063,1.3632984183673598,1.3678111775257842,1.3721296073424583,1.3762620760665483,1.3802165915919933,1.3840008169751943,1.3876220852844774,1.3910874138101075,1.3944035176623848,1.3975768227841814,1.4006134784031254,1.4035193689475696,1.4063001254494298,1.4089611364559949,1.4115075584718464,1.4139443259511302,1.4162761608595358,1.4185075818245172,1.420642912891485,1.4226862919029375,1.4246416785167677,1.4265128618792846,1.4270997144125872,1.427661295784169,1.4281986942258738,1.4287129511078882,1.4292050629567055,1.4296759833861961,1.4301266249455169,1.4305578608874507,1.4309705268605932,1.431365422528672,1.4317433131201354,1.432104930911009]
[37,14.6,13.65,23.79,23.01,13.71,0,null,null,null,null,"Other SICs-IND_Other SICs","Other Industrial",0,6.1621328573533148E-2,0.12288611278306694,0.18253302621453993,0.24164165990220948,0.29915136448337293,0.35442302020170052,0.40742104847248606,0.45953711417008258,0.51094417868519781,0.56220168865614817,0.61258168701165605,0.6626754075361545,0.71109003639604307,0.75735836380641663,0.80157812311590315,0.84556896300455742,0.88853337155289569,0.93097203374116833,0.97222035523670858,1.0118947565466705,1.0501349637090991,1.087322382387228,1.1237835221556558,1.1592305985673812,1.1936377171226586,1.2268508834494518,1.258636105347303,1.2893623513765242,1.3190638327309847,1.3254814302200157,1.3316226718363133,1.3374994580720048,1.3431231769578338,1.3485047261308762,1.3536545339519692,1.3585825797137809,1.3632984129786723,1.3678111720838317,1.3721296018495344,1.3762620705248478,1.3802165860036166,1.3840008113421516,1.3876220796086922,1.3910874080934201,1.394403511906557,1.3975768169908982,1.4006134725739998,1.4035193630841449,1.4063001195531832,1.4089611305283398,1.4115075525141354,1.4139443199646575,1.4162761548455398,1.4185075757841834,1.4206429068259474,1.4226862858132814,1.4246416724040316,1.4265128557444624,1.4270997082758798,1.4276612896456573,1.4281986880856354,1.4287129449659974,1.429205056813234,1.4296759772412111,1.4301266187990842,1.4305578547396327,1.4309705207114494,1.4313654163782596,1.4317433069685086,1.4321049247582207]
[38,14.79,13.82,24.08,23.29,13.88,0,null,null,null,null,"S-All-Lgt-Streetlight-All-All-U","Street Lighting",0,5.3432229045588267E-2,0.10693906362849824,0.15915748247445313,0.21095175816905212,0.26163789649178204,0.31046981803433804,0.35738008179629005,0.40358537599776723,0.44949684365467896,0.49546770938855156,0.54080873843718569,0.58619557892832419,0.63020857292611854,0.67248255652088218,0.71300263948935461,0.75324874409293185,0.79270833096571203,0.83191799934212807,0.86999917134876459,0.90675967599932739,0.94237427738363111,0.97686588662851592,1.0106851259253662,1.0436248176131233,1.07558927524222,1.1064994943213464,1.1361553101852397,1.1647170801178592,1.1923992024432413,1.1966508866294263,1.2007194839367803,1.2046128784892722,1.2083386149031401,1.2119039129068414,1.2153156813314359,1.2185805314985123,1.2217047900315996,1.2246945111158936,1.2275554882300506,1.2302932653727845,1.2329131478060227,1.2354202123354372,1.2378193171482741,1.2401151112275437,1.2423120433608164,1.2444143707610771,1.2464261673163506,1.2483513314840764,1.2501935938455364,1.251956524334972,1.2536435391573981,1.2552579074085239,1.256802757409601,1.2582810827694835,1.259695748185639,1.261049494995357,1.2623449464879104,1.2635846129879613,1.2640509027703948,1.264497113088513,1.2649241086082434,1.2653327167610953,1.2657237293475565,1.2660979040714428,1.2664559660081762,1.2667986090098349,1.2671264970496996,1.2674402655089003,1.267740522407657,1.2680278495835007]
[39,14.96,13.99,24.37,23.56,14.04,0,null,null,null,null,"Commercial-college-AirComp","College Compressed Air",0,6.8170933207729059E-2,0.13576941994301828,0.20161675715103439,0.26674561911078343,0.33002172206034119,0.39081405155556009,0.44908193307206173,0.50634757896571181,0.56270120381290134,0.6187717066403674,0.67384761111589397,0.72845008112000942,0.78124817036320726,0.83159400052467081,0.87973955715142593,0.92759320456491257,0.97426695038645306,1.0202608486271485,1.0649815932353515,1.1079709073844928,1.1492955813767813,1.1895098060236498,1.2289536482510197,1.2672524739388076,1.3044327985903303,1.3402750163742967,1.3745533201755489,1.4077229750839555,1.4397647521214891,1.4474958055618767,1.4548939428254055,1.4619735000153853,1.4687481958909638,1.475231158451326,1.4814349503751179,1.4873715933643921,1.4930525914402528,1.4984889532353347,1.5036912133263221,1.5086694526478412,1.5134333180272856,1.5179920408784282,1.5223544550900481,1.5265290141442298,1.5305238074975138,1.5343465762566371,1.5380047281792431,1.5415053520286268,1.5448552313103336,1.5480608574172303,1.5511284422085192,1.5540639300470729,1.556873009318416,1.5595611234536728,1.562133481477842,1.5645950681038414,1.5669506533918789,1.5692048019928715,1.5698812803354683,1.5705286280317328,1.5711480995114118,1.5717408951857457,1.5723081637736251,1.5728510045275768,1.5733704693638941,1.5738675649010399,1.5743432544102702,1.5747984596822611,1.5752340628133528,1.5756509079148759]
[40,15.13,14.14,24.63,23.82,14.2,0,null,null,null,null,"Commercial-college-Cook","College Cooking",0,6.7637551560637291E-2,0.13470701108626057,0.20004041805087888,0.26467275713018173,0.32748073509270031,0.38781263314610298,0.44564850952393326,0.50249103070801249,0.55845060742820318,0.61412938311631238,0.66883332879630486,0.72307680542178077,0.77551589030644652,0.82553761960513306,0.87337765198647332,0.9209230539500024,0.96731785368203704,1.0130419353236673,1.0575004099097749,1.100231227148331,1.1413380064316399,1.1813267447333717,1.220545025888107,1.2586297632323438,1.2956019073934777,1.3312524885198853,1.3653516002984936,1.3983420959319051,1.4302101139154675,1.4378166622719444,1.4450956559145058,1.4520612000700672,1.4587267925634275,1.4651053499733415,1.4712092326622543,1.4770502687281997,1.4826397769252766,1.4879885885971205,1.4931070686658705,1.4980051357173063,1.5026922812210723,1.5071775879232407,1.5114697474468473,1.5155770771345087,1.5195075361657637,1.5232687409803618,1.5268679800373934,1.530312227938859,1.5336081589450465,1.5367621599079051,1.5397803426474828,1.5426685557954039,1.5454323961283427,1.5480772194134518,1.5506081507867617,1.5530300946846662,1.5553477443477326,1.5575655909152601,1.5582251049674061,1.5588562188929047,1.5594601556637164,1.5600380855879385,1.5605911285776244,1.5611203563189509,1.5616267943489284,1.5621114240426868,1.5625751845151827,1.5630189744410163,1.5634436537958807,1.5638500455230238]
[41,15.28,14.29,24.89,24.07,14.34,0,null,null,null,null,"Commercial-college-Cool","College Cooling",0,8.6948887365183469E-2,0.17229046995591454,0.255202855439842,0.33678836184716038,0.41567420852901799,0.49126207974410524,0.56368776598698522,0.63452052655767921,0.70392865644740188,0.77242260068579982,0.83939617571292258,0.90541318188136632,0.96895094645497382,1.029435031806289,1.0872847400779784,1.1446036928529468,1.2003814048226498,1.2550521534326153,1.3081347934783156,1.3588647504201916,1.4076751738468094,1.4551556091593127,1.5015675603938248,1.5465527201677283,1.5901521517441353,1.6321393958619448,1.6722990688437842,1.7111395030614434,1.7486027608304293,1.7613665813022175,1.7735807635718708,1.7852689762701039,1.7964538688042981,1.8071571152485031,1.8173994563434361,1.8272007396878696,1.8365799581992894,1.8455552869183511,1.8541441182284584,1.8623630955587043,1.8702281456354946,1.877754509345342,1.8849567712686408,1.891848887941654,1.8984442149014753,1.9047555325663763,1.9107950710016879,1.9165745336192113,1.9221051198560757,1.9273975468769984,1.9324620703419964,1.9373085042797935,1.9419462401054366,1.9463842648189704,1.9506311784204382,1.9546952105749529,1.9585842365601345,1.9623057925268155,1.9631495394542957,1.9639569527820282,1.9647295971147865,1.9654689696820193,1.96617650323918,1.9668535688441182,1.9675014785139158,1.9681214877673106,1.9687147980576403,1.9692825591010179,1.9698258711042504,1.9703457868968175]
[42,15.44,14.44,25.14,24.3,14.49,0,null,null,null,null,"Commercial-college-ExtLight","College Exterior Lights",0,5.5653880052832436E-2,0.111290257387704,0.16547770632219816,0.21921746857859337,0.27171385340115312,0.32226133076277258,0.37078333588673124,0.41852907996870931,0.46587430669926344,0.51323468867643529,0.5598693986917308,0.60649621715332747,0.65162814382889811,0.69494484263261413,0.73640526937313411,0.77760765491817829,0.81795346311578854,0.85800526372235519,0.89688185441051915,0.93437203872407537,0.97067213030826738,1.0058651253474102,1.0403448314166814,1.0739249204376156,1.1064969112500169,1.1379932853894619,1.1681995669689187,1.1973069466625259,1.225506185771194,1.2304178819750469,1.23511806972993,1.239615857055177,1.2439199597587627,1.2480387183267871,1.2519801140856623,1.2557517846683179,1.2593610388143999,1.2628148705331386,1.2661199726563335,1.2692827498077162,1.272309330813824,1.2752055805804343,1.2779771114575738,1.2806292941151232,1.2831672679500987,1.2855959510457691,1.287920049701913,1.2901440675546823,1.2922723143037438,1.2943089140636113,1.2962578133553504,1.2981227887541438,1.2999074542075348,1.3016152680385309,1.3032495396471395,1.3048134359233201,1.30630998738378,1.307742094044507,1.3082170987990318,1.3086716488033616,1.3091066248840599,1.3095228699373598,1.309921190562527,1.3103023586248883,1.3106671127515497,1.3110161597627088,1.31135017604133,1.3116698088438383,1.3119756775543725,1.3122683748850275]
[43,15.58,14.57,25.37,24.53,14.62,0,null,null,null,null,"Commercial-college-Heat","College Heating",0,6.7250973518855658E-2,0.133962469103104,0.1988875527562764,0.26308201408255383,0.32556622154624698,0.38563431913369306,0.44325452158634276,0.49983892700251709,0.55555264398609694,0.61099798207781386,0.66551873781043291,0.7195581578128335,0.77189275722951711,0.82191353204867501,0.86977352481803694,0.91722350978473333,0.96355918257507778,1.0092258636384084,1.0535963319033301,1.0963538335198368,1.1375008318780109,1.1774563147605155,1.2166359178057335,1.2546679547658233,1.2915824533235019,1.3271755172647746,1.3612306064265089,1.3941564551191798,1.4259551394931274,1.4335134314620905,1.4407462467433951,1.4476676010795715,1.4542909066644294,1.460628998133193,1.4666941574334451,1.4724981376250739,1.4780521856553408,1.483367064153204,1.4884530722851301,1.493320065712811,1.4979774756914526,1.5024343273456553,1.5066992571582896,1.5107805297062649,1.5146860536756193,1.5184233971869632,1.5219998024609764,1.5254221998523767,1.528697221279554,1.531831213075896,1.5348302482877065,1.5377001384425488,1.5404464448108193,1.54307448918237,1.545589364179069,1.5479959431232786,1.5502988894813738,1.552502665900604,1.5532261772159224,1.5539185325415859,1.5545810735230821,1.5552150840316907,1.555821792652369,1.5564023750645013,1.5569579563201301,1.5574896130240814,1.5579983754202071,1.5584852293877913,1.5589511183519866,1.5593969451119825]
[44,15.72,14.71,25.59,24.75,14.75,0,null,null,null,null,"Commercial-college-HotWater","College Hot Water",0,6.9720844482056385E-2,0.13878979102012665,0.20600371142971335,0.27246295343422716,0.33702278361720145,0.39903820312125482,0.45848377995430029,0.51687723012559617,0.57428727473188723,0.63136997436943787,0.68741746164215733,0.7429207968290461,0.79658268343456573,0.84778415396383267,0.89671170862466387,0.94530632155952277,0.99269027599074522,1.0393479738437292,1.0846949129923071,1.128315570783557,1.1702416800509616,1.2110232190478103,1.2510077655911733,1.289818394788359,1.3274931200663609,1.3638131603150263,1.3985397759231259,1.4321452990933887,1.4645911383812138,1.4727521205697884,1.4805616729033526,1.4880349287249452,1.4951863697025458,1.5020298538916372,1.5085786425893324,1.5148454260321029,1.5208423479869073,1.5265810292833708,1.5320725903326182,1.5373276726763954,1.5423564596082397,1.5471686959066555,1.5517737067185362,1.5561804156294272,1.5603973619556384,1.5644327172917258,1.568294301345398,1.5719895970905389,1.5755257652677073,1.5789096582602127,1.5821478333726582,1.585246565537678,1.5882118594754957,1.5910494613298667,1.5937648698029492,1.5963633468106835,1.5988499276793289,1.6012294309029129,1.6019296549980109,1.6025997259024107,1.60324094207887,1.6038545460754818,1.6044417269334834,1.6050036224913797,1.6055413215898451,1.6060558661816779,1.6065482533508961,1.6070194372448845,1.6074703309233425,1.6079018081276086]
[45,15.85,14.83,25.81,24.96,14.88,0,null,null,null,null,"C-Unv-Lgt-LPD Int-All-All-C","College Interior Lights",0,6.8354849326074385E-2,0.13610616682975862,0.20212221110716852,0.26740051263350806,0.33083561087456076,0.39177041405337054,0.45018658683767787,0.50759412547653326,0.56410353951128089,0.6203051622690896,0.67552950147752644,0.73026333773498153,0.78319482539826146,0.83367718861440376,0.88197508135621905,0.92995352819394661,0.97677139082416975,1.022897306691029,1.0677481550951797,1.1108597873532506,1.1523228407867847,1.1926475418523881,1.2322003628363787,1.2705997315161821,1.3078806264532212,1.3438208271894416,1.3781961450155114,1.4114529624587593,1.4435778202567233,1.4513382521218465,1.4587645027104812,1.4658709626039115,1.4726714026933185,1.4791790008649999,1.4854063675364653,1.4913655700928914,1.4970681562712898,1.5025251765376997,1.5077472055007712,1.5127443624032322,1.5175263307309459,1.5221023769775619,1.526481368601118,1.5306717912073915,1.5346817649932993,1.5385190604822063,1.5421911135816389,1.5457050399925791,1.5490676489982635,1.5522854566592057,1.5553646984400116,1.5583113412924574,1.5611310952182429,1.5638294243338271,1.566411557458788,1.5688824982482243,1.5712470348888332,1.5735097493774541,1.5741793824364794,1.5748201796221497,1.5754333826706381,1.576020179846225,1.5765817082439157,1.577119055992902,1.5776332643651378,1.5781253297931148,1.5785962058007481,1.5790468048511148,1.5794780001146238,1.579890627161044]
[46,15.98,14.95,26.02,25.15,15,0,null,null,null,null,"Commercial-college-Misc","College Other",0,6.5729768186616896E-2,0.1309959558453308,0.19458942117113853,0.25753063584922808,0.31872510928063313,0.37753775671864725,0.43390934618180838,0.48933800447132292,0.5439449490650814,0.598335862740766,0.65178032915473005,0.70484326848057421,0.75616511801121111,0.80512727693239194,0.85195859400676521,0.89852856978279771,0.9439733381206975,0.98880462684269277,1.0323942981472001,1.0743117547598526,1.1146295763536189,1.1538664479386973,1.1923486557101768,1.2297346723248372,1.2660295792863783,1.3010292108013963,1.3345127069300857,1.366902627353465,1.3982048127591733,1.4053397216135952,1.4121673855891186,1.4187010353264615,1.4249533317258327,1.4309363904812118,1.4366618055581297,1.4421406716604435,1.4473836057296432,1.452400767518351,1.45720187927788,1.4617962445980035,1.4661927664354424,1.4703999643660055,1.4744259910938173,1.4782786482496182,1.4819654015087578,1.4854933950581737,1.4888694654403898,1.4921001548013622,1.4951917235678429,1.4981501625788294,1.5009812046946056,1.5036903359058749,1.5062828059645057,1.5087636385564971,1.5111376410368715,1.513409413745364,1.5155833589209544,1.5176636892325246,1.5183014110774742,1.5189116712161819,1.5194956522101606,1.5200544856972216,1.5205892545843613,1.5211009951462173,1.5215906990331609,1.5220593151929156,1.5225077517094272,1.5229368775625485,1.5233475243119468,1.5237404877085001]
[47,16.100000000000001,15.07,26.21,25.34,15.11,0,null,null,null,null,"Commercial-college-Motors","College Motors",0,6.7987979416761476E-2,0.13543131947894696,0.20111662945601244,0.26608749741358539,0.32921279245765439,0.38986997434059539,0.44800246641573316,0.50513879575864484,0.56135901635377716,0.61730980579535666,0.67226360447130362,0.72675052096711501,0.77944163047761961,0.82968622994101449,0.87772929477257378,0.9254830780264286,0.97205079557006402,1.0179463255654833,1.0625669974439953,1.1054739976135293,1.1467102715387318,1.1868402699398541,1.2262025095615683,1.2644236187151034,1.3015260713698567,1.3372944206720216,1.3714998003485619,1.4045997768651408,1.436576129298716,1.444280484883945,1.4516530739607192,1.4587081831250963,1.4654594837608639,1.4719200585319334,1.4781024267339138,1.4840185685539906,1.4896799482861216,1.495097536546534,1.5002818315325746,1.5052428793661061,1.5099902935608733,1.5145332736515595,1.5188806230206373,1.5230407659575538,1.5270217639833112,1.5308313314720743,1.5344768506000772,1.5379653856507978,1.5413036967041189,1.5444982527360052,1.5475552441540781,1.5504805947933824,1.5532799733955875,1.5559588045938697,1.558522279424762,1.5609753653873382,1.5633228160692294,1.5655691803581204,1.5662443992179425,1.5668905416675329,1.5675088598011124,1.5681005517949684,1.5686667642292802,1.5692085943099616,1.5697270919948241,1.5702232620281853,1.5706980658878611,1.5711524236483163,1.5715872157635844,1.5720032847734104]
[48,16.22,15.18,26.4,25.53,15.22,0,null,null,null,null,"Commercial-college-OffEquip","College Office Eqpmt",0,6.5496109893315613E-2,0.13053592298271535,0.19390748048537182,0.25665159511832308,0.31765739031808526,0.37627415140988046,0.43246327628909537,0.48772686703465951,0.54216808277335504,0.5963982537517214,0.64970526495244041,0.70261424966007746,0.7537787006005191,0.80258939125241868,0.84926857838501457,0.89569160295327022,0.94100482840178601,0.98569806207683264,1.0291593556545093,1.0709542362792699,1.1111604495384264,1.1502826289502961,1.1886638256119677,1.2259490632906325,1.2621505291084174,1.297066376336043,1.3304623091838723,1.3627751977018101,1.3939965811039465,1.4010478347438888,1.4077954458825894,1.4142524900344564,1.4204314796534676,1.4263443883797942,1.4320026742423075,1.4374173018619378,1.4425987636989044,1.4475571003849967,1.4523019201803007,1.4568424175920744,1.4611873911918583,1.4653452606653357,1.4693240831279932,1.4731315687381918,1.4767750956379033,1.4802617242500677,1.4835982109602728,1.4867910212092728,1.489846342021713,1.4927700939953399,1.4955679427739303,1.4982453100261699,1.5008073839517582,1.5032591293350963,1.5056052971660416,1.5078504338463723,1.5099988899997987,1.5120548289025992,1.5126913719717237,1.5133005040952876,1.5138834056489374,1.5144412061787458,1.5149749865900457,1.5154857812420073,1.5159745799520183,1.5164423299137515,1.5168899375326348,1.5173182701822838,1.5177281578852972,1.5181203949216737]
[49,16.329999999999998,15.28,26.58,25.7,15.33,0,null,null,null,null,"Commercial-college-Process","College Process",0,6.9654490867556262E-2,0.13864642099612448,0.2059294000897606,0.27240495538699455,0.33700406680425904,0.39905200685854875,0.4585374920086544,0.51699286200068473,0.57451948207645731,0.63168495653088919,0.68786971419910503,0.74348705494970568,0.79730035861915982,0.84863547268896611,0.89777810737392139,0.9465335650247888,0.99412025428073469,1.0409718267473285,1.0865400692954184,1.1303494004375485,1.1724841446250813,1.2134168180056955,1.253572802155229,1.2925396519696353,1.3303804469836702,1.366855433019615,1.4017394891240682,1.4354779231629851,1.4680664622438389,1.4761112129602409,1.4838095390046446,1.4911763581858921,1.4982259459191436,1.5049719628887619,1.5114274815199757,1.5176050113106112,1.5235165230719845,1.5291734721259305,1.5345868205029123,1.5397670581842346,1.5447242234295189,1.5494679222288341,1.5540073469171742,1.5583512939873558,1.5625081811358552,1.5664860635746105,1.570292649640405,1.5739353157320746,1.5774211206044855,1.5807568190469841,1.5839488749728201,1.5870034739449117,1.5899265351622245,1.592723722929988,1.5954004576359815,1.5979619262541573,1.6004130923959521,1.6027587059287702,1.6034523255487554,1.6041160763812767,1.6047512446420629,1.6053590611595616,1.6059407037600388,1.6064972995499693,1.6070299271001418,1.6075396185357136,1.6080273615362608,1.6084941012497029,1.6089407421238104,1.6093681496588417]
[50,16.440000000000001,15.38,26.75,25.87,15.43,0,null,null,null,null,"Commercial-college-Refrig","College Refrigeration",0,6.0956608177344038E-2,0.12164107829246819,0.18075881545071956,0.2393888823537208,0.29646675915046256,0.35133422957657229,0.40395417938870887,0.45573671121399256,0.50687507985890012,0.55791661747876864,0.60812130210428006,0.65810160896326575,0.70642001793547993,0.752590952920552,0.79673260772030108,0.8406805413930597,0.8836267112027496,0.92608830326061375,0.96737042740952295,1.007079013005346,1.0453687294755896,1.082609220465963,1.1191381595121679,1.1546652201313599,1.1891544195741577,1.2224548862289968,1.2543302627270607,1.2851417664505707,1.3149364036315612,1.3209356319351655,1.3266765202639736,1.3321701933058949,1.3374272966952936,1.3424580176420864,1.34727210467251,1.3518788865198057,1.356287290201428,1.3605058583178133,1.3645427656062201,1.3684058347817289,1.3721025516960914,1.3756400798438069,1.3790252742435347,1.382264694721743,1.3853646186243345,1.3883310529808817,1.3911697461450414,1.3938861989337112,1.3964856752865054,1.3989732124662124,1.4013536308199994,1.4036315431202737,1.4058113635033116,1.4078973160229649,1.4098934428360301,1.4118036120351358,1.4136315251443279,1.4153807242918801,1.4159420079228906,1.4164791214453887,1.4169931056774443,1.4174849566172105,1.4179556273729674,1.4184060300100554,1.4188370373182735,1.4192494845031711,1.4196441708045089,1.4200218610450233,1.4203832871125011,1.4207291493780303]
[51,16.54,15.48,26.92,26.03,15.52,0,null,null,null,null,"Commercial-college-Vent","College Ventilation",0,6.8652249767563983E-2,0.13666068295842979,0.20288675630805059,0.26838232589228145,0.33200893561606881,0.39311160023054026,0.45169357815183137,0.50923900798688981,0.56588395502644351,0.62220754289161606,0.67753025556270374,0.73237148111824757,0.78536561537827709,0.83591775327415807,0.88426368133240651,0.93230359618913405,0.97917973263674096,1.0253643502799084,1.0702640066566393,1.113392903262721,1.1548992345995475,1.1952730770346864,1.2348589355156629,1.2732969494616551,1.3106064424346906,1.3465813290460327,1.3809944924816142,1.4142851057881936,1.4464397297591736,1.4543234765342816,1.4618677318214663,1.4690871148714038,1.4759956153976597,1.482606620685943,1.4889329415359747,1.4949868370862442,1.5007800385697558,1.5063237720468003,1.5116287801588049,1.5167053429454123,1.5215632977651319,1.5262120583581651,1.5306606330883403,1.5349176423995128,1.5389913355202522,1.5428896064491893,1.5466200092519999,1.5501897726996656,1.5536058142763791,1.5568747535842389,1.5600029251707079,1.5629963908036923,1.5658609512180315,1.568602157356155,1.5712253211246945,1.57373552568789,1.5761376353177423,1.5784363048199932,1.5791077709332981,1.5797503222378961,1.5803652038690903,1.5809536073439174,1.5815166728700676,1.5820554915553786,1.5825711075221838,1.5830645199306095,1.5835366849147492,1.5839885174354567,1.5844208930533588,1.5848346496255139]
[52,16.64,15.57,27.08,26.18,15.62,0,null,null,null,null,"Commercial-Grocery-AirComp","Grocery Compressed Air",0,6.5144749990753217E-2,0.1298080908949299,0.19281888998289945,0.25523070096033257,0.31591170739618191,0.37420192997820623,0.43009782708765709,0.48506941717219088,0.53925028470404024,0.5932165234186153,0.64627980199882828,0.69896122589637411,0.74989322820310078,0.79847716805945101,0.84494070750699635,0.89116955723181579,0.93631097125451579,0.98083690191398654,1.0241480526961799,1.0657683070912811,1.1058315987094636,1.1448184065495886,1.1830718131548261,1.2202348884658325,1.2563217304308079,1.2911278052884587,1.3244243253257217,1.3566420078890691,1.3877681750624971,1.3946967882230275,1.4013270400512863,1.4076717786429214,1.4137432988263043,1.4195533659874364,1.4251132388689025,1.4304336913870519,1.4355250335096827,1.4403971312346884,1.445059425708378,1.4495209515205212,1.4537903542115673,1.4578759070259655,1.4617855269440498,1.4655267900235565,1.4691069460805006,1.4725329327378633,1.475811388869311,1.4789486674639978,1.4819508479373822,1.4848237479119129,1.4875729344904109,1.4902037350439976,1.4927212475354681,1.4951303503981193,1.497435711989173,1.4996417996361144,1.5017528882934748,1.5037730688268338,1.5043890437490572,1.5049784934353958,1.5055425601208869,1.5060823368534144,1.506598869611814,1.5070931593327703,1.5075661638504323,1.508018799752501,1.5084519441563944,1.5088664364089239,1.50926307971278,1.509642642682977]
[53,16.73,15.66,27.23,26.33,15.7,0,null,null,null,null,"Commercial-Grocery-Cook","Grocery Cooking",0,6.2678452356896855E-2,0.12499194013870153,0.18573946837361796,0.2459732397519897,0.30457320541300065,0.36087723950070599,0.41487662926968188,0.46802263582970022,0.52045896167812589,0.57275399357755075,0.62420571849198747,0.67535268758329059,0.72481097988622978,0.77200486347451192,0.81713211282109111,0.86207123276408881,0.90597516613532092,0.94932722222211985,0.99150530308000351,1.0320467480562043,1.0710893284995993,1.1090889881310755,1.1463874809823236,1.1826397513911437,1.217848262445526,1.2518191309805033,1.2843212044230372,1.3157684885113623,1.346159412230822,1.3524443801368493,1.3584587034918993,1.3642140368460143,1.3697215328786598,1.3749918640103782,1.380035243083793,1.3848614431540465,1.3894798164270159,1.3938993123820109,1.3981284951140636,1.402175559929425,1.4060483492264213,1.4097543676924467,1.4133007968465379,1.4166945089557161,1.419942080352059,1.4230498041763102,1.4260237025727232,1.4288695383587642,1.4315928261922963,1.4341988432578774,1.4366926394928832,1.4390790473732715,1.4413626912779491,1.4435479964498896,1.4456391975713638,1.4476403469699035,1.4495553224708986,1.4513878349120422,1.4519824497601777,1.4525514591842308,1.4530959658101188,1.4536170247822608,1.4541156458082338,1.454592795115385,1.4550493973231851,1.4554863372349558,1.4559044615524395,1.4563045805165387,1.4566874694773992,1.4570538703968829]
[54,16.82,15.74,27.37,26.47,15.79,0,null,null,null,null,"Commercial-Grocery-Cool","Grocery Cooling",0,8.6785234825470556E-2,0.17194999298871785,0.25463420977498014,0.33602310399171914,0.41469260198328639,0.4900599827432377,0.56229433167774134,0.63291511857487937,0.70212174549410233,0.77041533883456825,0.83716908242616039,0.9029898784197733,0.96628753731877937,1.0265609770701807,1.0841608402687772,1.1412698132416579,1.1968272817399275,1.2513015669470826,1.3041886333315551,1.354700163655925,1.4033449251703221,1.4506546302621299,1.4969012769264056,1.5417350775513368,1.5851736137189389,1.627024236074063,1.6670550815445599,1.705764373726991,1.7431000792423352,1.7559053289228859,1.7681591563683887,1.779885307033942,1.7911065038430838,1.8018444912202531,1.8121200772271135,1.8219531738843961,1.8313628357573941,1.8403672968798799,1.8489840060880005,1.8572296608326135,1.8651202395355926,1.8726710325527971,1.8798966718037107,1.8868111591251591,1.8934278934040571,1.8997596965417587,1.9058188383003247,1.9116170600788569,1.9171655976659687,1.9224752030124872,1.927556165066572,1.9324183297116293,1.9370711188456555,1.9415235486389819,1.9457842470058015,1.9498614703233321,1.953763119431017,1.9574967549407634,1.958326954601959,1.9591214040385099,1.959881642733774,1.9606091438775675,1.9613053172209105,1.9619715118078414,1.9626090185895935,1.9632190729261985,1.9638028569803661,1.9643615020082774,1.9648960905517334,1.9654076585359015]
[55,16.91,15.82,27.51,26.6,15.87,0,null,null,null,null,"Commercial-Grocery-ExtLight","Grocery Exterior Lights",0,5.6916719255699785E-2,0.11375953781026851,0.1691048658914939,0.22398238563161552,0.27754934305137896,0.32910879314404684,0.37858872970533952,0.42726766558483009,0.47548965820641947,0.52369810007993811,0.57114602948303095,0.61853967463306547,0.66439283625657231,0.70837014476345395,0.75045068535765513,0.79227494270427534,0.83320994772104573,0.87381100130962597,0.91322483425322443,0.95121694728537731,0.98797699435014108,1.0236334577301704,1.0585674789101083,1.0925817921299534,1.125574750695358,1.1574718497642789,1.188050887336058,1.2175326554678154,1.2460835188484161,1.2513047233645505,1.2563010913225734,1.2610823046795334,1.2656576284660979,1.2700359287403222,1.2742256897682882,1.2782350304649062,1.2820717201267418,1.28574319348735,1.2892565651242958,1.2926186432457747,1.2958359428835535,1.298914698517792,1.3018608761582113,1.304680184905024,1.307378088012022,1.309959813473264,1.3124303641538784,1.3147945274846098,1.3170568847388981,1.3192218199104659,1.3212935282086171,1.3232760241877093,1.3251731495265533,1.3269885804728154,1.3287258349668463,1.3303882794587418,1.3319791354318475,1.3335014856453458,1.3339914556945847,1.3344603265551005,1.3349090068043976,1.3353383658946343,1.3357492358374445,1.3361424128162103,1.3365186587289049,1.3368787026644975,1.3372232423157826,1.3375529453313661,1.3378684506094367,1.33817036953582]
[56,16.989999999999998,15.9,27.64,26.73,15.95,0,null,null,null,null,"Commercial-Grocery-Heat","Grocery Heating",0,6.8568365724769195E-2,0.13644723472969728,0.20246806414902563,0.26748295164551011,0.33105743508197011,0.39229528234606603,0.45109605277609405,0.50865925552655511,0.56542126197803155,0.62181799259751147,0.67740283741674279,0.73242318454288324,0.7860003248864833,0.83744746439061324,0.88692050937551947,0.93554473495840529,0.98317586693853642,1.0300726446651136,1.075526245560015,1.1195816131430989,1.1620322871821585,1.2030464791873277,1.2431942340669306,1.2821139465254967,1.3198745303484889,1.356235663255706,1.3910857818413183,1.4246957002837055,1.457166744512294,1.4651564264137489,1.4728020550275813,1.4801184460456029,1.4871197771633269,1.4938196155534933,1.5002309441565234,1.5063661868388489,1.5122372324678683,1.5178554579501837,1.5232317502777584,1.5283765276247196,1.5332997595356874,1.5380109862447475,1.5425193371625083,1.5468335485670641,1.5509619805331463,1.5549126331322678,1.5586931619352551,1.5623108928472045,1.5657728363036154,1.5690857008552048,1.5722559061677306,1.5752895954620136,1.5781926474182653,1.5809706875677885,1.5836290991941264,1.5861730337647848,1.5886074209137402,1.5909369779940803,1.5918177327664107,1.5926605602997412,1.5934670938244593,1.5942388962404574,1.594977463145719,1.5956842257344859,1.5963605535706265,1.5970077572415744,1.5976270908979839,1.5982197546840218,1.5987868970630053,1.5993296170428939]
[57,17.07,15.97,27.77,26.85,16.02,0,null,null,null,null,"Commercial-Grocery-HotWater","Grocery Hot Water",0,6.4591495915715655E-2,0.12875631732032811,0.19125790108671509,0.25318266340955975,0.31341012549162384,0.37128089738445713,0.42676601307033235,0.48134668909019263,0.53512241945032224,0.58871552443227471,0.64140204809084533,0.69370853258464682,0.74429206543784576,0.79257704117837946,0.83872468019522439,0.88463170605424013,0.92944797956212966,0.97365797920707009,1.0166533908607094,1.0580200182567876,1.0978227704365511,1.1365514258202594,1.1745482425774811,1.2114644380796318,1.247314377186804,1.2818977708244845,1.3149724430867369,1.3469780472373689,1.3778943211195385,1.3847145505736498,1.3912410859364357,1.3974865743218767,1.4034631182313897,1.4091822990060432,1.4146551992688696,1.4198924244007609,1.424904123091566,1.429700007006212,1.4342893696039594,1.4386811041472582,1.442883720935104,1.4469053637942868,1.4507538258604902,1.4544365646798236,1.457960716660047,1.4613331108994951,1.4645602824204984,1.4676484848329416,1.4706037024525045,1.4734316618970622,1.4761378431837202,1.4787274903479866,1.4812056216056575,1.483577039077113,1.4858463380928599,1.4880179160983593,1.4900959811753922,1.4920845601964763,1.4927048514807713,1.4932984316571303,1.4938664509646509,1.4944100101106035,1.4949301624033811,1.4954279157935988,1.4959042348273002,1.4963600425150525,1.4967962221205573,1.4972136188722365,1.497613041601116,1.4979952643081778]
[58,17.14,16.05,27.89,26.97,16.09,0,null,null,null,null,"C-Gro-Lgt-LPD Int-All-All-C","Grocery Interior Lights",0,6.3243332264973778E-2,0.12609873516282472,0.18733949481592954,0.24803289946774762,0.30707778604472774,0.3638128043222032,0.41822040736722055,0.47174313096124193,0.52454162200197774,0.57717847184925053,0.6289446555154381,0.68039904066843249,0.73014416666156812,0.77763169149384348,0.82304116963764384,0.86823370791443544,0.91237949514441374,0.95596766427761026,0.99835738639760341,1.0391095045356145,1.0783679332730154,1.116561644455994,1.154032436923885,1.1904525941285435,1.2258142099842386,1.259936702119101,1.2925877613472045,1.324167274040821,1.3546888081765267,1.3611938448710676,1.367418760368236,1.3733756173033251,1.3790759588680042,1.3845308311787015,1.3897508046817613,1.3947459946368426,1.3995260807182597,1.4041003257722477,1.4084775937664944,1.4126663669667303,1.4166747623736549,1.4205105474520516,1.4241811551825749,1.4276936984653721,1.4310549839034554,1.4342715249925306,1.4373495547428419,1.4402950377574935,1.4431136817906531,1.4458109488080308,1.4483920655710718,1.450862033765369,1.4532256396929264,1.4554874635470483,1.4576518882878349,1.4597231081354773,1.4617051366978147,1.4636018147478982,1.4641915916169626,1.4647559713959715,1.4652960477395207,1.4658128672070319,1.4663074312907747,1.4667806983565572,1.4672335855008467,1.4676669703279182,1.4680816926504743,1.4684785561170353,1.4688583297692468,1.4692217495321287]
[59,17.22,16.11,28.01,27.08,16.16,0,null,null,null,null,"Commercial-Grocery-Misc","Grocery Other",0,6.3246791242452596E-2,0.12610709717716623,0.18736048456170987,0.24806891883812651,0.30712663341940921,0.36387279527449584,0.41829363388250917,0.4718328896952057,0.524646830731061,0.57730019726134063,0.62908533880472628,0.68055633093409096,0.73031965594840054,0.77782056785898435,0.82324067926246025,0.86844842672857059,0.91260844852617962,0.95621045230939872,0.99861743322853835,1.0393837336759917,1.0786517096535571,1.1168578514207104,1.1543443703850986,1.1907788510307213,1.2261560677616306,1.2602923630447698,1.2929558935080645,1.3245497709650862,1.3550838502954625,1.3615715567192173,1.3677798882252028,1.3737208753122701,1.3794060304195115,1.3848463702350535,1.3900524370441847,1.3950343191581858,1.3998016704634499,1.4043637291287745,1.4087293355070756,1.4129069492662152,1.4169046657821385,1.4207302318260844,1.4243910605762715,1.4278942459831492,1.4312465765160465,1.4344545483178621,1.4375243777932838,1.4404620136549313,1.4432731484507662,1.4459632295951059,1.4485374699246178,1.4510008577997486,1.4533581667711655,1.455613964829938,1.4577726232593851,1.4598383251057458,1.4618150732840816,1.4637066983351206,1.4643024328500742,1.464872513725628,1.4654180456639569,1.4659400857963292,1.4664396457316136,1.4669176935165746,1.4673751555117527,1.4678129181865642,1.4682318298371015,1.4686327022299603,1.4690163121752797,1.4693834030320447]
[60,17.29,16.18,28.12,27.19,16.22,0,null,null,null,null,"Commercial-Grocery-Motors","Grocery Motors",0,6.4628088723528043E-2,0.1288009891466029,0.19132513268653364,0.25326102645291193,0.31349052037367309,0.37135264449499844,0.4268389512159439,0.4814078830493721,0.53520532783221608,0.58880136195632626,0.6415008133139003,0.69383947682553326,0.74443832815746414,0.79272025665012946,0.83889268891018554,0.88483110599242221,0.92969380600703033,0.97395905445144837,1.0170106019147458,1.0583876545795146,1.0982300070575215,1.1369948510361221,1.1750262077786318,1.2119792573126285,1.2478589481367877,1.2824712711117401,1.3155860213156072,1.3476210580196357,1.3785752732997028,1.3854051716665794,1.3919409595774661,1.3981953020759224,1.4041803188208566,1.4099076075719896,1.415388266663983,1.4206329165127805,1.4256517201958401,1.4304544031461366,1.4350502719980951,1.4394482326219786,1.4436568073816758,1.4476841516493284,1.4515380696088049,1.4552260293786388,1.4587551774837428,1.4621323527039383,1.465364099326135,1.4684566798258445,1.4714160870026003,1.474248055592797,1.476958073382459,1.4795513918414656,1.4820330362998453,1.4844078156858544,1.4866803318447148,1.4888549884560645,1.4909359995674039,1.492927397760073,1.4935360233197417,1.4941184401232523,1.4946757767773295,1.4952091132884082,1.4957194831554692,1.4962078753727526,1.4966752363462292,1.4971224717275466,1.4975504481689987,1.4979599950029241,1.498351905848786,1.4987269401510459]
[61,17.350000000000001,16.239999999999998,28.23,27.29,16.28,0,null,null,null,null,"Commercial-Grocery-OffEquip","Grocery Office Eqpmt",0,6.5069594306397832E-2,0.12965986137409613,0.1926008717028701,0.25494719180079883,0.31556543385029334,0.37379501015694877,0.42963188958562937,0.48454769447370805,0.53867470626388114,0.59258945028565624,0.6456053036043462,0.69824029401869914,0.74912848315261804,0.79766820151499263,0.84408996372888134,0.89027994733623117,0.93538505264788441,0.9798752455005113,1.0231524848594342,1.0647395189756095,1.1047700457741754,1.1437263372111164,1.1819515392720754,1.2190873713582986,1.2551483717139773,1.2899292170858798,1.3232012514022924,1.3553964282199913,1.3865014112861007,1.3934059260275649,1.4000131171677221,1.4063357881152412,1.4123861909358333,1.4181760500942948,1.4237165851741624,1.4290185326190115,1.4340921665375275,1.4389473186126625,1.4435933971534616,1.4480394053264749,1.4522939586020858,1.4563653014495601,1.4602613233131723,1.4639895739003606,1.4675572778115458,1.4709713485399527,1.4742384018685719,1.4773647686902167,1.4803565072755229,1.4832194150126581,1.4859590396414957,1.4885806900040195,1.4910894463317934,1.4934901700904291,1.4957875134001279,1.4979859280505574,1.5000896741275236,1.5021028282681612,1.5027165849406499,1.5033039118999691,1.5038659472677387,1.5044037801555568,1.504918452775478,1.5054109624596135,1.5058822635927571,1.5063332694617944,1.5067648540254663,1.5071778536079277,1.5075730685193736,1.507951264606882]
[62,17.41,16.3,28.33,27.39,16.34,0,null,null,null,null,"Commercial-Grocery-Process","Grocery Process",0,6.7022731747052824E-2,0.133472768408402,0.19820777137115192,0.26228151638103164,0.32455036266207565,0.38435463021782174,0.44169614762982962,0.49806199862200884,0.55357544164354056,0.6088183198684618,0.66311782389638974,0.71697445866994503,0.76903774709110706,0.81868187443523355,0.86616757674638778,0.91338598082594114,0.95947893317191124,1.0049049527412235,1.0490875268610478,1.0915357722792756,1.1323794709157213,1.1721237597023288,1.2111128015702881,1.248976637928195,1.2857405505090185,1.3211889001103392,1.355095675071448,1.3879076411190512,1.4196007387610285,1.4270066010514117,1.4340935506115871,1.4408753205256304,1.4473650525007915,1.4535753223334815,1.4595181642786395,1.4652050943696997,1.4706471327343507,1.4758548249493275,1.4808382624756211,1.4856071022137014,1.4901705852166489,1.49453755459746,1.4987164726652216,1.5027154373233669,1.5065421977617832,1.5102041694731865,1.5137084486228547,1.5170618257995707,1.5202707991744184,1.5233415870929332,1.5262801401250048,1.5290921525958867,1.5317830736206539,1.5343581176634933,1.5368222746422873,1.5391803195980707,1.5414368219481029,1.5435961543404781,1.5442363684186104,1.5448490134694546,1.5454352766760042,1.5459962940985399,1.5465331528760857,1.5470468933330674,1.5475385109952509,1.5480089585188712,1.54845914753669,1.548889950424555,1.5493022019918896,1.5496967010993872]
[63,17.47,16.36,28.43,27.48,16.399999999999999,0,null,null,null,null,"Commercial-Grocery-Refrig","Grocery Refrigeration",0,6.1161551655918987E-2,0.1220300394019211,0.18132379221249853,0.2401330502038323,0.29736531488570983,0.35236784422097234,0.4051171138656145,0.45702573387654566,0.50828833988916089,0.55944312332489998,0.60975004552929313,0.65983283711634622,0.70822541323431154,0.75445626856523385,0.79864874343931558,0.84266367484713278,0.88567235252234433,0.92819349261245754,0.96953701656013402,1.0092796848481533,1.0476126050590848,1.0849006115918864,1.121474871149462,1.1570483602069317,1.1915808921168372,1.224926654340732,1.256845042618449,1.2876990128240473,1.3175345351862833,1.3235933647109357,1.3293912877010339,1.3349395393661996,1.3402488711032003,1.3453295713299953,1.350191485422622,1.3548440347935566,1.3592962351485181,1.3635567139570937,1.3676337271710415,1.3715351752226663,1.3752686183342688,1.3788412911683381,1.3822601168468736,1.3855317203670032,1.3886624414388975,1.3916583467708539,1.3945252418253575,1.3972686820689018,1.3998939837373652,1.4024062341378083,1.4048103015066535,1.4071108444433476,1.4093123209377918,1.4114189970090301,1.4134349549719374,1.4153641013479255,1.4172101744349954,1.4189767515518088,1.4195316324190717,1.4200626188949215,1.4205707399244429,1.4210569801440804,1.4215222817896664,1.421967546522285,1.4223936371755082,1.4228013794273966,1.4231915634004957,1.4235649451929346,1.4239222483435943,1.4242641652341774]
[64,17.53,16.41,28.52,27.57,16.45,0,null,null,null,null,"Commercial-Grocery-Vent","Grocery Ventilation",0,6.2616689521372101E-2,0.12487398560878238,0.18552160898543441,0.24563945205983848,0.30412861029375066,0.36033383148698556,0.41423609909043457,0.46726042290430148,0.51958696371976953,0.57176710626687233,0.62307782188052585,0.67410797111851217,0.723429826303291,0.77053206080503545,0.81556379338433793,0.86038958795207821,0.90417869193166411,0.94743725817064295,0.98949996971749743,1.0299348658965986,1.0689095752137017,1.1068213828701454,1.1440101772025546,1.1801651856688564,1.215264658664146,1.249143970739051,1.281567588232249,1.3129176099345736,1.3432236739077892,1.3496140876882901,1.3557293161863773,1.3615812094859823,1.3671811073803413,1.3725398613462347,1.3776678555719701,1.3825750270798509,1.3872708849821291,1.3917645289077543,1.3960646666356251,1.4001796309685159,1.4041173958803732,1.4078855919682749,1.4114915212389942,1.4149421712588213,1.4182442286940624,1.4214040922684561,1.4244278851626127,1.4273214668795089,1.4300904445990268,1.4327401840435414,1.4352758198756128,1.4377022656479301,1.4400242233247889,1.442246192393553,1.4443724785837579,1.4464072022107484,1.4483543061600215,1.450217563527747,1.4507966254588003,1.4513507517086122,1.4518810160624991,1.4523884460662186,1.4528740250171464,1.4533386938697088,1.4537833530587638,1.4542088642444624,1.4546160519819729,1.4550057053193037,1.4553785793263188,1.4557353965579121]
[65,17.59,16.46,28.61,27.66,16.510000000000002,0,null,null,null,null,"Commercial-Healthcare-AirComp","Healthcare Compressed Air",0,6.1511275376004426E-2,0.12271465568402397,0.18237451399856872,0.24155090033225715,0.29914469670103072,0.3544930758156784,0.4075780272866526,0.4598330200699482,0.51142013014638266,0.56289797988802648,0.61355260255184563,0.66394568634403539,0.71267525633176354,0.75919679552786645,0.803679038735582,0.84798237298953361,0.89127601974289072,0.93405374609063763,0.97566639491837726,1.0156760527128463,1.0542262603624613,1.0917399299936683,1.1285582036340425,1.1643546293724305,1.1991177640386574,1.2326689922480478,1.2647753024276422,1.2958305772816316,1.3258505513256231,1.3318776154922674,1.3376451410105874,1.3431643041860133,1.3484458000476649,1.3534998630731685,1.3583362870210192,1.3629644439089141,1.3673933021748426,1.3716314440561139,1.37568708222001,1.3795680756782835,1.3832819450163443,1.3868358869666417,1.3902367883544864,1.3934912394433325,1.3966055467053866,1.3995857450422804,1.4024376094794995,1.4051666663572207,1.4077782040392508,1.4102772831608108,1.4126687464350309,1.4149572280371552,1.4171471625846428,1.4192427937305636,1.4212481823869474,1.4231672145940133,1.4250036090505354,1.4267609243199348,1.4273403610464526,1.4278948459522114,1.4284254535175309,1.4289332119532434,1.4294191051931593,1.4298840748007347,1.4303290217936298,1.4307548083897013,1.4311622596778082,1.4315521652166665,1.4319252805648564,1.4322823287449422]
[66,17.64,16.510000000000002,28.69,27.74,16.559999999999999,0,null,null,null,null,"Commercial-Healthcare-Cook","Healthcare Cooking",0,6.5145419450687428E-2,0.12980874652529173,0.1928346047251894,0.25526875867576215,0.31596724075440358,0.37427092761206193,0.43018354097653899,0.48518002248945413,0.53938408837204399,0.59337551586576953,0.64647195994497031,0.69918119105578258,0.75014470187298654,0.79874520556135664,0.84522321871546824,0.89147817650596961,0.93664545795842435,0.98119406458392444,1.0245354448571795,1.0661787407683478,1.1062541358266629,1.1452620417694517,1.1835441747610951,1.2207329062437084,1.2568485717673819,1.2916789437751788,1.324996802607012,1.3572416729745358,1.3883915668190774,1.3952783256577823,1.4018685255034331,1.408174936838984,1.4142097802222862,1.4199847499670732,1.4255110368041899,1.4307993495669808,1.4358599359428574,1.4407026023312561,1.4453367328464701,1.4497713075021774,1.454014919612902,1.4580757924461312,1.4619617951573554,1.4656804580389096,1.4692389871121672,1.4726442780913611,1.4759029297460922,1.4790212566884184,1.4820053016093049,1.4848608469881437,1.4875934262980373,1.4902083347285573,1.4927106394467584,1.4951051894163288,1.4973966247939081,1.4995893859207783,1.5016877219273526,1.5036956989671366,1.5043207839241055,1.5049189513470425,1.5054913603642071,1.5060391201892449,1.5065632922706209,1.5070648923484924,1.5075448924230108,1.5080042226378609,1.5084437730826936,1.5088643955179402,1.5092669050253531,1.5096520815874708]
[67,17.690000000000001,16.559999999999999,28.77,27.82,16.600000000000001,0,null,null,null,null,"Commercial-Healthcare-Cool","Healthcare Cooling",0,7.9311508670312378E-2,0.15738134856731037,0.23324313093131457,0.30805389587605558,0.38045823758717151,0.44986571407976189,0.51640516485016319,0.58155783171539699,0.64553022445346597,0.70881793864624354,0.7707616754598654,0.83198670734426028,0.8909127693677581,0.94706244349635449,1.0007116053539007,1.0539837346262038,1.1058585792917561,1.1568349512035059,1.2063495656007535,1.2536884004126334,1.2993092559930493,1.3436807244816045,1.3870944924770174,1.4292187831085625,1.4700506882437188,1.5094171061153003,1.54708050736922,1.5834939113981694,1.6186410473051984,1.6294776111360465,1.6398475286775278,1.6497708947459311,1.6592669388305274,1.668354062356457,1.6770498743429925,1.68537122552628,1.6933342410126795,1.7009543515259806,1.7082463233090437,1.7152242867378122,1.7219017637031411,1.7282916938135036,1.7344064594693527,1.7402579098577253,1.745857383913584,1.7512157322923965,1.756343338396523,1.7612501384961656,1.7659456409838619,1.7704389447998392,1.7747387570639324,1.778853409948232,1.78279087682316,1.7865587877082585,1.790164444057635,1.7936148329087129,1.7969166404217063,1.800076264836054,1.8008272134803589,1.8015458246232343,1.8022334907886657,1.8028915445354896,1.8035212610396276,1.8041238605651184,1.8047005108287459,1.8052523292628393,1.805780385180632,1.8062857018483762,1.8067692584682271,1.8072319920757398]
[68,17.739999999999998,16.61,28.85,27.89,16.649999999999999,0,null,null,null,null,"Commercial-Healthcare-ExtLight","Healthcare Exterior Lights",0,5.61246542421776E-2,0.11221479260619566,0.16682937434709402,0.22099909325487876,0.27389171852595123,0.32480917730362041,0.37367610523741335,0.42176141018665203,0.46941673377670051,0.51708108378279416,0.56400032389534149,0.61089244265290366,0.65626221589246525,0.69979049753910094,0.74143902246556082,0.78284094242781843,0.82337037890458953,0.86358874934486407,0.90262948677167543,0.94026923512918104,0.97670023607006629,1.0120341233098742,1.0466520512895712,1.0803658683654485,1.1130667990930547,1.1446880001658468,1.1750058781336958,1.2042310371921352,1.2325377691643895,1.2375698380277997,1.2423852149305847,1.2469932311054985,1.2514028159618753,1.2556225143890303,1.2596605033145372,1.2635246075494722,1.2672223149513238,1.2707607909339569,1.2741468923527446,1.2773871807917758,1.2804879352788872,1.2834551644531564,1.2862946182084378,1.2890117988355014,1.2916119716843661,1.2941001753674903,1.2964812315235901,1.2987597541610061,1.3009401585987248,1.3030266700223787,1.3050233316718085,1.3069340126760476,1.3087624155509174,1.3105120833737596,1.3121864066492064,1.3137886298792989,1.3153218578506796,1.3167890616510438,1.3172692121789729,1.3177286863683786,1.3181683745879058,1.3185891288649649,1.3189917645367921,1.3193770618304066,1.3197457673745354,1.3200985956464291,1.3204362303563748,1.3207593257725911,1.3210685079890661,1.3213643761388028]
[69,17.79,16.649999999999999,28.93,27.97,16.690000000000001,0,null,null,null,null,"Commercial-Healthcare-Heat","Healthcare Heating",0,5.8954433695235509E-2,0.11776434095289307,0.17503990979151432,0.2318299686575884,0.28723524406767381,0.34055986713066877,0.39172008226562433,0.44206219410805991,0.4918245001624435,0.54155197036720903,0.59050945105091213,0.63928695608607788,0.68653660652000825,0.73178970757924922,0.77508579240395925,0.81810017584912986,0.86017505446867581,0.90181405595397546,0.94226609775777914,0.98129510088307081,1.0189412090323422,1.055502135406263,1.0913505277155946,1.1262182452228537,1.1600670203594163,1.1927524955351303,1.2240549653974668,1.2542852631754704,1.2835247313748328,1.2890692962987746,1.2943751000537431,1.2994524242211767,1.3043111076349889,1.3089605654472496,1.3134098073728575,1.3176674551485592,1.3217417592401395,1.3256406148301687,1.3293715771172778,1.3329418759566167,1.3363584298698596,1.3396278594519102,1.3427565002002841,1.3457504147920296,1.3486154048319772,1.3513570220950852,1.353980579284662,1.3564911603273193,1.3588936302245991,1.3611926444803693,1.3633926581222546,1.365497934334585,1.3675125527195899,1.3694404172028485,1.3712852635983113,1.3730506668475579,1.3747400479473155,1.3763566805786625,1.3769393556233465,1.3774969393981638,1.3780305123884196,1.3785411085513437,1.3790297173196921,1.3794972855190686,1.3799447192026826,1.3803728854070978,1.3807826138323755,1.3811746984498663,1.3815498990407662,1.3819089426684219]
[70,17.829999999999998,16.690000000000001,29,28.04,16.73,0,null,null,null,null,"Commercial-Healthcare-HotWater","Healthcare Hot Water",0,6.1676228763448908E-2,0.12306902474718562,0.18286980142980214,0.24218497282629683,0.29992542707327052,0.35543013877265117,0.40864929955464968,0.46103480328851082,0.51270917409115946,0.56428747000715396,0.61501744073667253,0.6654652856890404,0.71425793251507697,0.76087639327862533,0.80541898554153524,0.84975864944552315,0.8930693975807884,0.9358539142587321,0.97745501307733995,1.0175095628760915,1.0560784563685974,1.0936055271354357,1.1304250208090942,1.166220005620175,1.2009827386210306,1.2345360915396022,1.2666334862186333,1.2976830825003622,1.3276896646865362,1.33381259807935,1.3396718644839567,1.3452788179811879,1.3506443237201651,1.3557787789727749,1.3606921332814923,1.3653939077395951,1.369893213441129,1.3741987691363766,1.3783189181270445,1.3822616444339035,1.3860345882682183,1.3896450608369406,1.393100058510359,1.3964062763796592,1.3995701212306639,1.402597723958898,1.4054949514500314,1.4082674179487236,1.4109204959379025,1.4134593265495572,1.415888829527217,1.4182137127594276,1.4204384814026911,1.4225674466115557,1.4246047338927661,1.4265542910996658,1.4284198960823449,1.4302051640083535,1.4307959831404473,1.4313613603003457,1.4319023910753681,1.4324201238744325,1.4329155619596616,1.4333896653905029,1.433843352884131,1.4342775035957367,1.4346929588221538,1.4350905236321221,1.4354709684263502,1.4358350304303964]
[null,null,null,null,null,null,null,null,null,null,null,"C-Hos-Lgt-LPD Int-All-All-C","Healthcare Interior Lights",0,6.2850666070243671E-2,0.12533260799779763,0.18621304108506143,0.2465596095622172,0.30527227495196796,0.36169031257341816,0.41579674201751643,0.46902882482217528,0.52155019460063545,0.573921608946238,0.62543157948283279,0.676642495634455,0.72615304761660493,0.77342020393897526,0.81861602773989317,0.86360341923621764,0.9075520692654343,0.95095495323614765,0.99316509577057077,1.0337454163251165,1.0728418209001971,1.1108791357403507,1.148198547537449,1.1844745370700804,1.219696580336362,1.2536867935244378,1.2862125263431927,1.3176701821518033,1.3480755289729682,1.3544776795344324,1.3606041394018622,1.3664667804233261,1.3720769632189855,1.3774455591956927,1.3825829716135944,1.387499155745558,1.3922036381684895,1.3967055352239264,1.4010135706836746,1.4051360926547256,1.4090810897562098,1.4128562065997354,1.4164687586031091,1.4199257461661461,1.4232338682360379,1.4263995352885661,1.4294288817503156,1.4323277778859609,1.4351018411736598,1.4377564471905966,1.4402967400297706,1.4427276422682145,1.4450538645059599,1.447279914494233,1.4494101058705708,1.4514485665177841,1.4533992465629644,1.4552659260320364,1.4558568028702905,1.4564222352513949,1.4569633188696764,1.4574811022364533,1.4579765887118377,1.4584507384490475,1.4589044702549903,1.4593386633707248,1.4597541591752554,1.4601517628159546,1.4605322447687767,1.460896342331286]
[null,null,null,null,null,null,null,null,null,null,null,"Commercial-Healthcare-Misc","Healthcare Other",0,6.1890146492647562E-2,0.12345285305533821,0.18345709506635821,0.24296649769315004,0.30087761416590564,0.35652823000554917,0.40990005644640154,0.46243157115187072,0.51428182690271185,0.56601177811795289,0.61690947602342205,0.66753318308993392,0.71648332981670138,0.76321152201703213,0.80789193361079348,0.85238784742347495,0.89586612654964382,0.93881782424268645,0.98059794157960878,1.0207667790565502,1.0594667707041447,1.0971263953650054,1.1340859475651182,1.1700171467970037,1.2049103425833176,1.2385851097348601,1.270808226052458,1.3019777678221922,1.3321069592807306,1.3382333013647414,1.3440958296747993,1.3497059046126538,1.3550743973761508,1.3602117110254304,1.365127800641966,1.3698321926195118,1.3743340031243405,1.3786419557605403,1.3827643984746067,1.386709319732087,1.3904843639976181,1.3940968465483654,1.3975537676495593,1.4008618261196013,1.4040274323110291,1.4070567205324909,1.4099555609358037,1.4127295708911269,1.4153841258722977,1.4179243698734176,1.4203552253768821,1.4226814028921588,1.4249074100838111,1.4270375605064451,1.429075981963511,1.4310266245061578,1.4328932680876378,1.4346795298880974,1.4352602628299707,1.4358159881331987,1.4363477826817421,1.4368566769865683,1.4373436571825742,1.4378096669395177,1.4382556092906598,1.4386823483826618,1.4390907111501279,1.4394814889180378,1.4398554389351768,1.44021328584153]
[null,null,null,null,null,null,null,null,null,null,null,"Commercial-Healthcare-Motors","Healthcare Motors",0,6.165872698918981E-2,0.12300326967756355,0.18279470868696968,0.24209552817210825,0.29980893994336005,0.35527246053867723,0.40846704875737744,0.46082549688849078,0.51251170707161953,0.5640837543871331,0.61482679563477283,0.66530531789065395,0.71411573326040878,0.76071670732511076,0.8052752395600653,0.84964962707502401,0.893011062618152,0.93585394893645146,0.97752721036272239,1.0175961949158041,1.0562046867319281,1.0937728134723712,1.1306413515731344,1.1664862370295526,1.2012948696163093,1.2348902466139362,1.2670391895769955,1.2981340954167571,1.3281923838708207,1.3342684974620136,1.3400829602287054,1.3456470394312812,1.3509715171370953,1.3560667111139508,1.3609424948238604,1.3656083165558313,1.370073217734751,1.3743458504418511,1.3784344941807027,1.382347071921231,1.3860911654528367,1.3896740300763828,1.3931026086635083,1.3963835451105182,1.3995231972129203,1.4025276489855538,1.4054027224521888,1.4081539889274377,1.4107867798128431,1.4133061969280636,1.4157171223971741,1.4180242281092414,1.4202319847715072,1.4223446705727183,1.4243663794733987,1.4263010291391216,1.4281523685321578,1.4299239851762118,1.4305019172555336,1.4310549623075162,1.431584192022332,1.4320906319408162,1.4325752634417579,1.4330390256436161,1.4334828172243417,1.433907498162835,1.4343138914054123,1.4347027844605102,1.4350749309247188,1.4354310519431002]
[null,null,null,null,null,null,null,null,null,null,null,"Commercial-Healthcare-OffEquip","Healthcare Office Eqpmt",0,6.206468485843758E-2,0.12379544936489917,0.18395719722534132,0.24361508231624496,0.30166918075370053,0.35745739898588652,0.41096055576242324,0.46361549707598865,0.51558410092324714,0.56742673562927815,0.61843026810984336,0.66915611053469071,0.71820288300560053,0.76502725260471205,0.80979907848145738,0.85437987673635529,0.89793915614449227,0.94096982910526716,0.98282312621832313,1.0230632183706709,1.0618336938997588,1.0995584592272771,1.1365784207556329,1.1725679916235088,1.2075157020777643,1.2412436323053135,1.2735182698153229,1.3047353710219438,1.3349107589171316,1.3410952486908148,1.3470134207230475,1.3526767432419302,1.358096190628421,1.3632822646824794,1.368245014973444,1.3729940583140803,1.3775385973960286,1.3818874386227735,1.3860490091746827,1.3900313733391889,1.3938422481377595,1.3974890182799324,1.400978750473399,1.404318207117865,1.4075138594092198,1.4105718998794159,1.4134982543963499,1.4162985936470045,1.4189783441260999,1.4215426986515498,1.4239966264271002,1.4263448826716458,1.4285920178338907,1.4307423864102011,1.4328001553827474,1.4347693122942746,1.4366536729751622,1.4384568889377338,1.4390407401287888,1.4395994494025255,1.4401340994252401,1.4406457262412349,1.4411353212804643,1.441603833279727,1.4420521701211266,1.4424812005913656,1.4428917560652785,1.4432846321168697,1.4436605900609762,1.4440203584285423]
[null,null,null,null,null,null,null,null,null,null,null,"Commercial-Healthcare-Process","Healthcare Process",0,6.2562794938291033E-2,0.12477238373317971,0.1853903289785736,0.24548396780932105,0.30395632628176839,0.36014511466051313,0.41403261942201369,0.46705342280972739,0.51937243729546967,0.57155046458198144,0.62287452956903511,0.67390833902497593,0.72324962019811712,0.77035803199218722,0.8154008670524503,0.86023949488241858,0.90404582973475944,0.94731418356419239,0.9893943126028012,1.0298509879488404,1.0688307496448668,1.1067542319148795,1.143963761795882,1.1801349659362534,1.2152555937458631,1.2491493975110597,1.2815835535359787,1.3129521250593845,1.3432726025670307,1.3496004013218299,1.3556557111350351,1.3614502659802077,1.3669952945401811,1.3723015419659932,1.3773792906988278,1.38223838039532,1.3868882269948344,1.3913378409656612,1.3955958447654957,1.399670489550026,1.4035696711620171,1.4073009454318648,1.4108715428192791,1.4142883824244601,1.4175580853959251,1.4206869877609634,1.4236811527035838,1.4265463823137468,1.4292882288306492,1.4319120054018477,1.4344227963790712,1.4368254671706726,1.4391246736698127,1.4413248712766453,1.4434303235319874,1.445445110379205,1.4473731360703224,1.4492181367316785,1.4498103469240182,1.4503770552420467,1.4509193598526005,1.4514383116330347,1.4519349162076127,1.452410135896204,1.4528648915790667,1.4533000644813276,1.4537164978806205,1.4541149987411877,1.4544963392776156,1.4548612584512306]
[null,null,null,null,null,null,null,null,null,null,null,"Commercial-Healthcare-Refrig","Healthcare Refrigeration",0,6.0593268200120905E-2,0.12092694420173886,0.17970687781488548,0.2380155842083056,0.29478503698895103,0.34935427101993194,0.40169079119745243,0.45320140549208593,0.50408078252465793,0.5548725607494448,0.60483921094288373,0.65459125303429844,0.70268719677428593,0.74864523757811496,0.79258274274686302,0.83633578090104954,0.87909731406971758,0.92138125746187882,0.96249397377954149,1.0020370235819738,1.0401723913661445,1.0772641773766989,1.1136506721094921,1.1490414461271634,1.1834000868732859,1.2165767074494604,1.2483337245612778,1.27903181032586,1.308717092070129,1.3146156412119576,1.320260185845286,1.3256616639633039,1.3308305425451392,1.3357768378387616,1.3405101347704576,1.3450396055184921,1.3493740272869459,1.3535217993141746,1.3574909591488433,1.3612891982250812,1.3649238767669358,1.3684020380510069,1.3717304220549029,1.3749154785179614,1.3779633794395481,1.3808800310391529,1.383671085201454,1.3863419504285364,1.3888978023204812,1.3913435936046388,1.3936840637330195,1.3959237480663982,1.3980669866629329,1.4001179326883246,1.4020805604638193,1.4039586731676421,1.405755910204793,1.4074757542594829,1.4080308509463881,1.4085620439482114,1.4090703626102432,1.4095567919519005,1.410022274575496,1.4104677124928122,1.4108939688730191,1.4113018697153223,1.4116922054495837,1.4120657324680159,1.4124231745909177,1.4127652244692923]
[null,null,null,null,null,null,null,null,null,null,null,"Commercial-Healthcare-Vent","Healthcare Ventilation",0,6.1152358581988898E-2,0.12201715823404219,0.18130549700911402,0.24010246558427931,0.29733824496233402,0.35235236210300064,0.40511459480941436,0.45703163613754078,0.5083011247737389,0.55946536742382191,0.60978906542546762,0.65988300037936731,0.70830455797681102,0.75457372680077983,0.79880929200174255,0.84284889148101461,0.88588566311464512,0.92843261481553596,0.96979684121498066,1.0095780476769334,1.0479427794964149,1.0852548434997364,1.1218523041118287,1.1574450582360705,1.1919970639956881,1.2253586908410004,1.2572928667665708,1.2881609871285979,1.3180090593856324,1.3240614807265294,1.3298532714833686,1.3353956549827366,1.3406993712500741,1.3457746978216889,1.350631469660555,1.3552790982144938,1.3597265896536694,1.3639825623227373,1.3680552634414627,1.3719525850861756,1.3756820794830302,1.3792509736426999,1.3826661833648715,1.3859343266396771,1.3890617364720268,1.3920544731537012,1.3949183360069781,1.397658874622554,1.4002813996135359,1.4027909929063416,1.4051925175884523,1.4074906273320988,1.4096897754121434,1.4117942233356309,1.4138080490997338,1.4157351550940906,1.4175792756628531,1.4193439843410949,1.4199064381204012,1.4204446714020342,1.4209597271739318,1.421452603510676,1.4219242555075604,1.4223755971313732,1.4228075029914811,1.4232208100346466,1.4236163191668625,1.4239947968053464,1.4243569763637041,1.4247035596731374]
[null,null,null,null,null,null,null,null,null,null,null,"Commercial-Lodging-AirComp","Lodging Compressed Air",0,6.4233766067505638E-2,0.12803621624952827,0.19019453794206001,0.25177128126199633,0.31165941098863076,0.36919919765737225,0.4243789557278892,0.47864701936734388,0.53215846917711418,0.58547946045944099,0.63790634439468874,0.68999030280931872,0.74034157701989167,0.78839985782126387,0.83435611941576793,0.88007902332133958,0.92473293786957211,0.96880489627928812,1.0116641307972412,1.0528621337819695,1.092540787836964,1.1311423500234552,1.1690093229463898,1.2058071262204215,1.2415336200887686,1.2760028611257772,1.3089841056164291,1.3408841747760092,1.3717106085790203,1.3784637491823311,1.3849260846878915,1.3911101378032606,1.3970278919806471,1.4026908146384334,1.4081098793827262,1.4132955872720019,1.4182579871660457,1.4230066951986233,1.4275509134116162,1.431899447586729,1.4360607243093251,1.4400428072974552,1.4438534130277234,1.447499925688267,1.4509894114878303,1.4543286323486564,1.457524059009734,1.4605818835657891,1.4635080314663202,1.4663081729979293,1.468987734272196,1.471551907740394,1.4740056622554161,1.4763537527004134,1.4786007292028029,1.4807509459515009,1.4828085696344657,1.484777587512901,1.4853806104028084,1.4859576657998492,1.4865098719214194,1.487038298832013,1.4875439705167912,1.4880278668658615,1.4884909255731056,1.4889340439532437,1.4893580806806483,1.4897638574532845,1.4901521605849939,1.4905237425292133]
[null,null,null,null,null,null,null,null,null,null,null,"Commercial-Lodging-Cook","Lodging Cooking",0,6.7071260082102319E-2,0.13356946378304407,0.19834820676599182,0.2624625260836293,0.32476726592141403,0.38460520868751558,0.44198720001773456,0.49838665242736402,0.55393750018811527,0.6092146857858457,0.66354453857636442,0.71743679293186902,0.76952902799220135,0.8192042855574978,0.86671485702719331,0.91396082337028028,0.96007989755692391,1.0055378913016817,1.0497505901488653,1.0922196512827658,1.1330901886443108,1.1728602050152137,1.2118724592607462,1.2497598794876659,1.2865437738312415,1.3220128914864024,1.3559431883215454,1.3887745412882795,1.4204862403479246,1.4279094359794635,1.4350129724689744,1.4418106150426691,1.4483155361658218,1.4545403410683602,1.4604970921712681,1.4661973324611319,1.4716521078581308,1.476871988620809,1.481867089829114,1.4866470909853864,1.4912212547712929,1.495598444997041,1.4997871437776609,1.5037954679696419,1.5076311848997672,1.5113017274166334,1.5148142082940175,1.5181754340140023,1.5213919179565714,1.5244698930212308,1.5274153237051153,1.5302339176609858,1.5329311367575125,1.5355122076632797,1.5379821319750187,1.5403456959096971,1.5426074795792457,1.5447718658658951,1.5454136389470758,1.5460277758668657,1.5466154666992007,1.5471778502708131,1.5477160163680499,1.5482310078486592,1.5487238226626394,1.5491954157860655,1.5496467010716406,1.5500785530195595,1.5504918084721133,1.5508872682353227]
[null,null,null,null,null,null,null,null,null,null,null,"Commercial-Lodging-Cool","Lodging Cooling",0,8.2011394161000187E-2,0.16265249440355226,0.24099114365895447,0.31816086110384728,0.39282833729154715,0.4644000588370113,0.53301450160139796,0.60015259535902377,0.66603622123988404,0.73114335928272611,0.79483419338251882,0.85772998363209618,0.91825782953994128,0.97594887673923947,1.0310833572365921,1.0857679382148222,1.1390048642879524,1.1912830595400326,1.242045090760886,1.2905744670500141,1.3373470503145937,1.3828095517150703,1.4272684752541991,1.4703919284099758,1.5121817846903496,1.5524647610221916,1.591007578912033,1.6282586502134626,1.6642087699469856,1.6757939275322493,1.6868802027334582,1.697489078524089,1.7076411127734963,1.717355978083934,1.7266524999121042,1.7355486930491089,1.7440617965294962,1.752208307037044,1.7600040108720181,1.7674640145418494,1.7746027740345112,1.7814341228313166,1.7879712987134273,1.7942269694140114,1.8002132571657667,1.8059417621913696,1.8114235851823774,1.8166693488101362,1.8216892183103834,1.8264929211814338,1.8310897660341132,1.835488660629979,1.8396981291427692,1.8437263286765395,1.8475810650724922,1.8512698080351264,1.8547997056070249,1.858177598020325,1.8589529032709455,1.8596948221710607,1.8604047924104055,1.8610841897686301,1.8617343307812853,1.8623564752910031,1.8629518288888192,1.8635215452503657,1.8640667283714629,1.8645884347074411,1.8650876752203389,1.8655654173379441]
[null,null,null,null,null,null,null,null,null,null,null,"Commercial-Lodging-ExtLight","Lodging Exterior Lights",0,5.6094434902432759E-2,0.11215636256235119,0.1667353775022842,0.22086994631322512,0.27372807384591641,0.32461326689049819,0.37344691515039202,0.42149773822187431,0.46911853042007057,0.51674933959201619,0.56362974819144684,0.61048698005325941,0.65581921451322911,0.69931523662174466,0.74093102785277676,0.78229949036146595,0.82279410826338495,0.86297927234407856,0.90198515520554023,0.93959349766502553,0.97599635234500703,1.0113023527481351,1.0458891154898342,1.079574398050676,1.1122463496262518,1.1438415504130026,1.1741344896406407,1.2033337548709102,1.2316161344421201,1.2366583711539683,1.2414834780552582,1.2461008052335261,1.2505193001409596,1.254747524932762,1.2587936730588887,1.2626655851413064,1.2663707641675437,1.2699163900299715,1.2733093334389936,1.2765561692371006,1.2796631891395953,1.2826364139266717,1.2854816051104769,1.2882042760997641,1.2908097028837711,1.2933029342560265,1.2956888015978978,1.2979719282408368,1.3001567384254675,1.3022474658748748,1.3042481619987096,1.306162703744006,1.3079948011079259,1.309748004326988,1.3114257107567127,1.3130311714550136,1.3145674974820958,1.3160376659290647,1.3165160344713451,1.3169738034113263,1.3174118598132223,1.3178310525423094,1.3182321939098567,1.3186160612472226,1.3189833984121662,1.3193349172302939,1.3196712988744352,1.3199931951846184,1.3203012299312051,1.3205960000236325]
[null,null,null,null,null,null,null,null,null,null,null,"Commercial-Lodging-Heat","Lodging Heating",0,6.6184853390016354E-2,0.13178805008380917,0.19558875969947553,0.25860082147742164,0.32011019840977611,0.37934729620383967,0.43620298459302675,0.49189825291934508,0.54684216940231256,0.6015312249652125,0.65537071636460098,0.70877108262470989,0.76065097019420369,0.81044783392466013,0.85824631297397447,0.90538780398119167,0.95151488456323052,0.99700360429553392,1.0411069151771835,1.0837753190615185,1.124903715654834,1.1647362071325624,1.2037218444326203,1.2415562658353627,1.2782684997762319,1.3136514945151652,1.3475608467633413,1.3802757524856155,1.4118899591627192,1.4192930133522694,1.4263772757346143,1.4331564741866185,1.4396437454325559,1.4458516605004386,1.4517922490821444,1.4574770228445424,1.4629169977367893,1.4681227153370255,1.4731042632798352,1.4778712948040551,1.482433047458811,1.4867983610040318,1.4909756945401285,1.4949731429000295,1.4987984523353415,1.5024590355270275,1.5059619859496938,1.5093140916173167,1.5125218482370517,1.5155914717966068,1.5185289106095783,1.5213398568420866,1.5240297575430517,1.5266038251994776,1.5290670478372057,1.5314241986867063,1.5336798454326399,1.5358383590651123,1.5366318953331528,1.5373912601829522,1.53811792511099,1.5388132982478684,1.5394787270869863,1.5401155010957117,1.5407248542141092,1.5413079672460686,1.5418659701474651,1.542399944215787,1.542910924185473,1.5433999002330197]
[null,null,null,null,null,null,null,null,null,null,null,"Commercial-Lodging-HotWater","Lodging Hot Water",0,6.1998683086719561E-2,0.12371105110566398,0.18382597055945535,0.24344318474452098,0.30147053509442462,0.35724230353536246,0.41071096414308533,0.46335113844910353,0.51526054254176856,0.56706364660090347,0.61800269413397935,0.66864440923886603,0.71761604600957041,0.76439954571528612,0.80909821412288185,0.85358706256407013,0.8970369618218923,0.93994623676399436,0.9816747984894949,1.0218541074281795,1.0605383080361246,1.0981726759288195,1.1350942166842579,1.1709879213607572,1.2058471833300548,1.239496540190822,1.271679683845311,1.3028132443789586,1.3328965197360181,1.3391156659672272,1.3450670020736473,1.3507620605486905,1.3562118772712199,1.3614270128908652,1.3664175732924397,1.3711932291791138,1.3757632348122948,1.3801364459445253,1.3843213369801528,1.3883260173970211,1.3921582474610099,1.3958254532638701,1.3993347411134969,1.4026929113045277,1.4059064712959444,1.4089816483212236,1.4119244014554622,1.4147404331628675,1.4174352003469872,1.4200139249250923,1.4224816039472024,1.4248430192793651,1.4271027468699518,1.4292651656169244,1.4313344658532619,1.4333146574669819,1.4352095776714988,1.4370228984413713,1.437614793600736,1.4381812004518026,1.438723216577225,1.4392418922953327,1.4397382326954358,1.4402131995854865,1.4406677133558701,1.4411026547629358,1.4415188666357257,1.441917155509209,1.4422982931871833,1.4426630182378763]
[null,null,null,null,null,null,null,null,null,null,null,"C-Lod-Lgt-LPD Int-All-All-C","Lodging Interior Lights",0,6.3123888285940247E-2,0.12587019800480642,0.18698624675722736,0.24754741264897334,0.30646925762982657,0.36309214719729066,0.41739388580499365,0.4708022257624434,0.52349489319381792,0.57602667829902432,0.62767975522839448,0.67903437150755663,0.72867730059307112,0.77608648681469306,0.8214194482266034,0.86652519344380508,0.9105861746031183,0.95410155188171653,0.99640960804968592,1.0370892942901038,1.0762924007604069,1.1144220513168472,1.151819291689355,1.1881721982562963,1.2234620285331945,1.2575210818312437,1.2901165783344797,1.3216320894788123,1.3520955364856224,1.3586207396554741,1.3648649532151409,1.3708402771956834,1.3765582905741927,1.3820300737115221,1.3872662298237992,1.3922769055293276,1.3970718105106945,1.4016602363301842,1.406051074434959,1.4102528333868967,1.4142736553504733,1.4181213318706425,1.4218033189712826,1.4253267516034744,1.4286984574716006,1.4319249702640657,1.4350125423142714,1.4379671567163823,1.4407945389193593,1.4435001678217296,1.446089286388591,1.4485669118114248,1.4509378452304047,1.4532066810380411,1.4553778157821904,1.4574554566856828,1.4594436297990727,1.4613461878023164,1.4619343109152574,1.4624971081525215,1.4630356701020566,1.4635510403886931,1.4640442176964792,1.4645161577039298,1.4649677749359404,1.4653999445359502,1.465813503961797,1.4662092546085403,1.4665879633614047,1.4669503640818491]
[null,null,null,null,null,null,null,null,null,null,null,"Commercial-Lodging-Misc","Lodging Other",0,6.3655785832146317E-2,0.12690746687715584,0.18851073782369254,0.24954361771604747,0.30891508833223769,0.36596521900462553,0.4206762745646081,0.47447863655163891,0.52754777365021865,0.58044023040721859,0.6324418194039465,0.68412815993533971,0.7340881025865702,0.78179511686072822,0.82741205219824032,0.87279486905499015,0.91712189224542562,0.96088933350863859,1.0034420836097291,1.0443517698888876,1.083772939504041,1.1221147404315019,1.1597184872494355,1.1962682861973237,1.231748394935505,1.2659882835880876,1.298755507791759,1.3304386852966399,1.3610612534276292,1.367720350882796,1.3740926929451567,1.3801906279330616,1.3860259724190949,1.3916100341282178,1.3969536338498665,1.4020671264064681,1.4069604207190056,1.4116429990085151,1.4161239351707251,1.4204119123594428,1.4245152398127612,1.4284418689546927,1.4321994088034311,1.4357951407160994,1.4392360324985569,1.4425287519076073,1.4456796795717703,1.4486949213556584,1.4515803201919149,1.4543414674036437,1.4569837135392691,1.4595121787408247,1.4619317626657582,1.4642471539814841,1.4664628394510781,1.4685831126277233,1.4706120821747521,1.4725536798274113,1.4731461887916877,1.4737131830158761,1.4742557612208407,1.4747749748141084,1.4752718299272831,1.4757472893657277,1.4762022744742875,1.47663766692267,1.4770543104139449,1.4774530123194711,1.4778345452434196,1.4781996485199256]
[null,null,null,null,null,null,null,null,null,null,null,"Commercial-Lodging-Motors","Lodging Motors",0,6.4906366559494097E-2,0.1293486750161118,0.19212234927011693,0.25429027886098721,0.31474344398570642,0.37282236369490501,0.42851848200782466,0.48328250393051669,0.53726908999005274,0.59104414317846099,0.64390889027602671,0.69640989064766523,0.74716133503266136,0.79559857194400274,0.84191877591798703,0.88799226583054791,0.93298340599069185,0.97737604412084511,1.0205445885528772,1.0620366221880764,1.1019954546736859,1.1408664922650176,1.1789934958105857,1.2160396628240941,1.2520049919914837,1.286701919708493,1.3199003781067697,1.3520102163922356,1.3830369305676213,1.3899678713163872,1.3966003505018094,1.4029472205357063,1.4090207803767558,1.414832799363406,1.4203945400204876,1.4257167798837234,1.4308098323844278,1.4356835668348624,1.440347427552982,1.4448104521636225,1.4490812891116038,1.4531682144206768,1.4570791477307947,1.4608216676447829,1.4644030264141497,1.4678301639924909,1.4711097214837268,1.4742480540112253,1.4772512430327549,1.4801251081251279,1.4828752182613696,1.4855069026022711,1.4880252608232292,1.4904351729963949,1.4927413090472714,1.4949481378040907,1.4970599356575065,1.4990807948473781,1.499690536592079,1.5002740215152375,1.5008323802933796,1.5013666949136113,1.5018780007702923,1.5023672886714226,1.5028355067586285,1.5032835623444716,1.5037123236706371,1.5041226215904127,1.5045152511787148,1.504890973272784]
[null,null,null,null,null,null,null,null,null,null,null,"Commercial-Lodging-OffEquip","Lodging Office Eqpmt",0,6.2794552785183533E-2,0.12522189250489241,0.18604708105848458,0.24633747177032445,0.30499814577953605,0.36136740386986232,0.41542736245233558,0.4686127361932878,0.52109088281864258,0.57341921962197551,0.62488657215773002,0.67605782305474094,0.72553021604215839,0.77276428405154163,0.81793057365446387,0.86288552906618288,0.90680403067898607,0.95017840272761811,0.99235964795870235,1.0329140508859749,1.0719889712180348,1.110002449330286,1.1472966630849819,1.1835489246597592,1.2187471729831181,1.2527154121701425,1.2852211618141836,1.3166573733430735,1.3470427963681308,1.353439567481372,1.3595608795514591,1.3654185944510639,1.3710240632545136,1.3763881482338913,1.381521243907937,1.3864332971845357,1.3911338266358262,1.3956319409432816,1.3999363565485019,1.4040554145439279,1.4079970968362017,1.4117690416134971,1.4153785581467941,1.418832640953777,1.4221379833528036,1.4253009904332119,1.4283277914670953,1.4312242517866014,1.4339959841497647,1.4366483596169068,1.4391865179586696,1.4416153776158587,1.4439396452303939,1.4461638247658342,1.448292226235155,1.4503289740526868,1.4522780150264016,1.4541431260060329,1.4547301734217062,1.4552919412835945,1.455829518184923,1.4563439458416967,1.4568362211113366,1.4573072979243891,1.4577580891330517,1.4581894682800973,1.4586022712916242,1.4589972980969133,1.4593753141785295,1.4597370520556743]
[null,null,null,null,null,null,null,null,null,null,null,"Commercial-Lodging-Misc","Lodging Process",0,6.3655785832146317E-2,0.12690746687715584,0.18851073782369254,0.24954361771604747,0.30891508833223769,0.36596521900462553,0.4206762745646081,0.47447863655163891,0.52754777365021865,0.58044023040721859,0.6324418194039465,0.68412815993533971,0.7340881025865702,0.78179511686072822,0.82741205219824032,0.87279486905499015,0.91712189224542562,0.96088933350863859,1.0034420836097291,1.0443517698888876,1.083772939504041,1.1221147404315019,1.1597184872494355,1.1962682861973237,1.231748394935505,1.2659882835880876,1.298755507791759,1.3304386852966399,1.3610612534276292,1.367720350882796,1.3740926929451567,1.3801906279330616,1.3860259724190949,1.3916100341282178,1.3969536338498665,1.4020671264064681,1.4069604207190056,1.4116429990085151,1.4161239351707251,1.4204119123594428,1.4245152398127612,1.4284418689546927,1.4321994088034311,1.4357951407160994,1.4392360324985569,1.4425287519076073,1.4456796795717703,1.4486949213556584,1.4515803201919149,1.4543414674036437,1.4569837135392691,1.4595121787408247,1.4619317626657582,1.4642471539814841,1.4664628394510781,1.4685831126277233,1.4706120821747521,1.4725536798274113,1.4731461887916877,1.4737131830158761,1.4742557612208407,1.4747749748141084,1.4752718299272831,1.4757472893657277,1.4762022744742875,1.47663766692267,1.4770543104139449,1.4774530123194711,1.4778345452434196,1.4781996485199256]
[null,null,null,null,null,null,null,null,null,null,null,"Commercial-Lodging-Refrig","Lodging Refrigeration",0,6.0730826842930824E-2,0.12119611760171516,0.18010322440529161,0.23853392068003673,0.29542115328968477,0.35010341346302926,0.40254819398044095,0.45416314853659406,0.50514217642433024,0.55602975712321212,0.60608994975522601,0.65593067393953042,0.70411366448989421,0.75015372312040118,0.79417106199079701,0.83800013016276143,0.8808351396470806,0.92318846406453603,0.9643684157710819,1.0039766872019993,1.0421730454234301,1.0793236001775228,1.115767308662609,1.1512123325802444,1.1856234972606354,1.2188496334019931,1.2506538078229767,1.2813977430703865,1.3111266326730573,1.317059157762692,1.3227362152647348,1.3281688061757806,1.3333674577652981,1.3383422439753627,1.3431028049419318,1.3476583656754904,1.3520177539372691,1.3561894173456699,1.3601814397460534,1.364001556875607,1.3676571713536487,1.3711553670264158,1.3745029226941357,1.3777063252469777,1.3807717822353429,1.3837052338988505,1.3865123646773267,1.3891986142261079,1.3917691879569987,1.3942290671253155,1.3965830184825561,1.3988356035134086,1.4009911872749901,1.4030539468554506,1.4050278794683315,1.4069168101983611,1.4087243994137004,1.4104541498590013,1.4110104167101971,1.4115427294864606,1.4120521197029812,1.4125395744556322,1.413006038333767,1.4134524152506425,1.4138795701950211,1.4142883309073451,1.4146794894837318,1.4150538039108957,1.4154119995349763,1.415754770467111]
[null,null,null,null,null,null,null,null,null,null,null,"Commercial-Lodging-Vent","Lodging Ventilation",0,6.161425934167912E-2,0.12291545056057099,0.18262016239846546,0.24181468225675973,0.29943026824056834,0.35480658389505737,0.40791592606354432,0.46016208306348599,0.51174980142082538,0.56321578573445874,0.61382699186039424,0.66419809629924065,0.71288150496933322,0.75940348017680881,0.80388254824975947,0.84815427385236619,0.89141483791674447,0.93417643931838557,0.9757447481586865,1.0157180782337449,1.0542718708074823,1.0917633161383562,1.1285307099512401,1.1642866714023219,1.1989941864013696,1.2325052741877762,1.2645836922610922,1.2955882746409819,1.3255675383079994,1.3317546015340191,1.3376752362000666,1.3433409153063323,1.3487626178003664,1.3539508498520736,1.3589156652125589,1.3636666846962768,1.3682131148242369,1.3725637656643899,1.3767270679037706,1.3807110891854748,1.3845235497421295,1.3881718373561531,1.3916630216757928,1.3950038679146828,1.3982008499614673,1.4012601629248973,1.4041877351387062,1.4069892396495278,1.409670105210123,1.4122355267992091,1.4146904756882868,1.417039709074964,1.4192877793014496,1.4214390426760766,1.423497667914954,1.4254676442201002,1.4273527890097135,1.4291567553155637,1.4297227686706218,1.4302644082448397,1.4307827236268664,1.4312787192077532,1.4317533561272624,1.4322075541363619,1.4326421933795193,1.433058116100244,1.4334561282731864,1.4338370011659543,1.4342014728336747,1.4345502495491966]
[null,null,null,null,null,null,null,null,null,null,null,"Commercial-large Office-AirComp","Large Office Compressed Air",0,6.3864467864222271E-2,0.12730184880507867,0.1891518358325566,0.25046196808505133,0.31008447890577778,0.36735789509837008,0.42227999993270438,0.4763282075681573,0.5296219907449996,0.58274268134612861,0.63500577204602404,0.68691436331491895,0.7371100418895441,0.78497799111036071,0.83075166327318661,0.87633214779543045,0.92085398278303876,0.96478526148114563,1.0075324918174737,1.0486077711935688,1.0881396303449971,1.1266258608765045,1.1644091049367928,1.2011207514525639,1.2367790346637002,1.271172538683909,1.3040711318842644,1.3359152850294063,1.3666834340080032,1.3732178310118781,1.3794708424988398,1.3854545855485638,1.3911806554526061,1.3966601481837466,1.401903681897757,1.4069214175092499,1.4117230783814922,1.416317969168327,1.4207149938447239,1.424922672960893,1.4289491601533995,1.4328022579452717,1.4364894328657236,1.4400178299187876,1.4433942864288967,1.4466253452902451,1.4497172676456025,1.45267604501915,1.4555074109268511,1.4582168519868521,1.4608096185514465,1.4632907348812019,1.4656650088809677,1.4679370414166288,1.4701112352306587,1.4721918034737493,1.4741827778690515,1.4760880165248429,1.4767088942191597,1.477303035553434,1.4778715918541749,1.4784156648692379,1.4789363089027914,1.4794345328583447,1.4799113021938024,1.4803675407923265,1.4808041327526367,1.4812219241022158,1.4816217244367411,1.4820043084889187]
[null,null,null,null,null,null,null,null,null,null,null,"Commercial-large Office-Cook","Large Office Cooking",0,6.6515873715782978E-2,0.13247360443246731,0.19679930989055447,0.26051662124539676,0.32242818619264541,0.38187685544739336,0.43887927444652602,0.49495846061634285,0.55018782576366732,0.60517142167522764,0.65925786439310619,0.71288541635686309,0.76474729901172045,0.81414909428899274,0.86139365192229811,0.90842668120003978,0.95434518526356804,0.99959166169305846,1.0436330389794335,1.0859258526626083,1.1265795820533537,1.1661754185377939,1.2050594425555248,1.242815217610576,1.2794943122988029,1.3148487769293813,1.3486532294889437,1.3813967829371012,1.413018104212493,1.4201203303472387,1.4269167189929286,1.4334204401849762,1.4396440968280839,1.4455997491181392,1.4512989379124506,1.4567527070936095,1.4619716249703167,1.4669658047566396,1.4717449241693887,1.4763182441815887,1.4806946269683832,1.4848825530801482,1.4888901378760955,1.4927251472502077,1.4963950126799801,1.4999068456271307,1.5032674513181841,1.5064833419316321,1.5095607492172285,1.5125056365718661,1.5153237105954427,1.5180204321491046,1.5206010269372978,1.5230704956341334,1.5254336235736889,1.5276949900230243,1.5298589770558813,1.5319297780442611,1.5325997887754907,1.5332409473699691,1.5338544962642069,1.5344416243926637,1.5350034694916659,1.5355411203041078,1.53605561868922,1.5365479616414803,1.5370191032225906,1.5374699564102559,1.5379013948673521,1.538314254634908]
[null,null,null,null,null,null,null,null,null,null,null,"Commercial-large Office-Cool","Large Office Cooling",0,8.0597619568087225E-2,0.15989555230841598,0.23698211343050127,0.31297858521833244,0.386538563359548,0.45705047132717747,0.5246273780810875,0.5908051855382207,0.65574526348592022,0.71997291247450834,0.782858182133364,0.84495880872567686,0.90476975723599762,0.96172251212232451,1.0161765283575757,1.0702176456912802,1.1228470005055777,1.1745140285310955,1.2247077584487791,1.2727153295941853,1.3189228496031742,1.3638840583449567,1.4078832404313562,1.4505572878663577,1.491934757032181,1.5318022206522512,1.5699334230751252,1.6068219550393763,1.6424172219017794,1.6534794911963679,1.6640653948275532,1.6741954461492616,1.6838892751652506,1.6931656665681107,1.7020425961402257,1.7105372655872257,1.7186661358714361,1.7264449591099154,1.7338888090988904,1.741012110523747,1.7478286669111696,1.7543516873776026,1.7605938122258638,1.7665671374395111,1.7722832381224269,1.7777531909290452,1.7829875955286798,1.7879965951455552,1.7927898962143352,1.7973767871892445,1.8017661565432246,1.8059665099920093,1.8099859869764923,1.8138323764353277,1.817513131898328,1.8210353859299075,1.8244059639505577,1.8276313974631415,1.8284119933881062,1.8291589751344839,1.829873790202788,1.8305578237609736,1.8312124013286153,1.8318387913454974,1.8324382076295953,1.8330118117292102,1.8335607151738178,1.834085981627988,1.8345886289525526,1.8350696311770163]
[null,null,null,null,null,null,null,null,null,null,null,"Commercial-large Office-ExtLight","Large Office Exterior Lights",0,5.6358589038299906E-2,0.11266972043502077,0.16749626743476287,0.22188638184703455,0.2749788303788625,0.32608181524321916,0.37512010146435865,0.42337728358119747,0.47118902748289487,0.51900762774183062,0.56607417353441059,0.61310288430630366,0.65859646648061609,0.70222701516221753,0.74396657405686029,0.78547187408127905,0.82609575104066113,0.866396920872606,0.90552334892623842,0.94323716716041794,0.97972899660451807,1.0151341525996895,1.0498257208349362,1.0836095219794841,1.1163811482342643,1.148068418850184,1.1784440784647532,1.207733329596822,1.2360987490715845,1.2411744067856327,1.24603149550721,1.2506794272981929,1.2551272089163588,1.2593834592686703,1.2634564261129875,1.267354002040564,1.2710837397703021,1.2746528667844055,1.2780682993337869,1.2813366558403718,1.2844642697222712,1.2874572016666728,1.2903212513742341,1.2930619687977376,1.2956846648967839,1.2981944219293644,1.3005961033002547,1.3028943629853171,1.3050936545499701,1.3071982397793034,1.3092121969365598,1.3111394286659921,1.3129836695554007,1.3147484933730169,1.316437319992745,1.318053422021193,1.3195999311393252,1.3210798441710305,1.3215626062606829,1.3220245795522163,1.3224666592570329,1.3228897020367618,1.3232945276632968,1.3236819206073491,1.3240526315585956,1.3244073788803623,1.3247468500016704,1.3250717027493335,1.3253825666226955,1.3256800440134724]
[null,null,null,null,null,null,null,null,null,null,null,"Commercial-large Office-Heat","Large Office Heating",0,6.3910217872087574E-2,0.1274398767460416,0.18932243745108066,0.25056357122172435,0.31022246538212539,0.36761064066518517,0.42267707897694795,0.47679959696929514,0.5301786095651233,0.5833830085099071,0.63573643008811875,0.68772733388024299,0.7381073987359158,0.78629382853073848,0.8324061313626997,0.87816000942693639,0.92286766715447965,0.96700750085664955,1.0099024486063959,1.0512545208519517,1.0910739133256742,1.1297439991631926,1.1676704651065559,1.2045099505347976,1.2402751959651475,1.2747714836103676,1.3077931504191365,1.3397049311190596,1.3705450227768756,1.377230931188469,1.3836289296684627,1.3897514162521887,1.3956102550882898,1.4012167994290567,1.4065819136307476,1.4117159942065283,1.4166289899728257,1.4213304213281339,1.4258293987016348,1.4301346402073774,1.4342544885382316,1.43819692713235,1.4419695956434686,1.4455798047450172,1.4490345502967383,1.4523405269012564,1.4555041408768714,1.4585315226717186,1.4614285387433428,1.4642008029267148,1.4668536873127171,1.4693923326581737,1.4718216583476058,1.4741463719260097,1.4763709782211332,1.4784997880729258,1.4805369266870816,1.4824863416288576,1.4831635293689112,1.4838115559144172,1.4844316770105952,1.4850250943275121,1.4855929577886762,1.4861363677993598,1.4866563773789614,1.4871539942015464,1.4876301825485179,1.4880858651771987,1.4885219251089508,1.4889392073402923]
[null,null,null,null,null,null,null,null,null,null,null,"Commercial-large Office-HotWater","Large Office Hot Water",0,6.1750848822613842E-2,0.12320971348544243,0.18307838881464839,0.24245753701124545,0.30025687112447319,0.35581557106790063,0.40908779958921365,0.46152328156369615,0.51325071571404401,0.56487679213049957,0.61565410789950403,0.66614973970099023,0.71498537312648491,0.76164187974224495,0.80622377777099252,0.85060428140719546,0.89395634039032612,0.93678233312617198,0.97842401120791167,1.0185096988469549,1.0571127091299257,1.0946726256831201,1.1315242422892289,1.1673505713669048,1.202142699679674,1.2357244060520518,1.2678506648416887,1.2989268501732434,1.3289605743691948,1.335100961060554,1.3409769291862563,1.346599865191713,1.351980665196935,1.3571297561110232,1.3620571158374231,1.3667722926090975,1.3712844234910828,1.3756022520862841,1.3797341454788212,1.3836881104477561,1.3874718089826221,1.3910925731308192,1.3945574192056491,1.3978730613825199,1.4010459247096687,1.4040821575586149,1.4069876435384678,1.4097680128971788,1.4124286534318304,1.4149747209291048,1.4174111491561616,1.4197426594212879,1.4219737697228438,1.4241088035042371,1.4261518980318861,1.4281070124124116,1.4299779352645889,1.4317682920609311,1.4323600004349157,1.4329262285439919,1.4334680736244476,1.4339865856631613,1.4344827694322653,1.4349575864361925,1.4354119567748789,1.4358467609267318,1.4362628414548209,1.4366610046395949,1.4370420220412927,1.4374066319950705]
[null,null,null,null,null,null,null,null,null,null,null,"C-LOff-Lgt-LPD Int-All-All-C","Large Office Interior Lights",0,6.6135662129469974E-2,0.13175028954112028,0.19567099834520738,0.25895430757496768,0.32046767522170333,0.37955397053154816,0.43621012830489575,0.4919098813947147,0.54678490260098989,0.60141657681062688,0.65511677884627662,0.70840420611175647,0.7599148483587137,0.80905556619264762,0.85604451093714351,0.90277841904016076,0.94840238203974325,0.99339326335227296,1.0371456570262223,1.0791885256476512,1.1196542227069584,1.1590264113243876,1.1976494612490434,1.2351667579094587,1.271591373227845,1.3067220421514936,1.3403284476927626,1.3728433390236421,1.4042553052657141,1.411459046464995,1.4183525787131108,1.4249492602902549,1.4312618742396752,1.4373026531386419,1.4430833028027248,1.4486150249693115,1.4539085390043227,1.45897410267419,1.463821532023345,1.4684602203957424,1.4728991566372709,1.4771469425143315,1.4812118093823321,1.4851016341363998,1.4888239544752206,1.492385983507585,1.4957946237299433,1.4990564804020565,1.5021778743466625,1.5051648541979599,1.5080232081226466,1.5107584750362222,1.5133759553362944,1.5158807211736844,1.5182776262812345,1.5205713153793685,1.5227662331766258,1.5248666329826139,1.5255123802643775,1.5261303202469261,1.5267216503737671,1.5272875165238542,1.5278290152320713,1.5283471958140973,1.5288430623997682,1.5293175758788791,1.5297716557631957,1.5302061819682835,1.5306219965186068,1.5310199051792028]
[null,null,null,null,null,null,null,null,null,null,null,"Commercial-large Office-Misc","Large Office Other",0,6.2507328029174483E-2,0.1246600777294349,0.18523065288233589,0.24528349347440689,0.30371418104656422,0.35986096492236092,0.41370549235647985,0.46669049403776136,0.51897369109534264,0.57111824836521119,0.62241388465632375,0.67341673424164461,0.72272937447367469,0.76980340186894836,0.81481417231981679,0.8596272132378433,0.90340933624635666,0.94665119384954244,0.98870882901058432,1.0291421960891867,1.0680944625661613,1.1059959263684993,1.1431881967026485,1.1793419419526658,1.2144485593089924,1.2483273723520933,1.280744847288624,1.3121014967986631,1.3424102529094797,1.34870540703607,1.3547294779706058,1.36049413915198,1.3660105613351132,1.3712894342376332,1.3763409872543984,1.3811750092800112,1.3858008676777269,1.3902275264315218,1.394463563516493,1.3985171875212501,1.4023962535545105,1.4061082784667214,1.4096604554162055,1.4130596678080565,1.4163125026327938,1.419425263230629,1.4224039815060692,1.4252544296165381,1.427982131157657,1.4305923718668614,1.4330902098661003,1.435480485463458,1.4377678305327,1.4399566774889121,1.442051267877632,1.4440556605941104,1.4459737397486352,1.4478092221931564,1.4484010554267668,1.4489674030187381,1.4495093624368927,1.4500279838896721,1.4505242723612315,1.4509991895588958,1.4514536557767566,1.4518885516790156,1.4523047200065362,1.4527029672099052,1.4530840650121721,1.4534487519042936]
[null,null,null,null,null,null,null,null,null,null,null,"Commercial-large Office-Motors","Large Office Motors",0,6.4837242160539127E-2,0.12919993965237686,0.19195497588620833,0.25414386914361869,0.31460262844071846,0.37267102476608804,0.42835246387321985,0.48314012431114256,0.53713856608872212,0.59093704969428995,0.64386144019437441,0.69639460233193862,0.74719394299932385,0.79561986644438243,0.84192863051174849,0.88803559092239803,0.93306316617745522,0.97747113403155084,1.0206853752603422,1.0622008615331409,1.1021402426489424,1.1410281545075345,1.1792080497914976,1.2162963313209196,1.2523219183993792,1.2870618944855143,1.3202873204741723,1.3524549126341132,1.3835301812700851,1.3902823124443642,1.3967436819891288,1.4029268107400998,1.4088436803582538,1.4145057565478749,1.4199240112747851,1.4251089440278091,1.4300706021646743,1.4348186003817702,1.4393621393454983,1.4437100235213147,1.4478706782350146,1.4518521659993207,1.4556622021374126,1.4593081697336727,1.4627971339406203,1.4661358556697568,1.4693308046928539,1.4723881721790713,1.4753138826921979,1.4781136056712665,1.4807927664167866,1.4833565566038871,1.4858099443427393,1.4881576838057557,1.4904043244402212,1.4925542197842074,1.4946115359028544,1.4965802594613684,1.4972179840815087,1.4978282468759012,1.4984122304112053,1.4989710663301565,1.4995058375444641,1.5000175803332749,1.5005072863512756,1.5009759045503195,1.5014243430183041,1.5018534707388635,1.5022641192752841,1.5026570843819065]
[null,null,null,null,null,null,null,null,null,null,null,"Commercial-large Office-OffEquip","Large Office Office Eqpmt",0,6.1886152468554938E-2,0.12344886860234272,0.18344099938858774,0.24293150837149077,0.30082714376618658,0.35646571748092115,0.40982475657746281,0.46233656415626667,0.51416841430965421,0.56587892292296704,0.61675028370779195,0.66735203460337711,0.71627667203418632,0.76299361601061877,0.8076606510741563,0.85213502270054675,0.89559135213826757,0.93852675472823743,0.98028284675688615,1.0204333310259202,1.0591234833779568,1.0967663159815626,1.1337026685843952,1.1696135283771139,1.2044828595027106,1.2381383036881335,1.2703450245159698,1.3014929051834772,1.3316034354882855,1.3377620074337553,1.3436553777165015,1.3492949665038185,1.3546917021854614,1.3598560425506698,1.3647979950532618,1.3695271362040675,1.3740526301282836,1.3783832463237058,1.382527376654253,1.3864930516117147,1.3902879558772283,1.3939194432126478,1.3973945507106569,1.40072001243124,1.4039022724509365,1.4069474973501677,1.4098615881628291,1.412650191811309,1.4153187120490889,1.4178723199321317,1.4203159638393499,1.422654379061568,1.4248920969775662,1.4270334538349807,1.4290825991530809,1.431043503763703,1.4329199675059252,1.4347156265893914,1.4352982047098237,1.4358556957341608,1.4363891799679762,1.4368996911965077,1.4373882186879254,1.4378557091103348,1.4383030683662288,1.4387311633479456,1.4391408236175309,1.4395328430142635,1.4399079811929549,1.4402669650960089]
[null,null,null,null,null,null,null,null,null,null,null,"Commercial-large Office-Process","Large Office Process",0,6.2704756226227107E-2,0.12505323398547941,0.18578529834157531,0.24597748189867547,0.3045474375808222,0.3608341582688494,0.41481300583460506,0.46791019099375086,0.52030334067448647,0.57254911948745535,0.62392624570766242,0.67501620379950944,0.72440485620852035,0.77157640495666424,0.81667762526066068,0.86155954866912943,0.90540527167646501,0.94871712175723355,0.99082698129070046,1.0313190262862659,1.0703437991552287,1.1083001531093142,1.1455302234798936,1.1817237691789781,1.2168595605604535,1.2507725370743652,1.2832282615449457,1.3146086694105144,1.3449436777309591,1.3513611620648192,1.3575022953986564,1.3633789780147687,1.3690025977431057,1.3743840520285957,1.3795337690482035,1.3844617279186415,1.3891774780338932,1.3936901575700191,1.3980085111931064,1.4021409070046731,1.4060953527573683,1.4098795113723877,1.4135007157886741,1.4169659831726804,1.420282028516227,1.4234552776488074,1.4264918796895543,1.4293977189629963,1.4321784264016968,1.4348393904578696,1.4373857675451163,1.4398224920305198,1.4421542857964562,1.4443856673906537,1.4465209607822302,1.4485643037406766,1.4505196558540223,1.4523908062017219,1.452979030144306,1.4535419238692666,1.454080578151526,1.4545960367948361,1.4550892986544632,1.4555613195727666,1.45601301423143,1.4564452579239309,1.4568588882516829,1.4572547067471393,1.4576334804270019,1.4579959432785452]
[null,null,null,null,null,null,null,null,null,null,null,"Commercial-large Office-Refrig","Large Office Refrigeration",0,6.042290455911549E-2,0.12059521954661888,0.17921750598526243,0.23737266214860117,0.29399712949896695,0.34842907997116918,0.40063411385402786,0.45201674790321072,0.5027737414076674,0.55344818016324082,0.60330112855782747,0.65294495408174458,0.70093774678723175,0.74680116418283571,0.79064810407146657,0.83431088875543513,0.87698600896515311,0.91918850235021432,0.96022081713500362,0.9996896389000024,1.0377555619962417,1.0747784292047735,1.1110971270179706,1.1464232985535245,1.1807189901211537,1.2138360665512036,1.2455367504917505,1.2761792356345403,1.3058118135813337,1.3116712624532065,1.3172783905602621,1.3226440633899803,1.3277786785380361,1.3326921858567495,1.3373941067359014,1.3418935525532714,1.346199242330659,1.3503195196295947,1.354262368719485,1.3580354300495239,1.3616460150543455,1.3651011203221175,1.3684074411525216,1.3715713845308983,1.374599081543699,1.3774963992592981,1.3802689520971916,1.3829221127076163,1.3854610223826636,1.3878906010190728,1.390215556652,1.3924403945782462,1.3945694260866157,1.396606776812328,1.3985563947316704,1.4004220578123805,1.402207381334591,1.4039158248965151,1.4044701231414261,1.4050005520839246,1.4055081395887079,1.4059938692583569,1.4064586823393608,1.4069034795460631,1.4073291228060654,1.4077364369304692,1.4081262112121953,1.408499200955474,1.4088561289394728,1.4091976868188976]
[null,null,null,null,null,null,null,null,null,null,null,"Commercial-large Office-Vent","Large Office Ventilation",0,6.5809646864209259E-2,0.13110377842723647,0.19470030913886255,0.25766625473697818,0.31887420232043728,0.37766820403762558,0.43404459191304923,0.48946000815003543,0.54407192484430977,0.59844401073335995,0.65188133783598823,0.70492941487779071,0.75619455571031791,0.80512030116086164,0.85190408933051864,0.89843204666655996,0.94385950520469863,0.98866974519861461,1.0322374041426456,1.0740972025554978,1.1144110135116094,1.1536279631372863,1.1920887918152769,1.2294548776279484,1.265728029496084,1.3007197444180507,1.3341992362615773,1.3665813931480364,1.3978704316001023,1.4050375062185054,1.4118959508294175,1.4184590557202426,1.4247395388693573,1.4307495705909983,1.4365007971188843,1.4420043631742778,1.447270933562214,1.4523107138377511,1.4571334700822842,1.461748547828249,1.4661648901688851,1.470391055088154,1.4744352320443923,1.4783052578398357,1.4820086318067671,1.4855525303397159,1.4889438208018677,1.492189074832635,1.4952945810821732,1.4982663573975206,1.5011101624839776,1.5038315070643191,1.506435664557469,1.5089276812973254,1.5113123863115419,1.5135944006792132,1.5157781464855973,1.5178678553912279,1.5185012806535552,1.5191074292299449,1.5196874757145282,1.5202425441208283,1.5207737100598715,1.521282002824506,1.5217684073839648,1.5222338662925377,1.5226792815160526,1.5231055161797034,1.5235133962406129,1.5239037120883734]
[null,null,null,null,null,null,null,null,null,null,null,"Commercial-Misc. Com-AirComp","Other Compressed Air",0,6.4638492780011575E-2,0.12881417362713538,0.19138697611646763,0.25339871248174056,0.31368678469706879,0.37159304868168247,0.42712141784311042,0.48175990647391342,0.53561631636694218,0.58927852323959007,0.64206737076081954,0.69447428798718969,0.74514969868678493,0.79346228824508169,0.83965903735322545,0.88565814285685718,0.93058055543528617,0.97489152568681714,1.0180111357341421,1.0594356210529501,1.0992911662983436,1.138097437426443,1.17619590028688,1.2132074970124325,1.249157826110679,1.2838273986345283,1.3169872033523904,1.3490888948653741,1.3801014827035119,1.3868102261714623,1.3932300763800274,1.3993734737087977,1.4052523228272382,1.410878015763545,1.4162614539801064,1.4214130694983471,1.4263428451138882,1.4310603337412005,1.4355746769252313,1.4398946225558829,1.4440285418196641,1.4479844454213688,1.4517699991072104,1.4553925385194992,1.4588590834116417,1.4621763512510122,1.465350770236056,1.4683884917528442,1.4712954022952254,1.4740771348716666,1.4767390799208926,1.4792863957574727,1.4817240185675968,1.4840566719744144,1.4862888761914648,1.4884249567819436,1.4904690530407747,1.4924251260157331,1.4930588876098394,1.4936653580348216,1.4942457125084887,1.4948010756411845,1.4953325236150561,1.4958410862694786,1.4963277490966773,1.4967934551514128,1.4972391068784325,1.4976655678612265,1.4980736644954791,1.4984641875904576]
[null,null,null,null,null,null,null,null,null,null,null,"Commercial-Misc. Com-Cook","Other Cooking",0,6.4862960413804002E-2,0.12925797109600154,0.19201169261970122,0.25417915933738533,0.31462562093862301,0.37269205659760835,0.42837463844554913,0.48314094795275575,0.53712492125067846,0.59090381494698085,0.64378701034070285,0.69629703720993852,0.74706488705929042,0.795494092516003,0.8418051596421523,0.88788986170268558,0.93289203988135772,0.97728677431870137,1.02047163635548,1.0619698488204419,1.1019163805593686,1.1407921152150358,1.1789401783610121,1.2160021430226509,1.2519926938408015,1.2867062436610199,1.3199144034870454,1.352047545791675,1.3830929662864682,1.3899404204049339,1.3964930080781068,1.4027634269041098,1.4087638276945429,1.4145058380203164,1.4200005847435446,1.4252587155791698,1.4302904197280932,1.4351054476218001,1.4397131298167347,1.4441223950750453,1.4483417876667302,1.4523794839267157,1.4562433080989508,1.4599407474982184,1.4634789670190491,1.4668648230198438,1.4701048766091209,1.4732054063596256,1.4761724204749411,1.4790116684321806,1.4817286521233191,1.484328636516753,1.4868166598597519,1.4891975434415692,1.4914759009361309,1.4936561473424104,1.4957425075398068,1.4977390244751143,1.4983578103821336,1.4989499500060754,1.4995165907945367,1.5000588307834948,1.5005777207250814,1.5010742661237289,1.5015494291846356,1.5020041306783263,1.5024392517249201,1.502855635501565,1.5032540888763448,1.5036353839718279]
[null,null,null,null,null,null,null,null,null,null,null,"Commercial-Misc. Com-Cool","Other Cooling",0,9.2167947488068433E-2,0.18243086745872505,0.27000882766495804,0.35612921236306638,0.43930173681049256,0.51894660160821848,0.5952678112124552,0.66980974187239373,0.74277043778892737,0.81465350746323906,0.88486164211130358,0.9539831778889174,1.0204163377395252,1.0836347623687934,1.1440551116460431,1.2039123650035002,1.2621154116675011,1.3190988875910636,1.374406079910766,1.4271826114159281,1.4779804329420392,1.5273987497532491,1.5756758231721097,1.6224525093648368,1.6677622526346094,1.7113918730163422,1.7531192427448969,1.7934809487066463,1.832389240298802,1.8465846194468967,1.8601687143254559,1.8731678481805365,1.8856072107212836,1.8975109069325249,1.9089020037853874,1.919802574936452,1.930233743502064,1.9402157229906882,1.9497678564726248,1.958908654062995,1.9676558287906218,1.9760263309223225,1.984036380809117,1.9917015003180116,1.9990365429102552,2.0060557224243638,2.0127726406196831,2.0192003135338643,2.0253511967053295,2.0312372093096025,2.0368697572562748,2.0422597552913686,2.0474176481479174,2.0523534307857632,2.057076667759778,2.0615965117540509,2.0659217213179484,2.0700606778384243,2.0709610998344337,2.0718227476775044,2.0726472910680034,2.0734363278053225,2.0741913868840971,2.0749139314570875,2.0756053616704748,2.0762670173770656,2.0769001807326548,2.0775060786805875,2.0780858853293269,2.0786407242276419]
[null,null,null,null,null,null,null,null,null,null,null,"Commercial-Misc. Com-ExtLight","Other Exterior Lights",0,6.0585886181822347E-2,0.12092688694588383,0.17964550207903077,0.23778101619133127,0.29445343895074344,0.34897239025922711,0.40127760719213484,0.45268298100642862,0.50350473562500941,0.55420773228666231,0.60406102099482439,0.65374208681316848,0.7017883382393526,0.74782379942833144,0.79187408020332439,0.83561327916501971,0.87838152226814137,0.9207180312801293,0.96181313944537905,1.0014003451637721,1.0396606496455543,1.0767782482576558,1.1131307691697685,1.148497447380485,1.1827976343397819,1.2159369240906528,1.2476937447639385,1.2783240466825707,1.307968039920006,1.3141255087123749,1.3200178233462208,1.3256564019432024,1.3310521709355294,1.3362155862391916,1.3411566535154233,1.3458849475596644,1.3504096308555886,1.3547394713301573,1.3588828593440989,1.3628478239507413,1.3666420484547055,1.3702728853006041,1.3737473703206027,1.3770722363684484,1.3802539263663871,1.3832986057902517,1.3862121746169163,1.3890002787572651,1.3916683209968337,1.3942214714653201,1.3966646776552591,1.3990026740092678,1.401239991094444,1.4033809643816937,1.4054297426470044,1.4073902960109379,1.4092664236319272,1.4110617610682805,1.4115918493815707,1.4120991109253891,1.4125845286706697,1.4130490432594551,1.4134935548276708,1.4139189247494084,1.414325977306095,1.4147155012837855,1.4150882515016712,1.4154449502747675,1.4157862888136157,1.4161129285637097]
[null,null,null,null,null,null,null,null,null,null,null,"Commercial-Misc. Com-Heat","Other Heating",0,7.7290927232123233E-2,0.15359404874425436,0.22775628262609585,0.30063206637376005,0.37159977854872439,0.4398949769760731,0.50547950822467025,0.56960029788922384,0.63257928783791939,0.69496444788658929,0.75619940097219318,0.81661640537987623,0.87525705643487095,0.93157998473837711,0.98555769259736603,1.0386083565482107,1.090390017478803,1.1412868442372011,1.190600055008904,1.2383198287350328,1.2842260674875674,1.3286220455723878,1.3720080770110972,1.4140395518180058,1.4547965289206986,1.4940461871365189,1.5316346256639837,1.5678941000032771,1.6028609739796467,1.6131937075221003,1.6230814908163145,1.6325434843992943,1.6415980237131507,1.6502626546355013,1.6585541674798558,1.6664886295318697,1.6740814161845146,1.6813472407325001,1.6883001828836823,1.6949537160427086,1.7013207334197673,1.7074135730150386,1.7132440415272598,1.7188234372327351,1.7241625718791227,1.7292717916364313,1.7341609971458176,1.7388396627050389,1.7433168546277387,1.7476012488121404,1.7517011475531947,1.7556244956307587,1.7593788957049825,1.7629716230487373,1.7664096396456319,1.7696996076809377,1.7728479024515653,1.7758606247201085,1.7769202060445184,1.7779341594650062,1.7789044498195401,1.7798329573358405,1.7807214812748837,1.7815717434175091,1.7823853914008825,1.7831640019112875,1.7839090837394267,1.7846220807041528,1.7853043744503025,1.7859572871260436]
[null,null,null,null,null,null,null,null,null,null,null,"Commercial-Misc. Com-HotWater","Other Hot Water",0,6.3441827342367141E-2,0.12651602277967819,0.18795041645378344,0.24884501450586594,0.30809248996748428,0.36503232534217772,0.4196229029487028,0.47333825387258432,0.52628030765453548,0.57907610541705212,0.63098662462083244,0.68255202292236539,0.73242328618091013,0.78004813747806645,0.82555717479468482,0.87083799281630503,0.91505104907002333,0.95868709208455638,1.0011200715971431,1.041964563888055,1.0812725243823293,1.1195186558989438,1.157041917849271,1.1935069047916091,1.2289195442184691,1.2630889304881503,1.2957686714771297,1.3273892877883953,1.3579380517016908,1.3644883611872383,1.3707565999293889,1.3767549145151792,1.3824949284728731,1.3879877647960253,1.3932440674976063,1.3982740222359613,1.4030873760525691,1.4076934562598491,1.4121011885156194,1.4163191141192275,1.4203554065628716,1.4242178873701865,1.4279140412527844,1.4314510306141222,1.4348357094287993,1.4380746365241843,1.441174088290103,1.4441400708412213,1.4469783316556886,1.4496943707125951,1.4522934511498262,1.4547806094629661,1.4571606652650138,1.4594382306258249,1.4616177190093762,1.4637033538261717,1.4656991766173635,1.4676090548864467,1.4682133281904857,1.4687915801560734,1.4693449313193152,1.4698744539635658,1.4703811741972983,1.4708660739424968,1.4713300928374238,1.4717741300574496,1.4721990460574741,1.4726056642393159,1.4729947725472983,1.4733671249951283]
[null,null,null,null,null,null,null,null,null,null,null,"C-Oth-Lgt-LPD Int-All-All-C","Other Interior Lights",0,6.5549121624921394E-2,0.13059895736751614,0.19399134094156151,0.25677390434986958,0.31780840456519227,0.37643492169355508,0.43265183049091366,0.48793722097733894,0.54241647998944531,0.59667032132918552,0.65001620283915684,0.70296269099245656,0.75415333930182049,0.80297780623790049,0.84966908585771139,0.89612263433560091,0.94148038834951042,0.98621176288389734,1.0297236311842999,1.0715332748223445,1.1117706194284718,1.1509282121060587,1.1893521458842462,1.2266766948148833,1.2629215088912846,1.2978763409228116,1.331312975797845,1.3636695131380077,1.3949285145454045,1.4019412907406856,1.4086520813581793,1.4150738905615228,1.4212191625264448,1.4270998055550781,1.4327272151518564,1.4381122961057113,1.4432654836213621,1.4481967635406447,1.4529156916930686,1.4574314124130914,1.4617526762600033,1.4658878569747511,1.4698449677065675,1.4736316765408415,1.4772553213583286,1.4807229240544886,1.4840412041465076,1.4872165917943727,1.4902552402612292,1.4931630378371685,1.4959456192495506,1.4986083765819738,1.5011564697230486,1.5035948363652252,1.50592820157305,1.5081610869393891,1.5102978193473695,1.5123425393550061,1.5129752878384963,1.5135807887796353,1.5141602155175673,1.5147146908648705,1.5152452892833428,1.5157530389660914,1.5162389238299656,1.5167038854221897,1.5171488247448923,1.5175746040010669,1.5179820482653488,1.5183719470828434]
[null,null,null,null,null,null,null,null,null,null,null,"Commercial-Misc. Com-Misc","Other Other",0,6.507810734995674E-2,0.1296764442936697,0.19262770888349767,0.25498248595916306,0.31561054003664535,0.37385102008537469,0.42970099407114548,0.48462781038301656,0.53876719977388576,0.5926934143520507,0.6457231315154548,0.69836998436048725,0.74927359521490422,0.79783201721366748,0.84426936562154709,0.89047323532107958,0.93559295202898218,0.98010009593017267,1.0233925954073848,1.0649950244618245,1.1050410606331398,1.1440094449888991,1.1822481944311181,1.2193963250731128,1.2554692097963147,1.2902612996514775,1.3235449650138125,1.3557502400895647,1.3868660239996145,1.3937678221369851,1.4003724136560003,1.4066925969277848,1.4127406191974352,1.4185282003167179,1.4240665554547876,1.4293664168309306,1.4344380545114501,1.4392912963109907,1.4439355468368666,1.4483798057133028,1.4526326850208975,1.4567024259851029,1.4605969149460651,1.4643236986407655,1.4678899988270819,1.4713027262781022,1.4745684941738153,1.4776936309161248,1.4806841923920189,1.4835459737086638,1.486284520423157,1.4889051392887003,1.4914129085380243,1.4938126877239801,1.496109127136378,1.4983066768133138,1.5004095951644485,1.5024219572229507,1.5030475040018858,1.5036461133597188,1.5042189452810897,1.5047671097991482,1.5052916691465728,1.5057936398139644,1.5062739945196024,1.5067336640943756,1.5071735392855461,1.5075944724828385,1.5079972793701997,1.5083827405064303]
[null,null,null,null,null,null,null,null,null,null,null,"Commercial-Misc. Com-Motors","Other Motors",0,6.4220799236228601E-2,0.12800391064465591,0.19015905026927155,0.2517573288184905,0.31164749206750519,0.3691801953100361,0.42435132602490511,0.47862377444572274,0.5321332837493683,0.58545868510500487,0.63789582604634432,0.68998436562211296,0.74033289027684535,0.78836388999647267,0.83428147537785491,0.87999856211399263,0.92464245975048265,0.9687006815883491,1.0115581571837886,1.0527350978655885,1.0923787111028114,1.1309689666196383,1.168838063186999,1.2056366865335091,1.2413704251719626,1.275842606655184,1.30882121002987,1.3407323870470584,1.3715668256139557,1.3782582171655509,1.3846614626694698,1.3907889703287222,1.396652614021787,1.4022637563118008,1.4076332704649244,1.4127715615205447,1.4176885864541531,1.4223938734719599,1.4268965404746459,1.4312053127260198,1.4353285397608277,1.4392742115644714,1.4430499740559968,1.4466631439043462,1.4501207227065944,1.4534294105556358,1.456595619023618,1.4596254835862803,1.4625248755122733,1.465299413240496,1.4679544732675032,1.470495200566075,1.4729265185551386,1.4752531386403671,1.4774795693439351,1.4796101250411295,1.4816489343207411,1.4835999479854414,1.4842148624992324,1.4848032974406593,1.4853663930783885,1.4859052405786075,1.4864208841194868,1.4869143229145869,1.4873865131491324,1.4878383698329081,1.4882707685733632,1.4886845472723633,1.4890805077498754,1.489459417297734]
[null,null,null,null,null,null,null,null,null,null,null,"Commercial-Misc. Com-OffEquip","Other Office Eqpmt",0,6.4658094028880592E-2,0.12885560842364099,0.19143255104976015,0.25343525455767918,0.31372181585987574,0.37163273792218315,0.42716460969861053,0.48179511697328442,0.53564678846389546,0.58930069719345402,0.6420725355928073,0.69446819269020232,0.74513141578349062,0.79345070237198378,0.83965666156554908,0.88564748047948572,0.93056170505103464,0.97486950727526001,1.0179756218492393,1.0593971578141463,1.0992615737904665,1.1380631341357041,1.1761468662619712,1.2131461717699712,1.2490792881068224,1.2837362602280604,1.316887541779779,1.3489715536687048,1.3799700801072161,1.3867325960118864,1.3932039030976953,1.3993965414573211,1.405322511179451,1.4109932956025417,1.4164198835672219,1.4216127907104565,1.4265820798427384,1.4313373804477929,1.4358879073425819,1.4402424785337675,1.4444095323052371,1.4483971435698011,1.4522130395167523,1.4558646145856053,1.4593589447950339,1.4627028014547743,1.4659026642870616,1.4689647339830305,1.4718949442184073,1.4746989731517823,1.4773822544277393,1.479949987706167,1.4824071487381552,1.4847584990080003,1.4870085949600051,1.4891617968279525,1.4912222770843613,1.4931940285259009,1.4938198161614125,1.4944186560040069,1.4949917084849589,1.495540084064817,1.4960648453852552,1.4965670093282586,1.4970475489866351,1.4975073955496747,1.4979474401076074,1.4983685353783565,1.4987714973599342,1.4991571069116834]
[null,null,null,null,null,null,null,null,null,null,null,"Commercial-Misc. Com-Process","Other Process",0,6.2221589283218914E-2,0.12410502814293795,0.18440497130065917,0.24418915761403287,0.30236591645101429,0.35827366518668163,0.41189052885847632,0.46464886752138634,0.5167173207937571,0.56865389642880293,0.61974161787213,0.67055078675080049,0.71967399941135302,0.76658168859151865,0.8114316618450047,0.85608065314500092,0.89970436040472013,0.94280055994022127,0.98471038520962095,1.0250074841010561,1.0638387027129221,1.1016160423259946,1.1386809544334449,1.1747148886349639,1.2097019445735184,1.2434701077986496,1.2757850877129417,1.3070359845748836,1.3372455680455391,1.343497982213145,1.3494811536653994,1.3552066765862172,1.3606856458884351,1.3659286787135241,1.3709459350054751,1.3757471371987298,1.3803415890583037,1.3847381937086134,1.3889454708859434,1.3929715734479817,1.3968243031724203,1.4005111258752325,1.4040391858779233,1.4074153198517902,1.4106460700660171,1.4137376970652771,1.4166961918014112,1.4195272872426878,1.4222364694831438,1.4248289883735323,1.4273098676944784,1.4296839148915557,1.4319557303911514,1.4341297165151665,1.4362100860118316,1.4382008702191666,1.4401059268769036,1.4419289476020105,1.4425151110889525,1.4430760330860262,1.4436128005473408,1.4441264536203691,1.4446179876615444,1.4450883551650615,1.4455384676086185,1.4459691972196778,1.4463813786656676,1.4467758106713995,1.4471532575668367,1.4475144507682121]
[null,null,null,null,null,null,null,null,null,null,null,"Commercial-Misc. Com-Refrig","Other Refrigeration",0,6.0737262647040255E-2,0.1212067106475143,0.18011248754168316,0.23854540152661399,0.29542701059131449,0.35010040324601022,0.40253527162766944,0.45413903850929654,0.50510740971684287,0.55598351396910073,0.60602535565459581,0.65585239100000536,0.70401027242182523,0.75002524941709803,0.79401266107445168,0.83782000722638517,0.88063065873890767,0.92296272613996977,0.96412106363091898,1.0037003369091502,1.0418734644923793,1.079004214208735,1.1154264697636347,1.1508531280160492,1.1852447506514914,1.2184546626262076,1.2502434306805537,1.2809719528242955,1.3106866328766202,1.3166335129196942,1.3223243072192863,1.3277700433911448,1.3329812741776124,1.3379680978967201,1.3427401780106987,1.3473067618518266,1.3516766985419011,1.3558584561400586,1.3598601380521711,1.3636894987336183,1.3673539587158645,1.3708606189859567,1.3742162747468101,1.3774274285849475,1.3805003030712035,1.3834408528188169,1.3862547760222748,1.3889475254992676,1.3915243192571558,1.393990150604417,1.3963497978266766,1.3986078334460639,1.4007686330818412,1.4028363839294749,1.4048150928745788,1.4067085942574535,1.4085205573032666,1.4102544932322745,1.410808853067403,1.4113393409479087,1.4118469848526991,1.4123327684936466,1.4127976332218259,1.413242479851663,1.4136681704065306,1.4140755297891794,1.4144653473802307,1.4148383785678396,1.4151953462114844,1.4155369420427235]
[null,null,null,null,null,null,null,null,null,null,null,"Commercial-Misc. Com-Vent","Other Ventilation",0,6.6996944335130523E-2,0.13340325590292249,0.19806324895203262,0.26205898587222948,0.32424237196786782,0.3839621890623614,0.44122764237596707,0.49748956686372431,0.55291805708894792,0.60806698342755827,0.66224937078644641,0.71601397977831416,0.76795440134479143,0.81751612924566597,0.86490920444060493,0.91203415660895448,0.95803533454136069,1.0033914603911851,1.047486305075263,1.0898325268955182,1.1306182698298481,1.1702948282536076,1.2091980543067373,1.2469880237451416,1.2836684393282329,1.3190483895364205,1.3529000816443721,1.3856420816792228,1.4172743524782614,1.4247571687246781,1.4319177584341676,1.4387699973906172,1.4453271638561189,1.4516019643015752,1.4576065580292845,1.4633525807352266,1.4688511670567022,1.4741129721490231,1.4791481923330627,1.4839665848536745,1.4885774867872743,1.4929898331352167,1.4972121741380324,1.5012526918440761,1.5051192159646922,1.5088192390466215,1.5123599309910514,1.5157481529474435,1.5189904706090631,1.5220931669359716,1.5250622543301424,1.5279034862862866,1.5306223685409703,1.5332241697416245,1.5357139316561259,1.5380964789427303,1.5403764284992894,1.5425581984098722,1.543195089092873,1.5438045538612943,1.5443877737353822,1.5449458788780497,1.5454799507849086,1.5459910243799888,1.5464800900212141,1.5469480954195158,1.547395947475307,1.5478245140358726,1.5482346255770838,1.5486270768126926]
[null,null,null,null,null,null,null,null,null,null,null,"Commercial-Resturant-AirComp","Restaurant Compressed Air",0,6.6605551618241846E-2,0.13266403575942748,0.19701774242901479,0.26072171274094508,0.32263594998173867,0.38210401268051292,0.43912455761610569,0.49517930840123459,0.55039280824555903,0.60534965254409301,0.65936705202344159,0.7129561864499645,0.76475995135787833,0.8141687264018953,0.86141970236099297,0.90841060449558209,0.95428201367249443,0.99950278674329485,1.0434833705301181,1.0857410203479525,1.1264060108194616,1.1659753498147771,1.204791989415259,1.2424927968743655,1.2790972778555292,1.3143959958881246,1.3481613343606935,1.3808332987708052,1.4123940031412576,1.4197048913395429,1.42670095660106,1.4333957558943777,1.4398022623951603,1.4459328906255742,1.4517995205111376,1.457413520401629,1.4627857691006638,1.4679266769466301,1.4728462059858325,1.4775538892769351,1.4820588493641147,1.4863698159547172,1.4904951428356765,1.4944428240614749,1.4982205094450141,1.501835519381415,1.5052948590334734,1.5086052319062566,1.5117730528371496,1.5148044604265207,1.5177053289330964,1.5204812796570919,1.5231376918331643,1.5256797130542861,1.528112269246747,1.5304400742156095,1.532667638779114,1.5347992795097405,1.5354331876506109,1.5360397983117309,1.5366202869826591,1.5371757785337865,1.5377073493961098,1.5382160296471366,1.5387028050069709,1.539168618748439,1.5396143735249637,1.540040933119724,1.5404491241194946,1.5408397375164045]
[null,null,null,null,null,null,null,null,null,null,null,"Commercial-Resturant-Cook","Restaurant Cooking",0,6.7348963004776899E-2,0.13411516737999252,0.19915374913911191,0.26351897884377562,0.32606500807441452,0.3861351111835471,0.44373125520825374,0.50034071562559623,0.5560850529893635,0.61155090654977962,0.66606019671980576,0.72011824940553637,0.77237266267939142,0.82220401023645373,0.86986222278784942,0.91724769830885966,0.9634975408460712,1.0090763717125852,1.0534048498223005,1.0959920781007082,1.1369684496963968,1.1768400824753142,1.2159508966831987,1.2539318057350024,1.2908075745629954,1.3263635347128691,1.3603731226157145,1.3932831586351411,1.4250699515630336,1.4325677604621347,1.4397426972076861,1.4466086653852472,1.4531789698613822,1.4594663425658179,1.4654829671633636,1.4712405026634077,1.4767501060127319,1.4820224537154345,1.4870677625218487,1.4918958092265513,1.4965159496138263,1.5009371365872952,1.5051679375188445,1.5092165508504705,1.5130908219812134,1.5167982584699622,1.5203460445835977,1.5237410552186557,1.5269898692234956,1.5300987821467873,1.533073818437019,1.5359207431166662,1.5386450729536492,1.541252087151719,1.5437468375804939,1.5461341585649677,1.5484186762534595,1.5506048175821596,1.5512415800803276,1.5518509221838379,1.5524340246752353,1.5529920174899696,1.5535259819059835,1.5540369526390108,1.5545259198476495,1.5549938310520885,1.5554415929702121,1.5558700732746362,1.5562801022740855,1.5566724745223621]
[null,null,null,null,null,null,null,null,null,null,null,"Commercial-Resturant-Cool","Restaurant Cooling",0,8.3538457306076577E-2,0.16563050980801652,0.2453667056940862,0.32393285578179648,0.39990943082225172,0.47271105495514487,0.54247436205428312,0.61074162548366828,0.67767524756802056,0.74380958703093347,0.80849233893509631,0.87232674282487677,0.9337393743561696,0.99219932621653695,1.0480658148723871,1.1035084584811692,1.1574591598391875,1.2103903017654303,1.2617990274012931,1.3109234034671904,1.3582118525821767,1.404230326258358,1.4492411282698465,1.4928909785117479,1.5351971478814455,1.5759608360233741,1.6149447476414966,1.652657581972826,1.6890381330286581,1.7009464908746847,1.7123420486220786,1.723246888571738,1.7336821421120816,1.7436680306674344,1.7532239048830829,1.7623682821229381,1.7711188823524644,1.7794926624764131,1.7875058491978952,1.7951739704624714,1.8025118855481901,1.8095338138598827,1.816253362483512,1.8226835525539706,1.8288368444874239,1.8347251621270921,1.8403599158492625,1.8457520246743062,1.8509119374255441,1.8558496529769677,1.860574739629048,1.8650963536501775,1.8694232570196792,1.8735638344067622,1.8775261094183249,1.881317760147093,1.8849461340502203,1.8884182621871846,1.889208352625217,1.8899644200300327,1.8906879295083252,1.8913802830760693,1.8920428223753458,1.8926768312741751,1.8932835383543944,1.8938641192924035,1.8944196991373883,1.8949513544914407,1.8954601155957971,1.8959469683272385]
[null,null,null,null,null,null,null,null,null,null,null,"Commercial-Resturant-ExtLight","Restaurant Exterior Lights",0,5.9372818057804977E-2,0.11855946307933969,0.17615930276939915,0.23322009706489324,0.28886269675303911,0.342398318365358,0.39376207357834075,0.44425977181530785,0.49421163027090598,0.54408203771392782,0.59312774347177333,0.64204043437111202,0.68934302196449593,0.73467859671796709,0.77805322470491545,0.821140696655837,0.8632818332921246,0.90502369239177771,0.94554290916145622,0.98458066974600822,1.0223232734764596,1.0589400721075484,1.0948055214728449,1.1297091306092908,1.1635607214115666,1.1962751274180408,1.2276276263899497,1.2578652504174213,1.2871345926972313,1.2929879601528289,1.2985892687227785,1.3039493726174674,1.3090786586410927,1.3139870663192035,1.3186841071595008,1.3231788830832303,1.3274801040628756,1.3315961050003353,1.3355348618782872,1.3393040072160403,1.342910844859823,1.3463623641361702,1.3496652533958324,1.3528259129744566,1.3558504675951497,1.3587447782369613,1.3615144534922834,1.3641648604351753,1.3667011350216747,1.3691281920422482,1.3714507346456679,1.3736732634527682,1.3758000852777446,1.3778353214738941,1.3797829159199702,1.3816466426626268,1.3834301132297624,1.3851367836289352,1.3856519177139983,1.3861448689915705,1.3866165927021659,1.3870680029515394,1.3874999744820404,1.3879133443676874,1.3883089136362492,1.3886874488214758,1.3890496834484867,1.3893963194551957,1.3897280285525251,1.390045453526046]
[null,null,null,null,null,null,null,null,null,null,null,"Commercial-Resturant-Heat","Restaurant Heating",0,8.0509841922596637E-2,0.15986553665570741,0.23697470228645676,0.31266096038237834,0.3863723158612824,0.45732968456478218,0.52547792856985298,0.59206044629687471,0.65742123933442531,0.72208296088396229,0.78557028883255131,0.84811876324655711,0.90891823473927569,0.96728593614707525,1.0232731714166381,1.0782123076907604,1.1318208318467871,1.1844598211687531,1.2354668497679482,1.2848412382412597,1.3323244225294937,1.3781859164726484,1.4230172658704072,1.4664060119119025,1.508485153904747,1.5489770086821697,1.5877589701083115,1.6251520961381902,1.6612254093899679,1.6723359325957483,1.6829680122185047,1.6931422510919558,1.7028783648464545,1.7121952201139172,1.7211108710875658,1.7296425945073253,1.7378069231386741,1.745619677809821,1.7530959980692919,1.7602503715233311,1.7670966619099715,1.7736481359641729,1.7799174891260878,1.7859168701422745,1.7916579046075249,1.7971517174929321,1.802408954703848,1.8074398037095092,1.8122540132843046,1.8168609123989412,1.8212694282981152,1.8254881037997168,1.8295251138490967,1.8333882813604647,1.8370850923761279,1.8406227105729347,1.8440079911440419,1.8472474940829005,1.8483204968450937,1.8493472937467137,1.8503298745138146,1.8512701431904659,1.8521699218284098,1.8530309540178296,1.8538549082660785,1.85464338123091,1.8553979008144805,1.8561199291241177,1.8568108653055884,1.8574720482543645]
[null,null,null,null,null,null,null,null,null,null,null,"Commercial-Resturant-HotWater","Restaurant Hot Water",0,6.5302461833570538E-2,0.13013859246477513,0.19330342386894231,0.25587823449952202,0.31672271305329014,0.3751781379107193,0.43122042518805154,0.48634932987943791,0.54064622896217363,0.59474190264926396,0.64792562268545528,0.7006981242728666,0.75173603992688798,0.80043063821293281,0.84697358817707002,0.89327594426846635,0.93847268949751483,0.98303747994575896,1.0263851224316147,1.0680814170692425,1.1081839028618075,1.1472125209170625,1.1855113058329838,1.2227125341370226,1.2588434040146321,1.2936892493386027,1.3270095782435056,1.3592626031230315,1.3904137063683004,1.3973700438722405,1.4040268261726618,1.4103969527759359,1.4164927677072987,1.4223260834310907,1.4279082037409394,1.4332499456642396,1.4383616604233787,1.4432532534943252,1.4479342038014511,1.4524135820857822,1.4567000684822711,1.460801969340155,1.4647272333189916,1.4684834667915625,1.4720779485834961,1.4755176440781697,1.4788092187142208,1.4819590509018294,1.4849732443827948,1.4878576400583596,1.490617827307704,1.4932591548190381,1.4957867409542864,1.4982054836674428,1.5005200699958217,1.502734985142596,1.5048545211682174,1.5068827853075677,1.5075043397299042,1.5080991286508003,1.508668304651658,1.5092129706811865,1.5097341821926975,1.5102329491893585,1.5107102381813784,1.5111669740589098,1.5116040418842984,1.5120222886071584,1.5124225247055889,1.5128055257567186]
[null,null,null,null,null,null,null,null,null,null,null,"C-Res-Lgt-LPD Int-All-All-C","Restaurant Interior Lights",0,6.7298747526474523E-2,0.134017947037502,0.19899894803447216,0.26330302288651813,0.32579248456568877,0.38581047606847951,0.4433552961530382,0.49990895305696315,0.55560091144790014,0.61101407099336269,0.66546638181605433,0.71947336768597636,0.77167429023501755,0.82146360111214856,0.86908154096028967,0.91642100978813812,0.96262641480111388,1.0081653845385539,1.0524488193984363,1.0949961382172506,1.1359418105488019,1.1757779856088058,1.2148481169748599,1.2527918004268237,1.2896279369289354,1.3251488687044684,1.3591269645738946,1.3920016599371157,1.4237564975704393,1.4312714613412465,1.4384628142319711,1.445344491639363,1.4519298288713172,1.4582315869880196,1.4642619775303185,1.470032686183236,1.475554895420478,1.4808393061738194,1.4858961585693613,1.490735251770837,1.4953659629684215,1.4997972655498417,1.5040377464890002,1.5080956229858022,1.5119787583894408,1.515694677435985,1.5192505808298071,1.5226533591971008,1.5259096064385302,1.5290256325068838,1.532007475634495,1.5348609140341229,1.5375914770959678,1.5402044561025179,1.5427049144819918,1.545097697620244,1.5473874422501506,1.5495785854366642,1.5502096157068437,1.5508134724247189,1.5513913257432597,1.5519442954260738,1.5524734530172835,1.5529798239179626,1.5534643893731579,1.5539280883733451,1.5543718194740024,1.5547964425368324,1.5552027803959998,1.5555916204526195]
[null,null,null,null,null,null,null,null,null,null,null,"Commercial-Resturant-Misc","Restaurant Other",0,6.5584211199137127E-2,0.13067236199279056,0.19405617769965214,0.25680957274305033,0.31782297667436166,0.37643759535699101,0.43264009944874393,0.48788627049093802,0.54233141445374311,0.59654508248681981,0.64982696680881702,0.70272692292746741,0.75385673697686806,0.80265674317636593,0.84932411086556392,0.89572833217571657,0.94103548746829024,0.98572821062532368,1.0291804857945048,1.0709446049124236,1.1111648887387808,1.1502857662897643,1.1886499698507746,1.2259235924903431,1.26210562832337,1.2970101406895385,1.3304062359655022,1.3627054387814113,1.3939145411801672,1.4010480472165203,1.4078743687824085,1.4144067339172295,1.4206578010318909,1.4266396834382653,1.4323639728223558,1.437841761706653,1.4430836649452148,1.4480998402931209,1.4529000080901602,1.4574934700968962,1.4618891275196102,1.4660954982590495,1.4701207334164077,1.4739726330885208,1.4776586614828873,1.4811859613818026,1.4845613679836354,1.4877914221480688,1.4908823830709717,1.4938402404134623,1.4966707259086687,1.4993793244686748,1.5019712848131783,1.5044516296404544,1.5068251653603357,1.5090964914080691,1.5112700091570963,1.5133499304480313,1.5139599961507881,1.5145437910816559,1.5151024465178931,1.5156370450214691,1.516148622536853,1.5166381703984644,1.517106637251681,1.5175549308911227,1.5179839200197751,1.5183944359323611,1.5187872741262234,1.519163195842838]
[null,null,null,null,null,null,null,null,null,null,null,"Commercial-Resturant-Motors","Restaurant Motors",0,6.6302025447842861E-2,0.13206618984189952,0.19612853058256174,0.25955496400188038,0.32120375429324155,0.38041531802383477,0.43719388814752835,0.49301016764327293,0.54799881848394583,0.60273747377593734,0.65654401230465209,0.7099351283941685,0.76154322650433337,0.81076669844032778,0.85783890130766161,0.9046581784576776,0.95036710510897005,0.99543360418508475,1.0392653154337932,1.0813753942348829,1.121907086086537,1.1613466120766702,1.2000366310402273,1.2376176690502001,1.2741048911946897,1.3092930388975652,1.3429542580831231,1.3755252007961511,1.4069881715980845,1.4142268275605052,1.421153771065214,1.4277824251367057,1.4341256347744968,1.4401956918441534,1.4460043588964564,1.451562891960861,1.4568820623574203,1.4619721775694388,1.4668431012173035,1.471504272172198,1.4759647228467383,1.4802330966979729,1.4843176649766663,1.4882263427553204,1.4919667042659939,1.4955459975776433,1.4989711586414227,1.5022488247311638,1.5053853473050787,1.5083868043136097,1.5112590119772757,1.5140075360573391,1.5166377026411313,1.5191546084629424,1.5215631307804649,1.5238679368259411,1.5260734928503199,1.5281840727779554,1.5288093397565035,1.5294076813627695,1.5299802570625456,1.530528176392475,1.5310525011101106,1.5315542472513888,1.5320343870995019,1.5324938510689881,1.5329335295086879,1.5333542744270605,1.5337569011432068,1.534142189866792]
[null,null,null,null,null,null,null,null,null,null,null,"Commercial-Resturant-OffEquip","Restaurant Office Eqpmt",0,6.6622870049251715E-2,0.13269540900379379,0.19706034295731906,0.26077564112196056,0.32270158781793079,0.38217968338287478,0.43920869070028073,0.49526998144271123,0.55049118405530273,0.6054541407211752,0.65947738599592132,0.7130733225110828,0.76488160866155297,0.81429294141143194,0.86154993801408075,0.908545274968942,0.95442190748981126,0.99964587724664722,1.0436293597505244,1.08588859332742,1.1265576304948741,1.1661301295708038,1.2049492737496179,1.2426525341710337,1.2792591029213152,1.3145599598493094,1.3483272845971677,1.3810012383601391,1.412563479858655,1.4198834463348613,1.426888198943671,1.4335913114879866,1.4400057732528819,1.4461440141762267,1.4520179289354083,1.4576388999968259,1.4630178196728238,1.4681651112288028,1.473090749081414,1.4778042781269751,1.4823148322375599,1.4866311519606075,1.4907616014563467,1.494714184705858,1.4984965610211798,1.5021160598875165,1.5055796951663076,1.5088941786866819,1.5120659332516333,1.5151011050841228,1.5180055757372226,1.5207849734913852,1.5234446842609188,1.5259898620308074,1.5284254388440979,1.5307561343592084,1.5329864649956779,1.5351207526860793,1.5357444427609412,1.5363412753684647,1.5369124070503051,1.5374589445448894,1.5379819469320515,1.5384824276853166,1.5389613566358096,1.5394196618515923,1.5398582314360734,1.5402779152489741,1.540679526553185,1.5410638435907074]
[null,null,null,null,null,null,null,null,null,null,null,"Commercial-Resturant-Process","Restaurant Process",0,7.2098818912742418E-2,0.14335264353843205,0.21284663078763072,0.28157181354223321,0.34825240988282291,0.41223847111763834,0.47357496165964286,0.53386642221105696,0.59311556252615538,0.65195789381173697,0.70981063615105822,0.76698900785221458,0.8222917667335653,0.87487519593912566,0.92517722460878771,0.97521048219044959,1.0240175835750487,1.0719890591133268,1.1186937560303725,1.1635078787139592,1.2064948696366242,1.2483838551856103,1.2895235146904567,1.3294252572277758,1.3681893797219211,1.4055140787232503,1.4411813771921507,1.4757627163460689,1.5091336031807778,1.5175109451905171,1.5255275404151478,1.533198923405225,1.5405399597593659,1.5475648749307924,1.5542872817934019,1.5607202070207791,1.5668761163292741,1.5727669386340541,1.5784040891649442,1.5837984915868484,1.5889605991676179,1.593900415034383,1.5986275115576032,1.6031510489003975,1.6074797927691005,1.6116221313994383,1.6155860918112446,1.6193793553632125,1.6230092726378227,1.6264828776852969,1.6298069016541714,1.6329877858349129,1.6360316941418422,1.6389445250575643,1.6417319230630401,1.6443992895754567,1.6469517934150901,1.6493943808214377,1.6501153706412435,1.6508053130525411,1.6514655450250746,1.6520973459557287,1.6527019401477421,1.6532804991831618,1.6538341441931326,1.6543639480304251,1.6548709373484085,1.6553560945904979,1.6558203598939329,1.6562646329115738]
[null,null,null,null,null,null,null,null,null,null,null,"Commercial-Resturant-Refrig","Restaurant Refrigeration",0,6.0794339492840896E-2,0.12131844666880713,0.18028074098249669,0.23876501384955326,0.29570002123608891,0.3504259019283687,0.40291173072412406,0.45456530394369682,0.50558238981177595,0.55650489272269299,0.60659542223576879,0.65646728091530315,0.70467412992434708,0.75073653793220885,0.79477359345508825,0.83862445633235017,0.88147931098148058,0.92385273893851338,0.96505143881717037,1.0046727143102727,1.0428850039986477,1.0800510556470291,1.1165084503910152,1.1519676345073904,1.1863913888028728,1.2196308784581424,1.2514481596367424,1.2822038259747008,1.3119446738633793,1.3179011664336526,1.3236011593238663,1.3290556979747883,1.3342753521861972,1.3392702365990283,1.3440500302955178,1.3486239955553161,1.3530009958039269,1.3571895127882434,1.3611976630124698,1.3650332134662748,1.368703596675658,1.3722159251056893,1.3755770049430402,1.3787933492850026,1.3818711907605647,1.3848164936079925,1.3876349652323257,1.39033206726518,1.3929130261482945,1.3953828432613224,1.3977463046135024,1.4000079901179807,1.4021722824667637,1.4042433756234942,1.4062252829505089,1.4081218449859296,1.4099367368858537,1.4116734755460683,1.4122284690415408,1.4127595632955818,1.413267787462128,1.4137541263774831,1.4142195224687324,1.4146648775799755,1.4150910547199209,1.4154988797342229,1.415889142905804,1.4162626004862642,1.4166199761613456,1.4169619624532894]
[null,null,null,null,null,null,null,null,null,null,null,"Commercial-Resturant-Vent","Restaurant Ventilation",0,6.507061169568408E-2,0.12965814297017181,0.19255943083302798,0.25485706062283109,0.31541408417736216,0.37358381989164635,0.4293649294143918,0.48420245023514624,0.53826431373323902,0.59210535815559351,0.64501512132268202,0.69757113123070913,0.74834451823912584,0.79680460157799471,0.84313243900312562,0.88923032194257701,0.93423575593614305,0.97865047682406014,1.0218360189300706,1.0633194621400071,1.1032891360783252,1.1421716082214259,1.1803042253955125,1.2173610724899064,1.2533312215379373,1.2880398841106104,1.3212514172241105,1.3533688566149951,1.3844070345708843,1.3914201182187123,1.3981312030491697,1.404553293796019,1.4106988351805636,1.4165797360270178,1.4222073923394143,1.4275927093847698,1.4327461228253013,1.4376776189406424,1.4423967539792464,1.4469126726764749,1.4512341259752586,1.4553694879836638,1.4593267722022334,1.4631136470525392,1.4667374507370423,1.4702052054590549,1.4735236310303588,1.4766991578928506,1.4797379395794457,1.4826458646383882,1.4854285680440749,1.4880914421165023,1.4906396469704999,1.4930781205149952,1.4954115880216892,1.4976445712816835,1.4997813973678025,1.5018262070195909,1.5024277365771843,1.503003362948087,1.5035542015805299,1.5040813198890877,1.5045857393231141,1.5050684373461061,1.5055303493298304,1.5059723703668872,1.5063953570052191,1.5068001289079289,1.5071874704416226,1.5075581321963534]
[null,null,null,null,null,null,null,null,null,null,null,"Commercial-Retail-AirComp","Retail Compressed Air",0,6.6207168874967665E-2,0.13187595939847685,0.19589986070315893,0.25931661535599659,0.32094586832329058,0.38012958388681256,0.43688009367410874,0.49270192651708222,0.54768742263123404,0.60243491324070464,0.65628007021968882,0.7096888610763965,0.76133318160379737,0.81054686649801999,0.85760997205782263,0.90445501501246117,0.95019054430312566,0.99526931102257632,1.0391389724409046,1.081272610854048,1.1217899902224207,1.1612442202738413,1.199978602551347,1.2375947213699692,1.2741320890701413,1.3093558332989335,1.3430406945748121,1.3756584125703033,1.4071611227848722,1.414239672228816,1.4210134037541211,1.4274954434912552,1.4336983523306179,1.4396341502630223,1.4453143396720218,1.4507499276232174,1.4559514471937396,1.4609289778832344,1.4656921651459092,1.4702502390814829,1.4746120323212664,1.4787859971440256,1.4827802218548001,1.486602446458412,1.4902600776580406,1.4937602032079245,1.4971096056480047,1.5003147754471244,1.5033819235802535,1.506316993564109,1.5091256729744971,1.5118134044676914,1.5143853963272076,1.5168466325564096,1.5192018825365072,1.5214557102686581,1.5236124832180846,1.5256763807773448,1.5263277142009151,1.5269509997737098,1.5275474452979152,1.5281182065650973,1.5286643895958936,1.5291870527832585,1.5296872089434164,1.5301658272784957,1.5306238352546482,1.5310621203992918,1.53148153202096,1.5318828828550926]
[null,null,null,null,null,null,null,null,null,null,null,"Commercial-Retail-Cook","Retail Cooking",0,6.6419308225983034E-2,0.13228973374985259,0.19650390430779616,0.26009813831788725,0.32189899078466128,0.38124795282813406,0.4381567826931646,0.49412724611074837,0.54925790081927273,0.60414184477914823,0.65811445625074416,0.71164835340198462,0.76341065216851378,0.81274191206763247,0.85992192953872182,0.90687323206581161,0.95271105366467146,0.99788782831749634,1.0418495074258567,1.0840726312853872,1.1246811384625979,1.1642187472032492,1.2030289384542734,1.2407180362196895,1.2773244482205239,1.3126152129485922,1.3463655777052683,1.3790427141018367,1.4106026931879638,1.417754718791711,1.4245987624316605,1.4311480864890285,1.437415382237706,1.4434127944373971,1.4491519448677237,1.4546439548488976,1.4598994667926044,1.4649286648248601,1.4697412945207982,1.4743466817896387,1.4787537509464239,1.4829710420055484,1.487006727229591,1.4908686269655171,1.494564224798939,1.498100682055802,1.5014848516795944,1.5047232915109747,1.5078222769955492,1.5107878133444241,1.5136256471710989,1.5163412776272471,1.5189399670589676,1.5214267512041548,1.5238064489507455,1.5260836716747557,1.5282628321762008,1.5303481532302154,1.530993672713056,1.5316113947062047,1.5322025162307491,1.5327681827614137,1.5333094904462601,1.5338274882308023,1.5343231798906509,1.5347975259766307,1.5352514456761328,1.5356858185943167,1.5361014864586076,1.5364992547497951]
[null,null,null,null,null,null,null,null,null,null,null,"Commercial-Retail-Cool","Retail Cooling",0,9.2021654033431946E-2,0.18214956477382541,0.26961759648732364,0.35563839722099616,0.43871181377760898,0.51825825997723329,0.59447343587376522,0.66892992845902322,0.74180153920899705,0.81360591829411322,0.88374238722919263,0.95279283702845896,1.0191609255664233,1.0822922607059293,1.1426405705160296,1.2024386796234361,1.2605820209644163,1.3174987433906387,1.3727510856580383,1.4254735473222773,1.4762005934028937,1.5255657936720426,1.5737985888160326,1.6205321799503833,1.6658050544275944,1.709394799119458,1.7510781440865906,1.7914075312053841,1.8302833420388074,1.8444083088160816,1.8579250234354829,1.870859678573666,1.88323733899298,1.8950819901119407,1.9064165844841519,1.9172630862757418,1.9276425138275022,1.9375749803842108,1.9470797330700562,1.9561751901856976,1.9648789768992303,1.9732079594002185,1.9811782775829825,1.9888053763224696,1.9961040354033184,2.0030883981601111,2.009771998884315,2.0161677890510177,2.0222881624162827,2.0281449790337618,2.0337495882370904,2.0391128506326206,2.0442451591450901,2.0491564591570222,2.0538562677808803,2.0583536923013193,2.0626574478232702,2.066775874160065,2.067666792163291,2.0685193452764259,2.0693351855760764,2.0701158939967947,2.0708629833946115,2.071577901478646,2.0722620336164783,2.0729167055187103,2.0735431858079276,2.0741426884770351,2.074716375241731,2.0752653577916793]
[null,null,null,null,null,null,null,null,null,null,null,"Commercial-Retail-ExtLight","Retail Exterior Lights",0,5.96815005158743E-2,0.11916431691783583,0.17703517158466556,0.23436489817808787,0.29025592141476281,0.34402712243650846,0.39561028326620068,0.44631812194070902,0.49646416965242612,0.54652287560895518,0.5957393689153857,0.64481578165642384,0.69226393944683118,0.7377357717456563,0.78123175884556717,0.82444284023038905,0.86669564328995108,0.90854162332735677,0.94915929721818959,0.98828835473090781,1.0261160364795694,1.0628201825745294,1.0987667429981545,1.1337494116181093,1.1676761292361384,1.2004642908831751,1.2318844356359049,1.2621889367331929,1.2915213910157506,1.2974741162278525,1.3031705039906294,1.3086215927588372,1.3138379456470739,1.3188296708989753,1.3236064414749575,1.3281775137964718,1.332551745683088,1.3367376135171705,1.3407432286694028,1.3445763532169932,1.3482444149850226,1.3517545219400746,1.3551134759640475,1.3583277860348353,1.361403680839417,1.3643471208438012,1.3671638098432117,1.3698592060148966,1.3724385324949779,1.3749067874998404,1.3772687540116706,1.3795290090469148,1.3816919325256174,1.3837617157588253,1.3857423695705078,1.3876377320697255,1.3894514760881156,1.3911871162971015,1.3917036378440157,1.3921979168362781,1.3926709110872471,1.3931235371647293,1.3935566721671047,1.3939711554229661,1.3943677901175704,1.3947473448492491,1.3951105551187981,1.3954581247547302,1.3957907272771533,1.396109007202917]
[null,null,null,null,null,null,null,null,null,null,null,"Commercial-Retail-Heat","Retail Heating",0,7.960539857357872E-2,0.15809569904941717,0.23437739170977651,0.30923841428233734,0.38211684631649301,0.45230498883861714,0.51974271965680297,0.58561108422718144,0.65032594115474218,0.71437306862071059,0.77723862546202349,0.83924711486171111,0.89950577338239435,0.95735805541050267,1.0128606557072759,1.0673571470512291,1.1205267335524352,1.1728031060898705,1.2234525244646732,1.272436855609735,1.3195628922277269,1.3651094484549477,1.4096245392126208,1.4527255217714268,1.494513228324132,1.5347228818969001,1.5732621978908263,1.6104047532306698,1.6462537959701884,1.6571247928067301,1.6675276605928941,1.6774825579959218,1.6870087756064749,1.6961247733199227,1.7048482161079113,1.7131960082495268,1.7211843260883934,1.7288286493791749,1.736143791284229,1.7431439270785392,1.749842621618549,1.7562528556281274,1.7623870508526047,1.7682570941296163,1.7738743604234073,1.7792497348672263,1.7843936338565269,1.7893160252338483,1.7940264476044907,1.7985340288204161,1.8028475036681919,1.80697523079525,1.8109252089072674,1.8147050922680497,1.8183222055319559,1.821783557937608,1.825095856890385,1.828265520960028,1.8293835615149647,1.8304534567828468,1.8314772800057004,1.8324570151471871,1.8333945607371265,1.8342917335504656,1.8351502721278237,1.8359718401444343,1.8367580296340138,1.8375103640738026,1.8382303013367587,1.8389192365166209]
[null,null,null,null,null,null,null,null,null,null,null,"Commercial-Retail-HotWater","Retail Hot Water",0,6.4167409408893372E-2,0.12792637411494168,0.19004426488278467,0.25160835058461806,0.31149046314401951,0.36903041783907187,0.42419716017042858,0.47847972098681674,0.53196502078523689,0.58528390722070633,0.6377141150420006,0.68976897409988702,0.74011774113971984,0.78817030915723174,0.83409355282380604,0.87979127236883103,0.92440646212782895,0.96841986931883595,1.0112303541504366,1.0524232426341265,1.0920496926591281,1.1306148793708963,1.1684612543474817,1.2052313697968216,1.2409448012666195,1.2753949574638288,1.3083388678563355,1.3402250641447242,1.3710255955729058,1.3777038400628689,1.3840945046465656,1.3902099731477107,1.3960620961153138,1.4016622137876613,1.4070211780674196,1.4121493735504418,1.4170567376490277,1.4217527798486316,1.4262466001353338,1.4305469066297856,1.4346620324617969,1.4385999519182671,1.4423682958957504,1.4459743666876006,1.4494251521343471,1.4527273391647266,1.4558873267536065,1.4589112383219127,1.4618049336025885,1.4645740199955795,1.4672238634338484,1.4697595987814742,1.472186139783987,1.4745081885902194,1.476730244864126,1.4788566145042279,1.480891417987579,1.4828385983544221,1.4834544626490906,1.4840438064717401,1.4846077718522654,1.4851474516422423,1.4856638916326503,1.4861580925804094,1.4866310121476431,1.487083566757436,1.4875166333696781,1.487931051180436,1.488327623248147,1.4887071180497844]
[null,null,null,null,null,null,null,null,null,null,null,"C-Ret-Lgt-LPD Int-All-All-C","Retail Interior Lights",0,6.5387924145544701E-2,0.13028193460780044,0.1935192366810255,0.25615115853960174,0.3170417193954515,0.37553071388753828,0.43161639413475406,0.48677265130364566,0.54112989144825008,0.59526574684407507,0.64849659718277564,0.70133607087714278,0.75242140363598031,0.80114570345584735,0.84774420036015019,0.89410701258301839,0.93937841793033494,0.98402743062439935,1.0274589745471103,1.0691908443032945,1.1093574400569368,1.1484467536752958,1.1868021129896034,1.2240621197170598,1.2602429983661108,1.2951374385395262,1.3285177297878736,1.3608186943054508,1.3920247143148861,1.399004476784252,1.4056836753195305,1.4120752528652516,1.4181915950142669,1.42404455400854,1.4296454717064091,1.4350052015608292,1.4401341296511834,1.445042194809417,1.4497389078794971,1.4542333701475163,1.4585342909781567,1.4626500046916882,1.4665884867142063,1.4703573690324054,1.4739639549828354,1.4774152334042991,1.4807178921808197,1.4838783312014137,1.4869026747617904,1.4897967834320076,1.4925662654130765,1.4952164874045302,1.4977525850040072,1.500179472659009,1.5025018531901115,1.504724226904085,1.506850900314586,1.5088859944873141,1.5095071350250215,1.5101015278840715,1.5106703248783779,1.5112146282222116,1.5117354926660715,1.5122339275405789,1.5127108987123561,1.5131673304556836,1.5136041072435569,1.5140220754616174,1.5144220450482782,1.5148047910642215]
[null,null,null,null,null,null,null,null,null,null,null,"Commercial-Retail-Misc","Retail Other",0,6.5472720283484193E-2,0.13044676903854233,0.19375968293998189,0.25646295065808034,0.3174216833347846,0.3759763275232556,0.43212518736996797,0.4873404556302488,0.54175498330229144,0.59594498992857226,0.64922640509296825,0.70211492388418695,0.75324646852029908,0.80201768121285577,0.84866014000812984,0.89506422835925004,0.94037479957277115,0.98506265269478099,1.0285300715695465,1.0702963034825119,1.1104976538193352,1.1496188817535804,1.1880039615343734,1.225292644791157,1.2615005354658486,1.2964213217555112,1.3298273892709094,1.3621518204964169,1.3933808579108442,1.4003879163090922,1.4070932353504777,1.4135098085958229,1.4196500700746222,1.4255259183796931,1.4311487397242586,1.4365294300061393,1.441678415921815,1.4466056751712653,1.4513207557927486,1.4558327946649816,1.4601505352125732,1.4642823443490243,1.4682362286901256,1.4720198500691701,1.4756405403840454,1.4791053158049787,1.482420890370465,1.4855936889977244,1.4886298599329011,1.4915352866651277,1.4943155993275452,1.4969761856073709,1.4995222011861511,1.5019585797304387,1.5042900424522447,1.5065211072578009,1.5086560975023522,1.5106991503679514,1.511321437886699,1.5119169283352614,1.5124867756544598,1.5130320840938842,1.5135539103517064,1.5140532656223498,1.5145311175559799,1.514988392133616,1.5154259754614978,1.5158447154881787,1.5162454236476821,1.516628876431896]
[null,null,null,null,null,null,null,null,null,null,null,"Commercial-Retail-Motors","Retail Motors",0,6.6337879989572593E-2,0.13213555365133561,0.19625563069296789,0.25974652955470207,0.32145416869791904,0.38071955186842366,0.43754679433631732,0.49342607234870695,0.54847063280627173,0.60326856450059829,0.65714603747162992,0.71059519659822079,0.76227039901567573,0.81153780502042594,0.85865616221170349,0.90553225595322406,0.95129639835392865,0.99640873033660071,1.0402951498365052,1.0824562255231951,1.1230179474793909,1.1624984399154223,1.2012406562174081,1.2388679202760318,1.2754070996302929,1.310639128783581,1.3443372847262793,1.3769541239375307,1.4084594338142185,1.4156490321417596,1.4225290305413207,1.4291127610672165,1.4354129816661598,1.4414419008995984,1.4472112016014536,1.4527320635171044,1.4580151849674881,1.4630708035802951,1.4679087161284361,1.4725382975142167,1.4769685189360167,1.4812079652726671,1.4852648517192224,1.4891470397063569,1.4928620521342368,1.4964170879503897,1.4998190360998183,1.5030744888743912,1.5061897546873797,1.509170870297895,1.5120236125089144,1.5147535093615645,1.5173658508473542,1.5198656991591144,1.522257898500512,1.5245470844731412,1.526737693059389,1.528833969218478,1.5294690827281257,1.5300768468521901,1.5306584393154097,1.5312149871271032,1.5317475687650874,1.532257216265551,1.5327449172229322,1.5332116167036796,1.5336582190776007,1.5340855897703483,1.5344945569404413,1.5348859130840713]
[null,null,null,null,null,null,null,null,null,null,null,"Commercial-Retail-OffEquip","Retail Office Eqpmt",0,6.5186289813543866E-2,0.12988690263656821,0.19294035133513723,0.25540086235848269,0.31612564286541855,0.37445480322994401,0.43038677969207262,0.48539793318316232,0.53961384862940409,0.59361602259723689,0.64672005712095404,0.69943609083123293,0.75040334587383151,0.79901207155386422,0.84549642028355088,0.89175411359811496,0.93692393031896948,0.98147449657079355,1.0248133410571392,1.0664553697722554,1.1065328764202562,1.1455395634105445,1.1838183512163487,1.2210045652673778,1.2571161085465385,1.2919434723645333,1.3252580658365671,1.3574986618071228,1.3886461918757906,1.395560965125866,1.4021779730206749,1.4085100379917839,1.4145694303086347,1.4203678918558602,1.4259166588866981,1.4312264837965907,1.4363076559591674,1.4411700216649825,1.4458230032016477,1.4502756171123321,1.454536491668011,1.4586138835873206,1.462515694036421,1.4662494839398663,1.4698224886321585,1.473241631878371,1.4765135392910147,1.4796445511691425,1.4826407347845758,1.4855078961390575,1.4882515912151166,1.4908771367424458,1.4933896205006556,1.4957939111783682,1.4980946678077585,1.5002963487928209,1.5024032205488616,1.5044193657699529,1.5050397287628368,1.5056333775598545,1.5062014625330775,1.5067450845170227,1.5072652969418507,1.5077631078747005,1.5082394819731213,1.5086953423543852,1.5091315723843028,1.5095490173890087,1.5099484862930335,1.5103307531868371]
[null,null,null,null,null,null,null,null,null,null,null,"Commercial-Retail-Process","Retail Process",0,6.59571779438647E-2,0.13139830529941257,0.19516060572098765,0.2582912365116759,0.31966584887687127,0.37861973080626449,0.43514873764303713,0.49073169919153498,0.54549410521874375,0.6000184463161693,0.65362453597132875,0.70681717552736545,0.75824805324241862,0.8073051135249254,0.85422608005950085,0.90088942335600486,0.94645076131545713,0.99137311194799593,1.035067185468086,1.0770599899250266,1.1174726655310536,1.1567929710447111,1.1953699688667587,1.232841175892698,1.2692248436738554,1.3043127439875848,1.3378764292971408,1.3703537127692658,1.4017271521163337,1.4088651365172953,1.4156957435995552,1.4222322097069808,1.4284872011973404,1.4344728389871582,1.4402007220396154,1.4456819498410096,1.4509271439093299,1.4559464683766217,1.460749649685035,1.4653459954347128,1.4697444124200503,1.4739534238892729,1.4779811860607777,1.4818355039282465,1.4855238463851543,1.4890533606979848,1.4924308863561957,1.4956629683257758,1.4987558697320724,1.5017155839964711,1.5045478464504409,1.5072581454494554,1.509851733008321,1.512333634978527,1.5147086607873366,1.5169814127574897,1.5191562950255784,1.5212375220763812,1.5218613544192934,1.5224583231684916,1.5230295851294469,1.5235762472930403,1.5240993689806897,1.5245999638971004,1.5250790020946228,1.5255374118530174,1.5259760814782752,1.5263958610239765,1.5267975639385232,1.5271819686414387]
[null,null,null,null,null,null,null,null,null,null,null,"Commercial-Retail-Refrig","Retail Refrigeration",0,6.0692431505349399E-2,0.12112197312077308,0.17998506654569729,0.23838073031680956,0.2952226230163017,0.34985790257213334,0.40225332944760006,0.45382041873109508,0.50474922152997992,0.55558964065159877,0.60559139531803274,0.65538112458826026,0.70349865683563495,0.74947478968293413,0.79341895120076655,0.8371890709822829,0.87995969619672765,0.92225299325232024,0.96337341125197018,1.0029163171162914,1.0410516312330698,1.0781503750031052,1.1145401416247893,1.1499365133786843,1.1842990585409428,1.2174816198826064,1.2492429181837315,1.2799463244506475,1.3096362745852839,1.3155765250600369,1.3212609752751119,1.3267006405526953,1.3319060618709573,1.3368873262903465,1.3416540865002882,1.3462155795241562,1.3505806446187665,1.3547577404030826,1.3587549612493182,1.3625800529682037,1.3662404278188123,1.3697431788720258,1.373095093755484,1.3763026678066399,1.3793721166594211,1.3823093882888764,1.3851201745371591,1.3878099221431712,1.3903838432972497,1.3928469257413441,1.3952039424342573,1.3974594608006814,1.3996178515819484,1.4016832973056492,1.4036598003905301,1.4055511909023781,1.4073611339759167,1.4090931369171018,1.4096462801964684,1.4101756039087807,1.4106821337770223,1.411166851354287,1.4116306959258322,1.4120745663292245,1.4124993226961071,1.4129057881189615,1.4132947502460949,1.413666962807945,1.4140231470776579,1.4143639932687706]
[null,null,null,null,null,null,null,null,null,null,null,"Commercial-Retail-Vent","Retail Ventilation",0,6.6488096836675767E-2,0.13242237529616246,0.19664287762895791,0.26021837390499292,0.32199722090728328,0.38133080648734879,0.43822620092197478,0.4941465639794117,0.54924232579814591,0.60407799504485704,0.65796327578712688,0.71144001729549933,0.76311038942090836,0.8124015690405072,0.85953306865835244,0.90641517918775383,0.9521787338350518,0.9973066081310803,1.0411911843576818,1.0833377079642879,1.1239204827980547,1.1634066940069876,1.2021346162612496,1.2397557977989762,1.2762769920109311,1.3115032559240234,1.3452045827879324,1.3778066151982145,1.4093038425916655,1.4166258713718902,1.4236325974773685,1.4303375985352424,1.4367538674901457,1.4428938377819192,1.4487694074391186,1.4543919621350032,1.4597723972506824,1.4649211389881744,1.4698481645742911,1.4745630215944985,1.4790748464942185,1.4833923822834243,1.4875239954788364,1.4914776923165514,1.4952611342665179,1.4988816528789259,1.5023462639912781,1.5056616813236727,1.5088343294886435,1.5118703564407687,1.5147756453901708,1.5175558262029958,1.5202162863109623,1.5227621811511216,1.5251984441560589,1.5275297963138934,1.5297607553166059,1.5318956443144169,1.5325192585397416,1.5331160185639756,1.5336870807881229,1.5342335518160153,1.5347564905986872,1.5352569104864116,1.535735781192368,1.5361940306717521,1.5366325469199664,1.5370521796933774,1.5374537421559715,1.5378380124551048]
[null,null,null,null,null,null,null,null,null,null,null,"Commercial-School-AirComp","School Compressed Air",0,6.2961453756003802E-2,0.1255710962094701,0.18668569484378145,0.24726580886324664,0.30618540983818271,0.36281285429938775,0.41709229708539369,0.47056163053573929,0.52328309727378486,0.57587150785969132,0.62761395987657365,0.67900879186562213,0.72873771367138362,0.77618861955971141,0.82156023547655099,0.86674227078945543,0.91086232034368875,0.95441852293267881,0.99679990123711437,1.0375640018667087,1.0767759312112368,1.1149441421104549,1.1524244194122666,1.1888412789883847,1.2242283948494597,1.2583606860942671,1.2910033038295854,1.3225946432765234,1.3531344781333012,1.3594082971889081,1.3654119517875749,1.3711570758054379,1.3766548021383211,1.3819157842750516,1.3869502169417791,1.3917678558573079,1.3963780366377183,1.4007896928869148,1.4050113735081555,1.4090512592701083,1.4129171786595369,1.4166166230513346,1.4201567612253037,1.4235444532578099,1.426786263815232,1.4298884748749665,1.4328570978986357,1.4356978854810942,1.4384163424978009,1.4410177367721613,1.443507109283511,1.4458892839355202,1.44816887690395,1.4503503055818734,1.4524377971396949,1.4544353967165575,1.4563469752590097,1.4581762370221218,1.4588079082313192,1.4594123782879673,1.4599908185335637,1.4605443498690627,1.4610740449269561,1.4615809301498208,1.4620659877793565,1.4625301577597734,1.4629743395592154,1.4633993939127485,1.4638061444902919,1.464195379492726]
[null,null,null,null,null,null,null,null,null,null,null,"Commercial-School-Cook","School Cooking",0,6.3921131349609431E-2,0.12745604888502604,0.18955449047169842,0.25109603933886021,0.31093737329013293,0.36844052538720012,0.42354957710536267,0.4778649113352697,0.53139067581879895,0.58476314291862097,0.63730409350924178,0.68942800653866332,0.73990230314260863,0.78800140610795177,0.8340146587347842,0.87983797195641977,0.92457492071556391,0.96869886229021929,1.0116628015883724,1.0529878346730979,1.0926790145125727,1.1313263361710997,1.1693163141907961,1.2062061289859165,1.2420729514052871,1.2766478873793854,1.3096959657707168,1.3417035863210947,1.3726368373378661,1.3789933037061257,1.3850760466422594,1.3908968532797079,1.396467003172003,1.401797290150276,1.4068980432395324,1.4117791466742275,1.4164500590519262,1.4209198316621641,1.4251971260260281,1.4292902306804434,1.4332070772396925,1.4369552557652898,1.4405420294739952,1.4439743488124697,1.447258864925842,1.450401942546294,1.453409672326631,1.456287882642743,1.4590421508878262,1.4616778142802502,1.4641999802060148,1.4666135361158374,1.4689231589960505,1.4711333244316611,1.4732483152791354,1.4752722299657135,1.4772089904313386,1.4790623497285875,1.4797399282330284,1.4803883287157471,1.4810088076465786,1.4816025673890008,1.4821707585300747,1.48271448211005,1.4832347917559592,1.4837326957233365,1.4842091588500133,1.4846651044257804,1.4851014159815386,1.485518939001403]
[null,null,null,null,null,null,null,null,null,null,null,"Commercial-School-Cool","School Cooling",0,8.8353335196786328E-2,0.17494013298226629,0.2591401817922141,0.34209759940359474,0.42218762795461712,0.498860526105455,0.57223967719172042,0.64406958541487458,0.714394271310825,0.78379630666486233,0.85166396870213879,0.91851142453811274,0.98278149633948508,1.0437884420068591,1.1021411477261174,1.1601157159984221,1.2165038716607659,1.2716956440474907,1.3253117662985616,1.376447644059263,1.4255459875397476,1.4734626015408143,1.5203440629413245,1.5657696275095707,1.6098350964471704,1.65223591283851,1.6927520263149181,1.7320200336499394,1.7698905451172766,1.782739030307553,1.7950342314465735,1.8067999741633396,1.8180590581028286,1.8288333011071245,1.8391435814940105,1.849009878514954,1.8584513110708807,1.8674861747607627,1.8761319773348126,1.8844054726209847,1.8923226929905272,1.8998989804254962,1.907149016248433,1.9140868495718175,1.9207259245224251,1.927079106293341,1.933158706074122,1.938976504907405,1.9445437765182021,1.9498713091601132,1.9549694265207938,1.9598480077271867,1.9645165064892853,1.968983969419523,1.973259053563291,1.9773500431745525,1.9812648657690612,1.9850111074862942,1.9858925573920523,1.986736050124835,1.9875432202040531,1.9883156317631132,1.9890547815803956,1.9897621019797089,1.9904389636058462,1.9910866780806189,1.991706500544516,1.992299632088915,1.9928672220835555,1.9934103704037855]
[null,null,null,null,null,null,null,null,null,null,null,"Commercial-School-ExtLight","School Exterior Lights",0,5.760824564031642E-2,0.11511427882411998,0.17108161563778884,0.22656151244778838,0.2806968668316317,0.33280015868779511,0.38279172280307022,0.43196076717822912,0.48064500400914983,0.52929900820049047,0.57716305817020919,0.62495793831986202,0.67118516004333462,0.71551676152772459,0.75793183443584933,0.80008115887126208,0.84132158200040086,0.88221315747761453,0.92190037665250357,0.96015398791825768,0.99715767808018807,1.0330584415142989,1.0682197929428026,1.1024531607777319,1.135655640152643,1.1677531873342419,1.1985228949925453,1.2281891108646656,1.2569162785609949,1.2623420538376096,1.2675341832889155,1.2725027282183949,1.2772573166676575,1.2818071620736504,1.2861610811224473,1.2903275108342147,1.294314524912461,1.2981298493892519,1.301780877596707,1.3052746844937935,1.3086180403761729,1.3118174239956744,1.3148790351148147,1.3178088065206908,1.3206124155215291,1.3232952949481687,1.3258626436817951,1.3283194367283275,1.3306704348589806,1.3329201938356818,1.335073073239224,1.3371332449172544,1.33910470106848,1.3409912619787434,1.3427965834239719,1.3445241637543337,1.3461773506733405,1.3477593477250216,1.3482554538077343,1.3487301964706169,1.3491844956695478,1.3496192317450799,1.3500352471283639,1.3504333479736119,1.3508143057202608,1.3511788585878672,1.3515277130066292,1.3518615449863061,1.3521810014261879,1.3524867013686588]
[null,null,null,null,null,null,null,null,null,null,null,"Commercial-School-Heat","School Heating",0,8.1064403454484568E-2,0.16099558235927861,0.23871574098061965,0.31496908732085149,0.38921516956371832,0.46069373089050175,0.52936380309806785,0.59648292761587174,0.66234818880773461,0.72750401767015849,0.79148412372051336,0.85448656113490773,0.9157441481362748,0.97453603891482432,1.0309052276999078,1.0862309673519757,1.1402085736070993,1.1932143333739962,1.2446007703407655,1.2943325410187758,1.3421333395359996,1.3882972547846544,1.4334522512529939,1.4771475681629824,1.5195244045762495,1.560295292233209,1.5993435000707894,1.6369986851108871,1.6733200801796166,1.6844890444865499,1.6951770486080171,1.7054048037481773,1.7151921292411536,1.7245579909569202,1.7335205380533474,1.7420971381456225,1.7503044109611967,1.7581582605454784,1.7656739060806759,1.7728659113775158,1.7797482130969799,1.786334147756754,1.7926364775747197,1.7986674151995672,1.8044386473764547,1.809961357593572,1.815246247753493,1.8203035589113121,1.8251430911197513,1.8297742224196931,1.8342059270129389,1.8384467926524086,1.8425050372834801,1.846388524968716,1.8501047811268365,1.8536610071154687,1.8570640941859298,1.860320636837089,1.8615312280716707,1.8626896885832323,1.8637982632354442,1.8648591002232069,1.8658742552354199,1.8668456954384947,1.8677753032883269,1.8686648801781185,1.8695161499291153,1.8703307621310261,1.8711102953385963,1.8718562601305293]
[null,null,null,null,null,null,null,null,null,null,null,"Commercial-School-HotWater","School Hot Water",0,6.2647587823552342E-2,0.12495031268757111,0.18570808773298794,0.24600359797058105,0.30465909179891332,0.36102150543681233,0.41506275529111797,0.46829792883379251,0.52076792624592028,0.57313003829531051,0.62467691301885875,0.67586253834281729,0.72540368173400449,0.7726405635337471,0.81776581101957602,0.86274278951277406,0.90666163740103067,0.95000160466457539,0.99218614963418583,1.0327742946183753,1.0717837541668336,1.109781323728716,1.1471233403981866,1.1833999721458097,1.2186565870220347,1.2526584225131707,1.2851609099089967,1.3166481197198858,1.3470656599423108,1.3531920740954853,1.3590546713712504,1.3646648123049969,1.3700333682224577,1.3751707423061523,1.3800868897546639,1.3847913370738136,1.3892932005371148,1.3936012038512786,1.3977236950610048,1.4016686627258146,1.4054437514002738,1.4090562764476031,1.4125132382153822,1.4158213356008169,1.4189869790318548,1.4220163028893074,1.4249151773940467,1.4276892199823139,1.4303438061911822,1.4328840800752667,1.435314964174869,1.4376411690548712,1.4398672024328638,1.4419973779141964,1.4440358233508783,1.4459864888405261,1.4478531543808588,1.4496394371945744,1.4502764860462747,1.4508861021723036,1.4514694668862069,1.4520277106315689,1.452561915172585,1.4530731156903038,1.4535623027885993,1.4540304244137625,1.4544783876914307,1.4549070606844146,1.4553172740748297,1.4557098227737917]
[null,null,null,null,null,null,null,null,null,null,null,"C-K12-Lgt-LPD Int-All-All-C","School Interior Lights",0,6.4395480076730627E-2,0.12837498242572465,0.19081721379126731,0.25268502631678247,0.31284076323996113,0.37063897880028257,0.42603230561993083,0.48057967348176556,0.53433087713082028,0.58790827491609809,0.64061520877614464,0.69292717138280513,0.74354217214955198,0.79179947259417915,0.83795699000612933,0.88390469296446617,0.92876081252936105,0.97300533691724589,1.016060156840521,1.0574613387016873,1.0972616411368412,1.1360082695360043,1.1740602497612989,1.2110193901868012,1.2469332086979135,1.2815629187487259,1.3146736309061473,1.3467275413382465,1.3777046207557513,1.3843219456659022,1.3906543140009751,1.3967139966182696,1.4025127359649627,1.408061768832612,1.4133718481317976,1.4184532637291047,1.4233158623868147,1.4279690668439533,1.4324218940756652,1.4366829727662984,1.4407605600300621,1.4446625574116545,1.4483965261978671,1.4519697020698408,1.4553890091243611,1.4586610732913661,1.4617922351736679,1.4647885623337651,1.4676558610515613,1.4703996875757686,1.4730253588907991,1.4755379630200152,1.4779423688852937,1.4802432357420194,1.4824450222077856,1.4845519949022987,1.48656823671523,1.4884976547180349,1.4891447634084569,1.4897640061744111,1.4903565829839365,1.4909236421318077,1.4914662824646989,1.4919855555105279,1.4924824675161057,1.4929579813970413,1.4934130186036785,1.4938484609066802,1.4942651521057253,1.4946638996646198]
[null,null,null,null,null,null,null,null,null,null,null,"Commercial-School-Misc","School Other",0,6.1460291233965916E-2,0.12264595858159427,0.18241701637066388,0.24171015315915925,0.29941237357397171,0.35487188295186317,0.40801833611253802,0.46041867221942856,0.51210980352554947,0.56371759536071786,0.61452969835087623,0.66502541179154828,0.71391024214246546,0.76052988358834184,0.8051267806523541,0.84955906160561279,0.89296249044424403,0.93581796670587236,0.9775364217364555,1.017682344262469,1.0562787459630956,1.0938624977660731,1.1307897575474586,1.1666744014134411,1.2015574388835084,1.2352038072823097,1.2673744480052624,1.2985207575998003,1.3286313883089615,1.3344635239239337,1.3400445149430458,1.3453851762053541,1.3504958568391421,1.3553864603164509,1.3600664636440192,1.3645449357278168,1.3688305549467616,1.3729316259696753,1.376856095848062,1.3806115694158958,1.3842053240262633,1.3876443236534093,1.3909352323875201,1.3940844273483917,1.3970980110430056,1.3999818231909615,1.40274145204068,1.4053822451983056,1.4079093199902919,1.4103275733797522,1.4126416914557909,1.414856158514201,1.4169752657471293,1.4190031195585442,1.4209436495216206,1.4228006159934639,1.4245776174019265,1.4262780972186371,1.4268880938704716,1.4274718227239018,1.4280304149281413,1.428564952922629,1.4290764725345788,1.4295659649862056,1.4300343788155132,1.4304826217143725,1.4309115622874433,1.4313220317353579,1.4317148254654199,1.4320907046329434]
[null,null,null,null,null,null,null,null,null,null,null,"Commercial-School-Motors","School Motors",0,6.2877795080382493E-2,0.12540711424418333,0.18645865389075414,0.24697548555909216,0.30584732350175686,0.36242416923632498,0.41665193167410347,0.47007400463773902,0.52275707369953062,0.57530459257155597,0.62701631267953306,0.67838393925902429,0.72809382774304343,0.77551882979451736,0.82088296802208149,0.8660489535260959,0.91016078694837199,0.95370123755331326,0.99607136320689715,1.0368240037515832,1.0760270239721041,1.1141820900952633,1.1516544370300781,1.1880604054852328,1.2234410041329602,1.2575651495256666,1.2901992222797281,1.3217815125367272,1.3523121181515105,1.3585529658999493,1.3645250690085036,1.3702400002128614,1.3757088339012422,1.3809421675743341,1.3859501423811202,1.3907424627703895,1.3953284152960059,1.3997168866123855,1.403916380695045,1.4079350353195998,1.4117806378311353,1.4154606402345187,1.4189821736348855,1.4223520620562893,1.425576835665288,1.4286627434250956,1.4316157652048154,1.434441623367227,1.4371457938575729,1.4397335168148415,1.4422098067261035,1.4445794621435792,1.4468470749832689,1.4490170394231634,1.4510935604182778,1.4530806618490089,1.4549821943186083,1.4568018426148757,1.4574278471994453,1.4580268946487942,1.4586001457964965,1.4591487114880777,1.45967365473361,1.4601759927676121,1.4606566990202459,1.4611167050036273,1.461556902116911,1.4619781433736418,1.462381245054724,1.4627669882902092]
[null,null,null,null,null,null,null,null,null,null,null,"Commercial-School-OffEquip","School Office Eqpmt",0,6.1686509208666682E-2,0.12307821784845328,0.18301100783520621,0.24246312448754082,0.30030874573717947,0.35590392378933439,0.40918524889205077,0.46169223903201906,0.51349316302233716,0.56520079039818305,0.6160940076596908,0.66668802983994102,0.71564443074859607,0.76234038886417144,0.80700117813714101,0.85150163727966266,0.89496698502206873,0.93789082482962549,0.97966252888976046,1.0198417585746933,1.058489305736513,1.096126321160219,1.1330942151056569,1.1690213722212,1.203937714853174,1.2376185886412572,1.2698286353750554,1.3010068765421059,1.3311502743013706,1.3370917809609857,1.3427774332668378,1.3482182488705239,1.3534247709793144,1.3584070887867692,1.3631748570235684,1.3677373146664382,1.3721033028414336,1.3762812819562613,1.3802793480948525,1.3841052487059446,1.3877663976160806,1.3912698893961148,1.3946225131090666,1.3978307654659581,1.4009008634151365,1.4038387561894698,1.4066501368347653,1.4093404532417462,1.4119149187029723,1.4143785220151501,1.4167360371464208,1.4189920324873497,1.4211508797035495,1.4232167622070901,1.42519368326311,1.4270854737473393,1.4288957995695684,1.4306281687774429,1.4312277011669989,1.4318014163723158,1.432350426138169,1.432875794335158,1.4333785390212717,1.4338596344146817,1.4343200127815816,1.4347605662427296,1.4351821485022014,1.435585576501696,1.4359716320036049,1.4363410631059097]
[null,null,null,null,null,null,null,null,null,null,null,"Commercial-School-Process","School Process",0,6.7225262354936102E-2,0.13395926330716298,0.19944601807531662,0.26411499978220654,0.32702829826762009,0.38751404862298566,0.44550285187892796,0.50268163357518458,0.55902163837282148,0.61505786709008692,0.67030132902137751,0.72491697873991046,0.7779441354349661,0.82853549097425105,0.87707991647625927,0.92519410340977326,0.97221053069961916,1.0184988525229863,1.0635976705682821,1.107026997505558,1.1487513883003666,1.1892155645110147,1.2290240573508613,1.2675998970453981,1.3051587474777839,1.3413287677703893,1.3759032126715782,1.4093371460214403,1.4416639945885303,1.4486380866684003,1.4553118589936349,1.4616982439938591,1.4678096171998154,1.4736578212246541,1.4792541887125379,1.4846095642990296,1.489734325625816,1.4946384034504916,1.4993313008903728,1.5038221118376276,1.5081195385814121,1.512231908671158,1.51616719105369,1.5199330115154432,1.5235366674597044,1.5269851420475142,1.5302851177296291,1.5334429891957673,1.5364648757662347,1.5393566332499355,1.5421238652917546,1.5447719342312944,1.5473059714940121,1.5497308875348899,1.5520513813539119,1.5542719496017798,1.5563968952935194,1.5584303361468588,1.5591481137442984,1.5598349822585946,1.5604922727028974,1.5611212587740004,1.5617231593205105,1.5622991407047306,1.562850319062836,1.5633777624677216,1.5638824929987125,1.564365488722149,1.5648276855866816,1.5652699792369518]
[null,null,null,null,null,null,null,null,null,null,null,"Commercial-School-Refrig","School Refrigeration",0,6.0301079013459553E-2,0.12035758926862417,0.17887091197895413,0.236922415045898,0.29344617495091635,0.34778161308955591,0.39989301129098126,0.45118762340403079,0.50185955452418618,0.55245301678733605,0.60222759660498704,0.6517958359155871,0.69971545446335592,0.74550847417466093,0.78928711478193003,0.83288570449973542,0.87549821973454989,0.91764076757184576,0.95861597716215607,0.99802996131960697,1.0360427502983507,1.0730149690557955,1.1092856072840653,1.1445657545374579,1.1788178590523823,1.2118934543893329,1.2435538413995921,1.2741578921608101,1.30375401889734,1.3095790707856736,1.3151532831190071,1.3204874576006662,1.3255919307888564,1.3304765941268375,1.3351509131105515,1.3396239456308519,1.3439043595258762,1.3480004493775741,1.3519201525849405,1.3556710647451,1.3592604543720466,1.362695276981565,1.3659821885696211,1.3691275585103444,1.3721374818985963,1.3750177913610384,1.3777740683585906,1.3804116540021811,1.3829356594027464,1.3853509755755362,1.3876622829179188,1.3898740602790502,1.3919905936389849,1.3940159844140418,1.3959541574045269,1.3978088684002064,1.3995837114582728,1.401282125867906,1.4018349912088728,1.4023640489514251,1.4028703243031495,1.4033547983239385,1.4038184098270858,1.4042620571985187,1.4046866001376888,1.4050928613234976,1.4054816280084823,1.4058536535443527,1.4062096588418362,1.4065503337676577]
[null,null,null,null,null,null,null,null,null,null,null,"Commercial-School-Vent","School Ventilation",0,6.856297540699588E-2,0.13644950257041413,0.20267721514455536,0.26822586214737293,0.33189434826353492,0.39303330569637202,0.45162485780624717,0.50924220997602165,0.56594105779202397,0.62233727100967084,0.67779930355717954,0.73271917970901979,0.7858528309605346,0.83647125349310725,0.88490880982258502,0.93307318470705458,0.98008185487954635,1.0263536249503977,1.0713787396479995,1.1146319704356633,1.1561836773138539,1.1966396902720629,1.2363642510142592,1.2749125300807658,1.3123712708649151,1.3484581700568856,1.382955220624529,1.4163693123871015,1.4486408599870657,1.4562362326007012,1.4635045317525053,1.4704598419456192,1.4771156411734796,1.4834848270374608,1.4895797417398351,1.4954121960004805,1.5009934919436818,1.5063344449993767,1.5114454048612858,1.5163362755425385,1.5210165345676607,1.5254952513381126,1.529781104706966,1.5338823997967781,1.5378070840932487,1.5415627628458521,1.5451567138052815,1.5485959013262662,1.551886989863094,1.5550363568839816,1.5580501052293287,1.5609340749377949,1.5636938545631214,1.5663347920036252,1.5688620048653514,1.5712803903789649,1.5735946348895999,1.5758092229380545,1.5765230066334093,1.5772060532318348,1.577859686340376,1.5784851725686451,1.5790837239832567,1.5796565004565692,1.5802046119142845,1.580729120486261,1.5812310425647071,1.5817113507737468,1.5821709758541673,1.5826108084670099]
[null,null,null,null,null,null,null,null,null,null,null,"Commercial-Small Office-AirComp","Small Office Compressed Air",0,6.4688796674108345E-2,0.12890030920105447,0.19153311111257862,0.25362324318119572,0.31398164801128192,0.37194686903754759,0.42752592841826392,0.48223012209164429,0.53614409903618609,0.58986641101144011,0.64273283782653157,0.69520142272459307,0.74594511457372237,0.79429252476261802,0.84052855460388542,0.88658362581866013,0.93156376588850354,0.97591532659396363,1.0190903571115002,1.0605578489948722,1.1004357762040902,1.1392792472510536,1.1774323474964321,1.2144911635984939,1.2504977327992823,1.285212419525867,1.3184073745615414,1.3505593920942278,1.3816166273712789,1.3882634979047443,1.394624139563563,1.4007108779930546,1.4065355080691231,1.4121093167543561,1.4174431049698901,1.4225472085254249,1.4274315181479464,1.4321054986479669,1.4365782072604267,1.4408583111957951,1.444954104435382,1.4488735238034076,1.4526241643469728,1.4562132940537338,1.4596478679358018,1.4629345415071586,1.466079683680706,1.4690893891099379,1.4719694899991549,1.4747255674051041,1.4773629620519455,1.4798867846805019,1.482301925951848,1.4846130659244277,1.4868246831230685,1.4889410632174618,1.490966307326929,1.4929043399675674,1.4935433651853574,1.4941548725708023,1.4947400471023284,1.4953000227305833,1.4958358845758031,1.4963486710305589,1.496839375771952,1.4973089496871608,1.4977583027160688,1.4981883056145451,1.4985997916417952,1.4989935581750491]
[null,null,null,null,null,null,null,null,null,null,null,"Commercial-Small Office-Cook","Small Office Cooking",0,6.7834366960981704E-2,0.13502966241243036,0.20057897404312369,0.26550528558434999,0.32856190645628625,0.38909053551733963,0.44711967673412678,0.50420867054707164,0.56039662344798635,0.61630400000314867,0.67130658241399577,0.72579011068558918,0.77848152890838618,0.82862861052957604,0.87658872131319621,0.9243422241989343,0.97095754331364648,1.0168490261169876,1.0615331358623212,1.1044196729499454,1.1456135535643597,1.1857539547440163,1.2251898046561875,1.2634657811875512,1.3006600470319649,1.3364947116959147,1.3707470129459804,1.4039455786312058,1.4359971282018058,1.443340381727322,1.4503674185938449,1.4570918557866896,1.4635267239138139,1.4696844924565164,1.4755770939327868,1.4812159470201269,1.4866119786826533,1.4917756453453579,1.4967169531565585,1.5014454773778032,1.505970380938803,1.5103004321933482,1.5144440219106163,1.5184091795347963,1.522203588744538,1.5258346023423768,1.5293092565029882,1.5326342844078795,1.5358161292929429,1.5388609569341518,1.5417746675955959,1.5445629074630065,1.5472310795849304,1.5497843543427523,1.5522276794698548,1.5545657896393308,1.5568032156388294,1.5589442931503112,1.5596323142499193,1.5602907076466734,1.5609207491746679,1.5615236597277726,1.5621006076254804,1.5626527108768755,1.5631810393471099,1.5636866168305878,1.564170423034873,1.5646333954791649,1.5650764313110233,1.5655003890448591]
[null,null,null,null,null,null,null,null,null,null,null,"Commercial-Small Office-Cool","Small Office Cooling",0,9.5313754629539213E-2,0.18854717852419842,0.27904077931728044,0.36799947790576981,0.45389303517955121,0.53611927924801384,0.61488350004339132,0.69180960150020909,0.76704156271500668,0.84110828238108859,0.91347029723487216,0.98461784350717441,1.0530314799464835,1.1180558543550334,1.1802504813190402,1.2418352639680363,1.3017269812662637,1.3602773192994857,1.4171194171167405,1.4713508870190748,1.5234717411544108,1.5742157622939037,1.6237939163052568,1.6718045731634261,1.7183245265779712,1.7630819706845806,1.8058731923629008,1.8473004133437279,1.8872185543246496,1.9020658059796189,1.9162737023001637,1.9298697753341778,1.942880371538976,1.9553307028354339,1.967244895463623,1.9786460367346177,1.9895562197690624,1.9999965863092006,2.0099873676873234,2.0195479240300247,2.0286967817742361,2.0374516695677403,2.0458295526237253,2.0538466655959593,2.0615185440382886,2.0688600545094169,2.0758854233813104,2.0826082644070461,2.0890416051015293,2.0951979119862028,2.1010891147466553,2.1067266293499598,2.1121213801665188,2.1172838211393024,2.1222239560414882,2.1269513578617611,2.1314751873548454,2.1358042107932036,2.1367623630212007,2.1376792551054082,2.1385566637984299,2.1393962893419913,2.1401997587616672,2.1409686290197305,2.1417043900322312,2.1424084675561552,2.1430822259522548,2.1437269708289053,2.1443439515721114,2.1449343637665668]
[null,null,null,null,null,null,null,null,null,null,null,"Commercial-Small Office-ExtLight","Small Office Exterior Lights",0,5.6404332152604701E-2,0.11276042870364737,0.16762573821402521,0.22203404384535327,0.27515651682698061,0.32629465738739727,0.37537104301680291,0.4236544313295656,0.47149910167188624,0.51934387623529188,0.56643540591436981,0.61349202084160781,0.65901890662710494,0.7027005175194222,0.74449684141877226,0.78603684249760808,0.82669931861035006,0.86704473258312853,0.90620481422146959,0.94396029510522073,0.98050443694938472,1.0159440055795319,1.0506617221609269,1.0844711627266492,1.1172627219631859,1.1489709858104498,1.1793725435662765,1.2086766122755148,1.2370597435470922,1.242178259050843,1.2470763600113699,1.2517635379640273,1.2562488757177663,1.2605410649557942,1.2646484230783088,1.2685789093199498,1.2723401401731946,1.2759394041475915,1.2793836758934261,1.282679629717191,1.2858336525150524,1.2888518561493694,1.2917400892922564,1.2945039487591339,1.297148790354232,1.2996797392490629,1.3021016999139727,1.3044193656220204,1.3066372275435971,1.3087595834494121,1.3107905460387088,1.3127340509088492,1.3145938641817108,1.316373589801674,1.3180766765193421,1.3197064245745269,1.3212659920914502,1.3227584011985538,1.3232395305183162,1.3236999413506247,1.3241405258791497,1.3245621378681689,1.3249655943169909,1.3253516770431364,1.3257211341973425,1.3260746817133293,1.326413004695135,1.3267367587447096,1.3270465712323409,1.3273430425123707]
[null,null,null,null,null,null,null,null,null,null,null,"Commercial-Small Office-Heat","Small Office Heating",0,8.8283475087390401E-2,0.1750175254696397,0.25927606238614848,0.34177619424431155,0.42199620708196955,0.49919404580067306,0.57336989845305752,0.64570240679985536,0.71662852141043432,0.78660665860365642,0.85521930341093666,0.92269022835981518,0.9882272099077043,1.0511339812687919,1.1115092904813617,1.1706537497623799,1.2283054343371151,1.2848539451463741,1.3396159160632186,1.39254630467635,1.4434525545928354,1.492595751407908,1.5405887555170015,1.5870006673170158,1.6319804457385201,1.6752350607112665,1.7166833925717007,1.7566217277819787,1.795137968544348,1.8082693616252328,1.820835288018424,1.8328600979640617,1.844367093127351,1.8553785717525086,1.8659158718722764,1.8759994126567434,1.8856487339815919,1.894882534292452,1.9037187068387296,1.9121743743471291,1.9202659222020571,1.9280090301972033,1.9354187029198313,1.9425092988266521,1.9492945580676293,1.9557876291116263,1.9620010942254993,1.9679469938559997,1.9736368499617418,1.9790816883404423,1.9842920599947012,1.9892780615777239,1.9940493549586069,1.998615185945098,2.0029844022001133,2.007165470386731,2.0111664925748816,2.014995221941533,2.016365866336618,2.0176774877673216,2.0189326278923962,2.0201337189211763,2.0212830883267068,2.0223829633559229,2.0234354753456039,2.0244426638524748,2.0254064806054619,2.0263287932877461,2.0272113891559607,2.0280559785035344]
[null,null,null,null,null,null,null,null,null,null,null,"Commercial-Small Office-HotWater","Small Office Hot Water",0,6.1837891945166354E-2,0.12338290394284399,0.18332715475448433,0.2427804707354175,0.30065212870143615,0.35628131098339011,0.40961781836389038,0.46211475123555845,0.51389591106869681,0.56557574226335749,0.6164021743942153,0.66694289334650625,0.71582214462212601,0.76252164471531125,0.80714210472280168,0.85155794200301094,0.8949416086149099,0.93779542421760131,0.97946188375564647,1.0195771934830373,1.0582049040780706,1.0957892547388357,1.1326629977003841,1.1685103850819818,1.2033224741067032,1.2369233078145723,1.2690661089852164,1.3001595096250647,1.3302085494163405,1.3363798957724056,1.3422854903715111,1.3479367770692199,1.3533447069234863,1.3585197594156075,1.3634719627573502,1.3682109133236111,1.3727457942482626,1.3770853932192213,1.3812381195072199,1.3852120202612854,1.3890147961024966,1.3926538160462392,1.3961361317818781,1.3994684913375135,1.4026573521563033,1.4057088936096906,1.4086290289717838,1.411423416878093,1.414097472290829,1.4166563769920122,1.419105089624723,1.4214483553019583,1.4236907148017051,1.425836513366056,1.4278899091214157,1.429854881136114,1.4317352371310406,1.4335346208582429,1.4341227616602676,1.4346855758248847,1.4352241539728434,1.4357395397603638,1.4362327319015316,1.4367046861036059,1.4371563169189883,1.4375884995174402,1.4380020713819874,1.4383978339317935,1.4387765540751485,1.439138965695584]
[null,null,null,null,null,null,null,null,null,null,null,"C-SOff-Lgt-LPD Int-All-All-C","Small Office Interior Lights",0,6.9332915621654806E-2,0.13798055941429122,0.20487772942683949,0.27105957930699293,0.33533019223807403,0.39703436388062907,0.45619038174973781,0.51433066438953723,0.57153036368347465,0.62839870217207616,0.6842906806763791,0.73964310739141126,0.79315448725822657,0.84413335564121883,0.89288810251873052,0.94136591374477441,0.98866845995144259,1.0352350739006539,1.0805386445442366,1.1240392652720193,1.1658491256208054,1.2065510803226491,1.2464948208222253,1.2852637288998492,1.3229136281176304,1.3591963837228285,1.3938873585867844,1.4274810586670561,1.459916296219955,1.4678044228483766,1.4753528693827516,1.4825762631955504,1.4894886017723914,1.496103279836354,1.5024331153042609,1.5084903741252245,1.5142867940495914,1.5198336073743446,1.5251415627090366,1.5302209458044356,1.5350815994842433,1.5397329427185091,1.544183988875701,1.5484433631888035,1.5525193194692843,1.5564197561013235,1.5601522313472937,1.5637239779941554,1.5671419173691428,1.5704126727519054,1.5735425822090949,1.5765377108762617,1.5794038627108709,1.5821465917392052,1.5847712128189511,1.5872828119383251,1.5896862560716973,1.5919862026108096,1.5926811722349368,1.5933462149374507,1.5939826194374642,1.5945916189590084,1.5951743936207727,1.5957320727229398,1.59626573693554,1.5967764203925736,1.5972651126959552,1.5977327608331622,1.5981802710123076,1.5986085104181884]
[null,null,null,null,null,null,null,null,null,null,null,"Commercial-Small Office-Misc","Small Office Other",0,6.5049074048984801E-2,0.12961288877003452,0.19254871651747618,0.25490448254329323,0.31552476018658898,0.3737496259486135,0.4295797609458149,0.48450060852534804,0.53862967370827386,0.59255002881432661,0.64558461686568358,0.69822889716301062,0.74912926722692108,0.79766148894422517,0.84407319837900718,0.89027154311093082,0.93538683818228885,0.97988233459298557,1.0231730875625844,1.0647621655146473,1.1047813103983244,1.1437401818654092,1.181981225519174,1.2191296929720916,1.2552090257237503,1.2900027002097014,1.3232825510497608,1.3554964504131406,1.3866183891722068,1.3934597527627217,1.4000065121794825,1.406271353726622,1.412266417408095,1.4180033204525671,1.4234931798252672,1.4287466337704351,1.4337738624260981,1.4385846075511346,1.4431881914028439,1.4475935348016091,1.451809174417652,1.4558432793133871,1.4597036667734207,1.4633978174528786,1.4669328898734124,1.470315734294976,1.4735529059902521,1.4766506779474542,1.4796150530261165,1.4824517755894298,1.4851663426356623,1.4877640144502391,1.4902498247991161,1.4926285906832091,1.4949049216727719,1.4970832288398177,1.4991677333058899,1.5011624744217487,1.5017968874300631,1.502403981217924,1.502984932211092,1.503540866175846,1.5040728604004912,1.5045819457829266,1.5050691088283195,1.5055352935607527,1.5059814033525551,1.5064083026748538,1.5068168187727475,1.5072077432683395]
[null,null,null,null,null,null,null,null,null,null,null,"Commercial-Small Office-Motors","Small Office Motors",0,6.4486105882095926E-2,0.12851643936051235,0.19092325887167338,0.25278254237618014,0.3129013961866976,0.37064482452512537,0.4260099521819245,0.48048566483897992,0.53417989800670651,0.58768853165566937,0.64029968948849691,0.69254812282439138,0.74303933244617615,0.79118242287999507,0.83719700246618334,0.88303661342318174,0.92778953041747148,0.97194588291215356,1.0149066941267815,1.0561701740613985,1.0958778912388014,1.1345528947632668,1.1725107989169288,1.2093953506857116,1.2452161111517781,1.279769467283864,1.3128186382009284,1.3448113466110809,1.3757208968672912,1.3824411394543228,1.3888719936045921,1.3950259210211178,1.4009148467785586,1.406550182431612,1.4119428481283138,1.4171032937710908,1.4220415192665712,1.4267670939033945,1.4312891748955698,1.4356165251273167,1.4397575301337728,1.4437202143504775,1.4475122566631133,1.4511410052876454,1.4546134920096856,1.4579364458106809,1.4611163059073273,1.4641592342294769,1.4670711273607207,1.4698576279647813,1.4725241357198635,1.475075817782143,1.4775176187986785,1.4798542704891431,1.4820903008149466,1.4842300427535144,1.4862776426947277,1.4882370684757931,1.4888598037252092,1.489455722624172,1.4900259799437536,1.4905716807280422,1.4910938824354956,1.4915935969880825,1.4920717927321847,1.4925293963150577,1.4929672944804864,1.4933863357871167,1.4937873322527917,1.4941710609280787]
[null,null,null,null,null,null,null,null,null,null,null,"Commercial-Small Office-OffEquip","Small Office Office Eqpmt",0,6.3995012680767738E-2,0.12755702137849875,0.18951636922836565,0.25092557754793221,0.31064484946509263,0.36801262162254444,0.42302234065835997,0.47714811047971795,0.5305164143347364,0.58370632826203916,0.63602840764278357,0.68799607119468897,0.7382437792286165,0.78617236987060879,0.83200265872281931,0.87763014947775109,0.92219544644730556,0.96617095848252388,1.008953306415834,1.0500661243833038,1.0896405115013712,1.1281615520156325,1.1659720514263361,1.202711207408762,1.23839279350955,1.2728112567820344,1.305734961470939,1.337598475283827,1.3683869055995428,1.3749860629416819,1.3813010460442074,1.3873440920753324,1.3931269112438729,1.3986607094912802,1.4039562102065024,1.4090236750057581,1.4138729236174861,1.4185133529110057,1.4229539551057613,1.4272033351964364,1.4312697276277044,1.4351610122509275,1.4388847295937248,1.4424480954719996,1.4458580149727411,1.4491210958346947,1.4522436612528322,1.4552317621314323,1.4580911888095189,1.4608274822813718,1.4634459449338628,1.4659516508214141,1.4683494554984966,1.4706440054287191,1.4728397469887407,1.4749409350844551,1.4769516413961432,1.4788757622685722,1.4794942518393059,1.4800861078878551,1.4806524773123038,1.4811944576227811,1.4817130990682141,1.482209406671499,1.482684342177035,1.4831388259143901,1.4835737385817154,1.4839899229523617,1.4843881855080041,1.4847692980014415]
[null,null,null,null,null,null,null,null,null,null,null,"Commercial-Small Office-Process","Small Office Process",0,6.7860327414714636E-2,0.13509102145065816,0.20066674826841682,0.26560473510415439,0.32867423487853054,0.38922331101678892,0.44726947697992742,0.50436914116938658,0.56056492152119775,0.61648081072363925,0.67147798694967187,0.72595892315422172,0.77864795854728774,0.82880918286774552,0.87677735958042591,0.92452874889767223,0.97113549698186541,1.0170274722602293,1.0617036584479211,1.1045943763765194,1.1457941445939666,1.1859314924354418,1.2253558575081989,1.2636246490864478,1.3008059825473939,1.3366322984874988,1.3708785030677235,1.4040639750023729,1.4361058708323673,1.4434954925979175,1.4505669009860036,1.4573337989650337,1.4638092994234353,1.4700059505798007,1.4759357602988106,1.4816102193600642,1.4870403237248999,1.4922365958443602,1.4972091050495853,1.5019674870641548,1.5065209626761829,1.5108783556063534,1.5150481096065167,1.5190383048219838,1.5228566734492248,1.5265106147193122,1.5300072092361423,1.5333532326972235,1.5365551690236172,1.5396192229244723,1.5425513319205058,1.5453571778497246,1.5480421978776853,1.5506115950336286,1.553070348292904,1.5554232222252253,1.5576747762274468,1.5598293733587589,1.5605288669212165,1.5611982387513195,1.5618387859571596,1.5624517497904995,1.5630383180520688,1.5635996273932835,1.5641367655188478,1.5646507732945074,1.5651426467640381,1.5656133390793785,1.5660637623476468,1.5664947893986212]
[null,null,null,null,null,null,null,null,null,null,null,"Commercial-Small Office-Refrig","Small Office Refrigeration",0,6.0210022012128279E-2,0.12017999721579017,0.17860697226312627,0.23657324592543316,0.29301927005625794,0.34728205544005725,0.39932536192366863,0.45055218013441445,0.50115986716426919,0.55169162279731054,0.60140814357580585,0.65092114119035638,0.69879087513005156,0.74453912447431214,0.78827663348464005,0.83183147805554414,0.87440367391936302,0.91650792200448983,0.9574449425454592,0.99682581702200601,1.0348076151969803,1.0717482794574227,1.1079874961139298,1.1432374243910111,1.1774597925546673,1.2105067043974449,1.2421405651572819,1.272718259978207,1.3022889299900193,1.3080923888742977,1.3136459380458561,1.3189603391669644,1.32404589047903,1.3289124467585185,1.3335694384135315,1.3380258897580415,1.3422904364991994,1.3463713424715993,1.3502765156509293,1.3540135234780393,1.3575896075231209,1.3610116975184141,1.3642864247866373,1.367420135091157,1.3704189009328027,1.3732885333171527,1.3760345930150952,1.3786624013384852,1.3811770504517771,1.3835834132396161,1.3858861527495101,1.3880897312278777,1.3901984187669851,1.3922163015795281,1.3941472899168899,1.3959951256464227,1.3977633895024351,1.3994555080249349,1.400007629129953,1.4005359746849941,1.4010415685175697,1.401525390366924,1.4019883777825741,1.402431427941091,1.4028553993846478,1.4032611136847022,1.4036493570340365,1.4040208817702415,1.4043764078335956,1.4047166241621643]
[null,null,null,null,null,null,null,null,null,null,null,"Commercial-Small Office-Vent","Small Office Ventilation",0,7.1792209715530408E-2,0.14273811244595383,0.21182506605944107,0.28011257560656272,0.3463866906473938,0.4099969877353562,0.47098292635343664,0.53084529645125766,0.58972104025075034,0.64817464179635731,0.70558132420597575,0.76239776496257983,0.81728574522845598,0.86959329934958252,0.91963155624351278,0.96933970011154924,1.0178325990747685,1.0655429326713926,1.111933560196698,1.1564419394398087,1.1992560272350172,1.2409129238369689,1.2817617699776314,1.321400624197423,1.3598788422055657,1.3969581209554827,1.4324208391876498,1.4667444337948112,1.4998836109276941,1.5084823264138374,1.5167107622857452,1.5245848635985755,1.5321198887783172,1.5393304391895535,1.546230487429971,1.5528334044064471,1.5591519852451803,1.5651984740860734,1.5709845878094157,1.576521538740844,1.5818200563785745,1.5868904081850148,1.5917424194830441,1.5963854924955123,1.60082862456486,1.605080425588159,1.6091491347013638,1.6130426362451002,1.6167684750429345,1.620333871021723,1.6237457332023821,1.6270106730881801,1.6301350174765035,1.6331248207189184,1.6359858764532869,1.6387237288306726,1.6413436832587933,1.6438508166828321,1.6445619017193596,1.6452423658691466,1.6458935277349716,1.6465166491376748,1.6471129375613145,1.647683548493027,1.64822958766213,1.6487521131828027,1.6492521376044991,1.649730629874065,1.6501885172133623,1.6506266869160393]
[null,null,null,null,null,null,null,null,null,null,null,"Commercial-not-refrig-warehouse-AirComp","Warehouse Compressed Air",0,6.789953316109118E-2,0.13518752256973746,0.20074684757575417,0.26560680087436833,0.32862458411268097,0.38914376639635384,0.44717871418266558,0.5042129884871801,0.56036999349953975,0.61622687874097826,0.67112068266181324,0.72553757748289927,0.77814093912783489,0.8283122312558493,0.87628963108105962,0.92398358199805386,0.97053412614734769,1.0164071460742394,1.0610200608506126,1.1038750968983062,1.1451101504525203,1.1852232344285643,1.2245726120789227,1.2627809583328156,1.2998759425380391,1.3356433525845717,1.3698560683726511,1.4029596641620743,1.4349339031414203,1.442555218578577,1.4498483433988225,1.4568274102124548,1.4635059430484665,1.4698968835613964,1.4760126161096547,1.4818649917539208,1.4874653512221183,1.4928245468854651,1.4979529637881892,1.5028605397716572,1.5075567847319138,1.5120507990479486,1.5163512912164032,1.5204665947268861,1.5244046842106018,1.5281731908935832,1.5317794173844743,1.5352303518255188,1.5385326814341735,1.5416928054615946,1.5447168475930977,1.547610667814632,1.5503798737682533,1.5530298316186086,1.5555656764514847,1.5579923222245715,1.5603144712897266,1.5625366235051861,1.5632165930826927,1.5638672816736081,1.5644899501816611,1.5650858052132908,1.5656560014158072,1.566201643714866,1.5667237894555921,1.5672234504515024,1.5677015949451962,1.5681591494846163,1.568597000718511,1.5690159971145825]
[null,null,null,null,null,null,null,null,null,null,null,"Commercial-not-refrig-warehouse-Cook","Warehouse Cooking",0,6.7998570090180843E-2,0.13537449435425314,0.20106684778932946,0.2660980769950067,0.32926394039056284,0.38991121620726732,0.44806091153067584,0.50524482831961481,0.56152855098743903,0.6175239861763625,0.67258524575713485,0.72714098858266807,0.77989522384576981,0.83014140923410018,0.87819128100060539,0.92600404429120475,0.97266906865368563,1.0186281539932702,1.0633565214090235,1.1063035544491897,1.1475744936782788,1.1877679911818071,1.2272305064441467,1.2655386914711277,1.3027491067254464,1.3386094929522665,1.3728961811042153,1.4061066197471512,1.4381740448055809,1.4456608965348177,1.452825347950355,1.4596812823192904,1.4662419850646831,1.4725201695100349,1.4785280015151563,1.4842771230511576,1.4897786747602497,1.4950433175440698,1.5000812532223669,1.5049022443020768,1.5095156328951005,1.5139303588214392,1.5181549769327682,1.5221976736900207,1.5260662830271043,1.5297683015314907,1.5333109029710947,1.5367009521955963,1.5399450184391383,1.5430493880501837,1.5460200766731933,1.5488628409057383,1.5515831894536287,1.5541863938056766,1.5566774984487846,1.5590613306431464,1.5613425097765072,1.5635254563156082,1.5642195201398315,1.5648836960481793,1.5655192710800909,1.5661274768522553,1.5667094919452356,1.5672664441873221,1.5677994128400361,1.5683094306895236,1.5687974860478844,1.5692645246683257,1.5697114515778388,1.5701391328309613]
[null,null,null,null,null,null,null,null,null,null,null,"Commercial-not-refrig-warehouse-Cool","Warehouse Cooling",0,0.10690364234024846,0.21110529837524356,0.31215500869754326,0.41124568045106019,0.50678403395662608,0.59818872032679782,0.68576776097752412,0.77112044431703008,0.85447618613059451,0.93627182003944631,1.0160450028169259,1.0942969671366383,1.1694477962249201,1.2409046185012917,1.3092547467409481,1.3767907420791474,1.4424088398464245,1.506441917603581,1.5685532048718209,1.6277157286835431,1.6846208705986889,1.7399566373027189,1.7939395971626042,1.8461697119356062,1.8967365615940397,1.9453713448240626,1.9918846824596619,2.0368740658187803,2.0802049008177348,2.0981897453519283,2.1154001228966108,2.1318693837049194,2.1476294418946886,2.1627108372915971,2.1771427946092126,2.1909532800806151,2.2041690556513349,2.2168157308386269,2.2289178123575666,2.2404987516101404,2.2515809901293498,2.2621860030663923,2.2723343408051888,2.2820456687848987,2.2913388056075874,2.3002317595048973,2.3087417632343805,2.3168853074731204,2.3246781727733499,2.3321354601419904,2.3392716203033688,2.346100481701817,2.3526352772984183,2.3588886702138261,2.3648727782668479,2.3705991974563427,2.3760790244319359,2.3813228779970967,2.3824017438415264,2.3834341513481578,2.3844221011152689,2.3853675075909728,2.3862722027830348,2.3871379398089312,2.3879663962930429,2.3887591776175512,2.3895178200333484,2.3902437936369827,2.3909385052194079,2.3916033009920632]
[null,null,null,null,null,null,null,null,null,null,null,"Commercial-not-refrig-warehouse-ExtLight","Warehouse Exterior Lights",0,5.6222484406656989E-2,0.11240271044334774,0.16711208709180692,0.22136354565909061,0.27434257325705824,0.32534554469717397,0.37429834561377329,0.42246410740893159,0.47020400510682325,0.51794612261844486,0.56494828534021702,0.61192084106597333,0.65737809709193784,0.70099089238329448,0.74273139761341311,0.78421407294012879,0.82482668535566506,0.86512644571474306,0.90424496967960155,0.94196220074918657,0.97846921369800244,1.0138711989568663,1.04855601536663,1.0823322549153012,1.115093575887304,1.1467702791491703,1.1771440833167013,1.2064206172898104,1.234778203699058,1.23982883972104,1.2446619842396831,1.2492870029178105,1.2537128581121908,1.2579481262407843,1.2620010144021179,1.2658793762789922,1.2695907273573404,1.2731422594897313,1.2765408548317321,1.2797930991781443,1.2829052947249504,1.2858834722817025,1.2887334029580204,1.2914606093468415,1.2940703762260959,1.2965677607995449,1.2989576024966256,1.3012445323502912,1.303432981971024,1.3055271921344045,1.3075312209988836,1.3094489519696768,1.3112841012240246,1.3130402249123954,1.3147207260495926,1.3163288611091113,1.3178677463335313,1.3193403637731673,1.319822274439439,1.3202834329717565,1.3207247330026821,1.3211470296829937,1.3215511413387941,1.3219378510572637,1.3223079082041245,1.3226620298757616,1.3230009022888116,1.3233251821099119,1.3236354977281897,1.323932450472953]
[null,null,null,null,null,null,null,null,null,null,null,"Commercial-not-refrig-warehouse-Heat","Warehouse Heating",0,0.10332640422290533,0.20452309727390891,0.30272703571139159,0.39850193574160997,0.49142210140958831,0.58083965651557057,0.66681309173037762,0.75048804753450638,0.83227061015362869,0.91265942273256329,0.99126624281939402,1.0682602858584829,1.1429984874752173,1.2147733575022683,1.2835458140743878,1.3507563726641292,1.4160967183182427,1.4800545605500597,1.5419384411076147,1.601743909553204,1.6591737325164213,1.7145574018353362,1.7685800216160625,1.820741665783955,1.8712473741102706,1.9197782269463322,1.9662747556081337,2.0110566099252698,2.0541909909594409,2.0712864345610309,2.0876457107348014,2.1033005204704671,2.1182811996433526,2.1326167777992246,2.1463350344077141,2.1594625526933497,2.1720247711485041,2.1840460328280771,2.1955496325214483,2.2065578618930957,2.2170920526793609,2.2271726180250693,2.2368190920401014,2.2460501676525721,2.2548837328319702,2.2633369052524466,2.2714260654634288,2.279166888631833,2.2865743749173872,2.2936628785399269,2.3004461355949894,2.3069372906716037,2.3131489223238662,2.3190930674456487,2.3247812445956795,2.3302244763181976,2.3354333105024252,2.3404178408222602,2.3421304208140477,2.3437692533420744,2.3453375141344441,2.3468382421654201,2.3482743455443442,2.3496486071509706,2.350963690028125,2.3522221425421486,2.3534264033211181,2.3545788059804189,2.3556815836448215,2.3567368732758291]
[null,null,null,null,null,null,null,null,null,null,null,"Commercial-not-refrig-warehouse-HotWater","Warehouse Hot Water",0,6.4754305935306095E-2,0.1290790136611229,0.19172831168838325,0.25379821568242639,0.31416168342771011,0.37216544857639838,0.42777778005388412,0.48248077261009986,0.53636910644850733,0.59007390028743933,0.64286883883346024,0.69527759446615311,0.74596091446589852,0.79434265907502977,0.84057030288256429,0.88656209001376218,0.93145586777666101,0.97574568882987789,1.0188105051324088,1.0602455709206815,1.100107347123672,1.1388980159948665,1.1769570632274911,1.2139312275824314,1.2498365806349918,1.2844720607265796,1.3175970007599962,1.3496516785990167,1.3806175168071664,1.3874736631363549,1.3940345687145259,1.4003129472582299,1.4063209650034014,1.4120702642810774,1.4175719860778964,1.4228367916250919,1.4278748830578147,1.432696023184822,1.4373095544068388,1.4417244168202521,1.4459491655412218,1.4499919872837763,1.4538607162240198,1.4575628491811907,1.4611055601449907,1.4644957141773352,1.4677398807154638,1.4708443463021899,1.4738151267679565,1.476657978888307,1.4793784115393604,1.4819816963729042,1.4844728780317977,1.4868567839254758,1.4891380335844979,1.4913210476122705,1.4934100562512869,1.4954091075804894,1.4960532793423975,1.4966697116504435,1.4972595990265642,1.4978240845539521,1.4983642620921227,1.4988811783965919,1.4993758351472803,1.4998491908895657,1.5003021628917526,1.5007356289225537,1.5011504289520283,1.5015473667792767]
[null,null,null,null,null,null,null,null,null,null,null,"C-War-Lgt-LPD Int-All-All-C","Warehouse Interior Lights",0,6.7362902845111899E-2,0.13415042478543174,0.19921817619968424,0.26360283871734358,0.32616901233163526,0.38626139005955101,0.4438847052295164,0.50052024943432838,0.55629246870640547,0.61178478717308749,0.66632177693110817,0.72040390467676862,0.77268585055325878,0.82255389686322422,0.87024002230641506,0.91765002555267772,0.96392438257459334,1.009536848634139,1.0538934161750961,1.0965096204873723,1.1375140519177298,1.1774079452993067,1.2165415407018605,1.2545445477384458,1.2914397271555431,1.3270163131647019,1.3610480615975979,1.3939757997914053,1.4257822588371458,1.4332771179718404,1.4404492319763327,1.4473124989662773,1.4538802185738802,1.4601651177199113,1.4661793752759222,1.4719346456644491,1.4774420814429441,1.4827123549151877,1.4877556788120718,1.4925818260818173,1.4972001488279854,1.5016195964319738,1.5058487328951209,1.5098957534340172,1.5137685003611909,1.5174744782819314,1.521020868636707,1.5244145436173533,1.5276620794840006,1.5307697693085436,1.5337436351693501,1.5365894398208395,1.5393126978605423,1.5419186864152818,1.5444124553671859,1.5467988371393429,1.5490824560600669,1.5512677373239179,1.5519409359404472,1.5525851451428674,1.5532016132791548,1.5537915349406739,1.5543560532770557,1.5548962622113924,1.5554132085600401,1.5559078940611384,1.5563812773157777,1.556834275645576,1.5572677668702635,1.5576825910087204]
[null,null,null,null,null,null,null,null,null,null,null,"Commercial-not-refrig-warehouse-Misc","Warehouse Other",0,6.7486848935967236E-2,0.13438997649093312,0.19955513465442198,0.26402978301945595,0.32668306815823078,0.3868594256726679,0.44456016169615681,0.50126273984690017,0.55710046553114168,0.6126526528534485,0.66724139836301732,0.7213765044526731,0.77370369797991601,0.82362033918819744,0.87135494297776794,0.91880577413531017,0.96511920911377413,1.0107700470646888,1.0551572756299181,1.0978038374272892,1.1388446084836763,1.1787689427293342,1.2179254116299749,1.2559520054151458,1.292866082283423,1.3284630955112575,1.3625160337338627,1.3954600409464224,1.427283975771632,1.4348421147060437,1.4420747835428014,1.4489959977406555,1.4556191692218556,1.4619571323617602,1.4680221688592763,1.4738260315363252,1.4793799671124483,1.484694737998691,1.4897806431529899,1.4946475380374866,1.4993048537164309,1.5037616151316886,1.5080264585912651,1.5121076485047356,1.5160130933980089,1.5197503612384615,1.5233266941001389,1.5267490221974378,1.5300239773144704,1.533157905656128,1.5361568801457528,1.5390267121932406,1.5417729629563868,1.5444009541172923,1.5469157781947138,1.5493223084123422,1.5516252081421298,1.5538289399409697,1.5544940379800378,1.5551304954336915,1.5557395456285756,1.5563223687815746,1.5568800942868366,1.5574138029043123,1.5579245288540498,1.5584132618203057,1.5588809488693545,1.559328496284712,1.5597567713233318,1.5601666038961737]
[null,null,null,null,null,null,null,null,null,null,null,"Commercial-not-refrig-warehouse-Motors","Warehouse Motors",0,6.6550225451671191E-2,0.13255770834227429,0.19685456242714505,0.26049186544858388,0.32234673433508454,0.38175949122879776,0.43873536109934586,0.49473630524069256,0.54990463690141378,0.6048118071769113,0.65877776227618023,0.71231645313579739,0.7640689700878377,0.81345178649716732,0.86066795311674271,0.90761508329177021,0.95344696922208627,0.99864111953499968,1.0425875099399431,1.0848152211544426,1.1254677382720186,1.1650070265301207,1.2037905619674005,1.2414624230311673,1.2780319262909807,1.3133047599250034,1.3470490517725189,1.379691489985547,1.4112269855078212,1.4185558411211372,1.425569100081248,1.4322803526746557,1.4387026039602131,1.444848298970316,1.4507293468268738,1.4563571438187952,1.4617425954857055,1.4668961377506915,1.4718277571430225,1.476547010150038,1.4810630417356987,1.4853846030616897,1.4895200684454133,1.4934774515877325,1.4972644211019135,1.500888315373857,1.5043561567824155,1.5076746653073518,1.5108502715513099,1.5138891292010306,1.5167971269519596,1.5195798999193557,1.5222428405580122,1.5247911091117505,1.5272296436129356,1.52956316945139,1.5317962085312509,1.53393308803351,1.5345866378373578,1.5352120443482173,1.5358105194782261,1.536383222951919,1.5369312645535387,1.5374557062775769,1.5379575643867045,1.5384378113810846,1.5388973778828841,1.5393371544396297,1.5397579932499126,1.5401607098147769]
[null,null,null,null,null,null,null,null,null,null,null,"Commercial-not-refrig-warehouse-OffEquip","Warehouse Office Eqpmt",0,6.6404179018475229E-2,0.13226869477506423,0.19646266609219101,0.26002393675940194,0.32179712736567667,0.38112528747222557,0.43801375599238895,0.49395530379498725,0.54905895148728867,0.60391454192811578,0.65784944528787792,0.71134913707342651,0.76307481838773328,0.81239376061747315,0.85955473875217581,0.90647411500779618,0.9522790889702083,0.99743472967486857,1.0413622234366424,1.0835624556589998,1.1241585239257541,1.1636714892648714,1.2024486115136153,1.2401087445947419,1.2766806456408299,1.3119445426059404,1.3456725177186428,1.3783183837226669,1.4098526268244058,1.41704577023019,1.4239291610491225,1.4305161379093447,1.4368194650483137,1.4428513570473267,1.448623502500928,1.4541470866670534,1.4594328131418146,1.4644909246009161,1.4693312226479034,1.4739630868076998,1.478395492702242,1.4826370294434306,1.4866959162771036,1.490580018510284,1.4942968627525615,1.4978536515011527,1.5012572770978905,1.5045143350851993,1.5076311369869304,1.5106137225388263,1.5134678713923149,1.5161991143143139,1.5188127439047432,1.5213138248525226,1.5237072037499193,1.52599751848427,1.5281892072252754,1.5302865170252808,1.530948662744793,1.5315822950122691,1.5321886416797099,1.5327688777251081,1.5333241275293168,1.5338554670548754,1.5343639259310082,1.5348504894488384,1.5353161004706857,1.5357616612571421,1.5361880352154738,1.536596048572729]
[null,null,null,null,null,null,null,null,null,null,null,"Commercial-not-refrig-warehouse-Process","Warehouse Process",0,7.5196495367194499E-2,0.14945608989618717,0.22173420487875306,0.29306665048933755,0.36226536545624727,0.42868635370045127,0.4923602968857565,0.55482833373335505,0.61617053737364902,0.67700454380404651,0.73670375277005506,0.79569438471899789,0.85269728137326251,0.9070072202849615,0.95894871560200168,1.0104838084732735,1.0607172593587055,1.1100907031233638,1.1580843605175055,1.2041552301572636,1.2484150179286937,1.2914680527361588,1.3336689119452771,1.3745970825642937,1.4143132905448157,1.4525707759625783,1.4891528279354307,1.5245599667627467,1.5587321837065977,1.5682227792733696,1.5773046889066444,1.5859955115222182,1.594312088187839,1.602270534757811,1.6098862731022821,1.617174060991728,1.6241480206945471,1.6308216663431778,1.6372079301217719,1.6433191873261679,1.6491672803447288,1.6547635416065096,1.6601188155412281,1.6652434795935904,1.6701474643326928,1.6748402726954705,1.6793309984014777,1.6836283435746902,1.6877406356064728,1.6916758432923888,1.6954415922741271,1.6990451798164599,1.7024935889478792,1.7057935019922994,1.7089513135180603,1.7119731427293148,1.7148648453238167,1.7176320248400865,1.7184058997206029,1.7191464498454991,1.7198551102520985,1.7205332541818585,1.7211821957414375,1.7218031924491686,1.7223974476718777,1.722966112956767,1.7235102902628809,1.7240310340964828,1.7245293535544752,1.7250062142798268]
[null,null,null,null,null,null,null,null,null,null,null,"Commercial-not-refrig-warehouse-Refrig","Warehouse Refrigeration",0,6.0460333039340584E-2,0.12066947227254193,0.17935403160582672,0.23756838955060888,0.29423077642893608,0.34868999997200928,0.40090522218903335,0.45231562176770107,0.50309987343602625,0.5537991065328679,0.60366052135051251,0.65332430246425266,0.70131397636105064,0.74715773444504019,0.79099210390464814,0.83465941237208108,0.87732852726620625,0.9195268842494817,0.96055772888100044,1.0000062511231405,1.0380500750567183,1.0750669907500434,1.1113751940824661,1.1466946115802856,1.1809873035109155,1.21410248569284,1.2457998772718664,1.2764394399459329,1.3060738364548725,1.3119413762435455,1.3175562468547157,1.3229293287792805,1.3280710339702517,1.332991326019028,1.3376997394628329,1.3422053982607325,1.3465170334740335,1.3506430001853262,1.3545912936889557,1.3583695649842948,1.3619851356018444,1.365445011790887,1.3687558980961909,1.3719242103500702,1.3749560881049785,1.3778574065307283,1.3806337877993886,1.3832906119799244,1.3858330274636907,1.3882659609409791,1.3905941269479536,1.3928220370024746,1.394954008346514,1.3969941723121018,1.3989464823270183,1.4008147215757425,1.4026025103305024,1.4043133129666363,1.4048606783686939,1.4053844730118115,1.405885711904747,1.4063653663477473,1.4068243658147332,1.4072635997544327,1.4076839193139536,1.4080861389881365,1.4084710381978809,1.4088393628005071,1.4091918265350778,1.4095291124054801]
[null,null,null,null,null,null,null,null,null,null,null,"Commercial-not-refrig-warehouse-Vent","Warehouse Ventilation",0,7.0933942307957729E-2,0.14108603558271843,0.20936513909989202,0.27683153741747429,0.34233814620203978,0.40523278164445475,0.46554129511897274,0.5247255132392139,0.58295766403675164,0.64078706042800915,0.69756139724677801,0.75379251204093267,0.80810993219612626,0.85993446660720996,0.9095017927547423,0.95871497119811289,1.0067299429375305,1.0540066778149035,1.0999499081135238,1.1440568324865441,1.1865174164798193,1.2278056311224974,1.2682654679533207,1.307539806269961,1.3456509478882241,1.3823921446151208,1.4175453483854374,1.451542611681562,1.4843755356606421,1.4928725672241396,1.5010036979069126,1.5087846842062165,1.5162306041098568,1.5233558863142973,1.5301743381845754,1.5366991725102004,1.5429430331088843,1.5489180193277208,1.5546357094892869,1.5601071833281057,1.565343043460947,1.5703534359325655,1.575148069876698,1.5797362363304133,1.5841268262382748,1.5883283476812045,1.5923489423634338,1.5961964013894907,1.5998781803617939,1.6034014138281127,1.6067729291068868,1.6099992595171968,1.6130866570390243,1.6160411044283332,1.6188683268104469,1.6215738027741922,1.6241627749883025,1.6266402603606569,1.6273484391162281,1.6280261221359136,1.62867462263322,1.6292951972717908,1.6298890486005666,1.6304573273840843,1.6310011348324267,1.6315215247351467,1.6320195055032998,1.6324960421235417,1.6329520580280796,1.6333884368840967]
[null,null,null,null,null,null,null,null,null,null,null,"None","None",0,0,0,0,0,0,0,0,0,0,0,0,0,0,0,0,0,0,0,0,0,0,0,0,0,0,0,0,0,0,0,0,0,0,0,0,0,0,0,0,0,0,0,0,0,0,0,0,0,0,0,0,0,0,0,0,0,0,0,0,0,0,0,0,0,0,0,0,0,0,0]

{"sheet":"Com LU Table","index":7,"n_rows":18,"n_cols":16,"rows_kept":18,"cut":false,"hidden":true,"merged":[]}
[]
[null,null,"Compressed Air","Cooking","Cooling","Exterior Lighting","Heating","Hot Water","Indoor Lighting","Misc","Motors","Office Equipment","Process","Refrigeration","Ventilation","None"]
[null,"College","Commercial-college-AirComp","Commercial-college-Cook","Commercial-college-Cool","Commercial-college-ExtLight","Commercial-college-Heat","Commercial-college-HotWater","C-Unv-Lgt-LPD Int-All-All-C","Commercial-college-Misc","Commercial-college-Motors","Commercial-college-OffEquip","Commercial-college-Process","Commercial-college-Refrig","Commercial-college-Vent","None"]
[null,"Grocery","Commercial-Grocery-AirComp","Commercial-Grocery-Cook","Commercial-Grocery-Cool","Commercial-Grocery-ExtLight","Commercial-Grocery-Heat","Commercial-Grocery-HotWater","C-Gro-Lgt-LPD Int-All-All-C","Commercial-Grocery-Misc","Commercial-Grocery-Motors","Commercial-Grocery-OffEquip","Commercial-Grocery-Process","Commercial-Grocery-Refrig","Commercial-Grocery-Vent","None"]
[null,"Healthcare","Commercial-Healthcare-AirComp","Commercial-Healthcare-Cook","Commercial-Healthcare-Cool","Commercial-Healthcare-ExtLight","Commercial-Healthcare-Heat","Commercial-Healthcare-HotWater","C-Hos-Lgt-LPD Int-All-All-C","Commercial-Healthcare-Misc","Commercial-Healthcare-Motors","Commercial-Healthcare-OffEquip","Commercial-Healthcare-Process","Commercial-Healthcare-Refrig","Commercial-Healthcare-Vent","None"]
[null,"Lodging","Commercial-Lodging-AirComp","Commercial-Lodging-Cook","Commercial-Lodging-Cool","Commercial-Lodging-ExtLight","Commercial-Lodging-Heat","Commercial-Lodging-HotWater","C-Lod-Lgt-LPD Int-All-All-C","Commercial-Lodging-Misc","Commercial-Lodging-Motors","Commercial-Lodging-OffEquip","Commercial-Lodging-Misc","Commercial-Lodging-Refrig","Commercial-Lodging-Vent","None"]
[null,"Large Office","Commercial-large Office-AirComp","Commercial-large Office-Cook","Commercial-large Office-Cool","Commercial-large Office-ExtLight","Commercial-large Office-Heat","Commercial-large Office-HotWater","C-LOff-Lgt-LPD Int-All-All-C","Commercial-large Office-Misc","Commercial-large Office-Motors","Commercial-large Office-OffEquip","Commercial-large Office-Process","Commercial-large Office-Refrig","Commercial-large Office-Vent","None"]
[null,"Other","Commercial-Misc. Com-AirComp","Commercial-Misc. Com-Cook","Commercial-Misc. Com-Cool","Commercial-Misc. Com-ExtLight","Commercial-Misc. Com-Heat","Commercial-Misc. Com-HotWater","C-Oth-Lgt-LPD Int-All-All-C","Commercial-Misc. Com-Misc","Commercial-Misc. Com-Motors","Commercial-Misc. Com-OffEquip","Commercial-Misc. Com-Process","Commercial-Misc. Com-Refrig","Commercial-Misc. Com-Vent","None"]
[null,"Restaurant","Commercial-Resturant-AirComp","Commercial-Resturant-Cook","Commercial-Resturant-Cool","Commercial-Resturant-ExtLight","Commercial-Resturant-Heat","Commercial-Resturant-HotWater","C-Res-Lgt-LPD Int-All-All-C","Commercial-Resturant-Misc","Commercial-Resturant-Motors","Commercial-Resturant-OffEquip","Commercial-Resturant-Process","Commercial-Resturant-Refrig","Commercial-Resturant-Vent","None"]
[null,"Retail","Commercial-Retail-AirComp","Commercial-Retail-Cook","Commercial-Retail-Cool","Commercial-Retail-ExtLight","Commercial-Retail-Heat","Commercial-Retail-HotWater","C-Ret-Lgt-LPD Int-All-All-C","Commercial-Retail-Misc","Commercial-Retail-Motors","Commercial-Retail-OffEquip","Commercial-Retail-Process","Commercial-Retail-Refrig","Commercial-Retail-Vent","None"]
[null,"School","Commercial-School-AirComp","Commercial-School-Cook","Commercial-School-Cool","Commercial-School-ExtLight","Commercial-School-Heat","Commercial-School-HotWater","C-K12-Lgt-LPD Int-All-All-C","Commercial-School-Misc","Commercial-School-Motors","Commercial-School-OffEquip","Commercial-School-Process","Commercial-School-Refrig","Commercial-School-Vent","None"]
[null,"Small Office","Commercial-Small Office-AirComp","Commercial-Small Office-Cook","Commercial-Small Office-Cool","Commercial-Small Office-ExtLight","Commercial-Small Office-Heat","Commercial-Small Office-HotWater","C-SOff-Lgt-LPD Int-All-All-C","Commercial-Small Office-Misc","Commercial-Small Office-Motors","Commercial-Small Office-OffEquip","Commercial-Small Office-Process","Commercial-Small Office-Refrig","Commercial-Small Office-Vent","None"]
[null,"Warehouse","Commercial-not-refrig-warehouse-AirComp","Commercial-not-refrig-warehouse-Cook","Commercial-not-refrig-warehouse-Cool","Commercial-not-refrig-warehouse-ExtLight","Commercial-not-refrig-warehouse-Heat","Commercial-not-refrig-warehouse-HotWater","C-War-Lgt-LPD Int-All-All-C","Commercial-not-refrig-warehouse-Misc","Commercial-not-refrig-warehouse-Motors","Commercial-not-refrig-warehouse-OffEquip","Commercial-not-refrig-warehouse-Process","Commercial-not-refrig-warehouse-Refrig","Commercial-not-refrig-warehouse-Vent","None"]
[]
[]
[null,null,"How to lookup:"]
[null,null,"Select Sector","End Use","Load Profile"]
[null,null,"College","Cooling",{"$f":"INDEX(C3:O13, MATCH(C18, B3:B13, 0), MATCH(D18, C2:O2, 0))","v":"Commercial-college-Cool"}]