{"text_format":"1","workbook":"xlsx","n_sheets":8,"sheets":["User Terms and Conditions","Instructions","Calculator","Hidden Cells","Incentives","Lists","Avoided Costs","Com LU Table"],"not_rendered":{"charts":0,"images":0,"macros":1,"external_links":3,"defined_names":137,"comments":1,"pivot_tables":0},"unopened":[],"bounds":{"document_bytes":16777216,"sheet_cells":100000,"rows_first":2000,"rows_last":500,"rows_between":2000,"halvings":0,"cell_chars":16384,"cell_head_chars":4096},"cells_cut":0,"cells_raw":0,"read":"whole","date_system":"1900"}

{"sheet":"User Terms and Conditions","index":0,"n_rows":15,"n_cols":1,"rows_kept":15,"cut":false,"hidden":false,"merged":[]}
["EXISTING BUILDINGS ATAC COST-EFFECTIVENESS CALCULATOR TOOL TERMS AND CONDITONS OF USE:"]
[]
["·         This Existing Buildings ATAC Cost-Effectiveness (C/E) Calculator tool and its information (the Tool) was developed and is made available by Energy Trust of Oregon, Inc. (Energy Trust) to its authorized Existing Buildings Allied Technical Assistance Contractors (ATACs) for informational purposes only. Use of this Tool is subject to acceptance of these Terms and Conditions of Use. "]
[]
["·         This Tool is intended for the sole purpose of assisting ATACs with an initial, high-level C/E review to help inform ATAC’s discussion with Energy Trust’s Existing Buildings program management contractor (PMC) about whether a potential custom measure may be a good candidate to propose for additional technical analysis under the Existing Buildings program. "]
[]
["·         ATAC will only allow its trained employees to access and use the Tool and will not distribute the Tool to any other entity. Details about Energy Trust’s Existing Buildings C/E criteria, program or incentives as may be included in the Tool are time sensitive and subject to change. "]
[]
["·         ATAC will use the most current version of the Tool at all times and will immediately discontinue its use of the Tool if its Existing Buildings ATAC status is terminated."]
[]
["·         To meet Energy Trust C/E criteria, a measure must pass both a utility system and total resource cost test. Changes to formula assumptions or an ATAC’s inputs or estimates such as business type, non-energy benefits, avoided costs, discount rates, measure description, measure life, costs or savings will impact C/E test results. While ATACs are expected to use the Tool according to Existing Buildings requirements, the inputs and estimates used by Energy Trust or its PMC may differ from those used by ATAC and C/E test results may vary. "]
[]
["·         Final determination about whether a proposed measure meets Energy Trust’s C/E criteria or may otherwise qualify for additional technical analysis and Energy Trust incentives rests solely with Energy Trust. "]
[]
["·         Actual cost or savings results from a customer’s program participation may vary from the estimates or examples provided in the Tool for a number of reasons. Energy Trust does not guarantee any particular cost or energy savings results from participation in its programs and shall not be responsible for any claims relating to errors, omissions or other inaccuracies resulting from the use of the Tool, or from the reliance on information procured therefrom. "]

{"sheet":"Instructions","index":1,"n_rows":8,"n_cols":1,"rows_kept":8,"cut":false,"hidden":false,"merged":[[11,0,11,9],[10,0,10,9],[9,0,9,9],[8,0,8,9],[7,0,7,9],[18,0,18,9],[12,0,12,9],[13,0,13,9],[14,0,14,9],[15,0,15,9],[16,0,16,9],[17,0,17,9],[6,0,6,9],[0,0,0,9],[3,0,3,9],[2,0,2,9],[4,0,4,9],[5,0,5,9],[1,0,1,9]]}
["Instructions for use of Energy Trust Cost Effectiveness Calculator"]
["1. Enter the site utility information in the upper-right section of the calculator."]
["2. Enter the measure name or description in the first column."]
["3. Select the business type."]
["4. Choose the best appropriate load profile descriptors for when the savings happen."]
["    For example, choose \"Res Ele Resistance Heating\" for weatherization measures at a home with resistance heat, since the savings primarily happen during the heating season."]
["If there are no savings for a particular fuel, choose \"None\" for the load profile for that fuel."]
["5. Enter the measure life, estimated savings, incremental measure cost, annual non-energy benefit value (if any), and incentive in the remaining columns."]

{"sheet":"Calculator","index":2,"n_rows":26,"n_cols":12,"rows_kept":26,"cut":false,"hidden":false,"merged":[[25,0,26,0],[0,0,0,5],[1,0,1,5],[2,0,2,5],[3,2,3,3],[3,4,3,5],[4,1,4,5],[5,1,5,5],[25,1,26,9],[6,1,6,5],[12,0,13,0],[12,1,13,1],[12,2,13,2],[12,4,12,5],[12,11,13,11],[7,1,7,5],[9,1,9,5],[10,2,10,3],[10,4,10,5],[12,6,13,6],[12,7,12,8],[0,6,10,11],[12,9,13,9],[12,10,13,10]]}
["Energy Trust of Oregon",null,null,null,null,null,"Please read the Terms and Conditions of Use and the Instructions carefully before using this Tool. \n\nOnly active, approved Existing Buildings ATACs are allowed to access this Tool subject to the Terms and Conditions of Use. This Tool is intended for the sole purpose of assisting ATACs with an initial, high-level C/E review to help inform ATAC’s discussion with Energy Trust’s Existing Buildings PMC about whether a potential custom measure may be a good candidate for additional technical analysis under the Existing Buildings program. Details about Energy Trust’s Existing Buildings C/E criteria, program or incentives as may be included in the Tool are time sensitive and subject to change. Final determination about whether a proposed measure meets Energy Trust’s C/E criteria or may otherwise qualify for additional technical analysis or Energy Trust incentives rests solely with Energy Trust. "]
["ATAC Cost-Effectiveness Calculator Tool"]
["Commercial Sector "]
["Version: ",{"$f":"version","v":"v2025.1"},"Today's Date:"]
["ATAC Name:"]
["Customer Name:"," "]
["Project Name:"," "]
["Site Address:"]
["City:",null,"State",null,"Zip:"," "]
["Sector","Commercial"]
["Electric Utility:","PGE","Gas Utility:"]
[]
["#","Measure","Sub-sector",null,"Load Profile",null,"Measure Life (yrs)","Savings",null,"Measure Cost ($)","Non-Energy Benefits (Annual $)","Likelihood of Meeting Cost Effectiveness Criteria"]
[null,null,null,"RCx?","Electric","Gas",null,"kWh","therms"]
[1,null,null,null,null,null,null,null,null,null,null,{"$f":"IF(AND(N('Hidden Cells'!B15)>=0.95, N('Hidden Cells'!C15)>=0.95), \"Yes\", IF(AND(N('Hidden Cells'!C15)>=0.8, N('Hidden Cells'!C15)>=0.8), \"Maybe\", \"No\"))","v":"No"}]
[{"$f":"A15+1","v":2},null,null,null,null,null,null,null,null,null,null,{"$f":"IF(AND(N('Hidden Cells'!B16)>=0.95, N('Hidden Cells'!C16)>=0.95), \"Yes\", IF(AND(N('Hidden Cells'!C16)>=0.8, N('Hidden Cells'!C16)>=0.8), \"Maybe\", \"No\"))","v":"No"}]
[3,null,null,null,null,null,null,null,null,null,null,{"$f":"IF(AND(N('Hidden Cells'!B17)>=0.95, N('Hidden Cells'!C17)>=0.95), \"Yes\", IF(AND(N('Hidden Cells'!C17)>=0.8, N('Hidden Cells'!C17)>=0.8), \"Maybe\", \"No\"))","v":"No"}]
[4,null,null,null,null,null,null,null,null,null,null,{"$f":"IF(AND(N('Hidden Cells'!B18)>=0.95, N('Hidden Cells'!C18)>=0.95), \"Yes\", IF(AND(N('Hidden Cells'!C18)>=0.8, N('Hidden Cells'!C18)>=0.8), \"Maybe\", \"No\"))","v":"No"}]
[5,null,null,null,null,null,null,null,null,null,null,{"$f":"IF(AND(N('Hidden Cells'!B19)>=0.95, N('Hidden Cells'!C19)>=0.95), \"Yes\", IF(AND(N('Hidden Cells'!C19)>=0.8, N('Hidden Cells'!C19)>=0.8), \"Maybe\", \"No\"))","v":"No"}]
[6,null,null,null,null,null,null,null,null,null,null,{"$f":"IF(AND(N('Hidden Cells'!B20)>=0.95, N('Hidden Cells'!C20)>=0.95), \"Yes\", IF(AND(N('Hidden Cells'!C20)>=0.8, N('Hidden Cells'!C20)>=0.8), \"Maybe\", \"No\"))","v":"No"}]
[7,null,null,null,null,null,null,null,null,null,null,{"$f":"IF(AND(N('Hidden Cells'!B21)>=0.95, N('Hidden Cells'!C21)>=0.95), \"Yes\", IF(AND(N('Hidden Cells'!C21)>=0.8, N('Hidden Cells'!C21)>=0.8), \"Maybe\", \"No\"))","v":"No"}]
[8,null,null,null,null,null,null,null,null,null,null,{"$f":"IF(AND(N('Hidden Cells'!B22)>=0.95, N('Hidden Cells'!C22)>=0.95), \"Yes\", IF(AND(N('Hidden Cells'!C22)>=0.8, N('Hidden Cells'!C22)>=0.8), \"Maybe\", \"No\"))","v":"No"}]
[9,null,null,null,null,null,null,null,null,null,null,{"$f":"IF(AND(N('Hidden Cells'!B23)>=0.95, N('Hidden Cells'!C23)>=0.95), \"Yes\", IF(AND(N('Hidden Cells'!C23)>=0.8, N('Hidden Cells'!C23)>=0.8), \"Maybe\", \"No\"))","v":"No"}]
[10,null,null,null,null,null,null,null,null,null,null,{"$f":"IF(AND(N('Hidden Cells'!B24)>=0.95, N('Hidden Cells'!C24)>=0.95), \"Yes\", IF(AND(N('Hidden Cells'!C24)>=0.8, N('Hidden Cells'!C24)>=0.8), \"Maybe\", \"No\"))","v":"No"}]
[]
["Comments:"]

{"sheet":"Hidden Cells","index":3,"n_rows":24,"n_cols":15,"rows_kept":24,"cut":false,"hidden":true,"merged":[[12,1,13,1],[12,2,13,2],[12,5,12,6],[12,0,13,0],[12,14,13,14]]}
[]
[]
[]
[]
[]
[]
[]
[]
[]
[]
[]
[]
["Eligible Incentive ($)","Utility BCR ","TRC BCR",null,null,"Incentive Split",null,null,"Incentive Calculator",null,null,null,null,null,"Eligible Incentive"]
[null,null,null,null,"Full Ele Load Profile","Electric","Gas",null,"Measure","Project Type","Simple Payback","≥ Min Payback?","Incentive if C/E"]
[{"$f":"IFERROR(IF(AND(B15>=0.95, C15>=0.95), Incentives!H15, 0), \"\")","v":0},{"$f":"IFERROR((gas_eligible*INDEX('Avoided Costs'!$B$3:$G$72,MATCH(Calculator!$G15,'Avoided Costs'!$A$3:$A$72,0),MATCH(Calculator!$F15,'Avoided Costs'!$B$2:$G$2,0))*Calculator!I15+ele_eligible*VLOOKUP($E15,'Avoided Costs'!$O$4:$CI$188,MATCH(Calculator!$G15,'Avoided Costs'!$O$3:$CI$3,0),0)*Calculator!H15)/Incentives!F15, \"\")","v":""},{"$f":"IFERROR((IF(gas_eligible, INDEX('Avoided Costs'!$B$3:$G$72,MATCH(Calculator!$G15,'Avoided Costs'!$A$3:$A$72,0),MATCH(Calculator!$F15,'Avoided Costs'!$B$2:$G$2,0)), PV(discount,Calculator!G15,-gas_rate))*Calculator!I15+IF(ele_eligible, VLOOKUP($E15,'Avoided Costs'!$O$4:$CI$188,MATCH(Calculator!$G15,'Avoided Costs'!$O$3:$CI$3,0),0), PV(discount,Calculator!G15,-ele_rate))*Calculator!H15+PV(discount,Calculator!G15, -Calculator!K15))/Calculator!J15, \"\")","v":""},null,{"$f":"IF(Calculator!E15=Lists!$O$3,Lists!$O$3,\n       IF(OR(Calculator!$B$10=\"Residential\",Calculator!$B$10=\"Industrial\"),\n           INDEX(ShapeNameList,MATCH(Calculator!E15, ShapeDescriptions,0)),\n           INDEX(ShapeNameList,MATCH(Calculator!$C15&Calculator!$E15,'Avoided Costs'!$M$4:$M$188&'Avoided Costs'!$N$4:$N$188,0))))","v":{"$error":"#N/A"}},{"$f":"IFERROR(ele_eligible*VLOOKUP($E15,'Avoided Costs'!$O$4:$CI$188,MATCH(Calculator!$G15,'Avoided Costs'!$O$3:$CI$3,0),0)*MAX(Calculator!H15,0)/(ele_eligible*VLOOKUP($E15,'Avoided Costs'!$O$4:$CI$188,MATCH(Calculator!$G15,'Avoided Costs'!$O$3:$CI$3,0),0)*MAX(Calculator!H15,0)+gas_eligible*INDEX('Avoided Costs'!$B$3:$G$72,MATCH(Calculator!$G15,'Avoided Costs'!$A$3:$A$72,0),MATCH(Calculator!$F15,'Avoided Costs'!$B$2:$G$2,0))*MAX(Calculator!I15,0))*A15, \"\")","v":""},{"$f":"IF(F15=\"\", \"\", A15-F15)","v":""},null,1,{"$f":"IF(AND(Calculator!I15>0,Calculator!J15>0, ele_eligible, gas_eligible), \"Dual Fuel\", IF(AND(Calculator!I15>0, ele_eligible), \"Electric Only\", IF(AND(Calculator!J15>0, gas_eligible), \"Gas Only\", \"\")))","v":""},{"$f":"IFERROR(Calculator!K15/(Calculator!I15*ele_rate+Calculator!J15*gas_rate), \"\")","v":""},{"$f":"IFERROR(IF(K15>=IF(Calculator!E15=\"Yes\", Calculator!$E$7, VLOOKUP(J15, Calculator!$A$4:$E$7, 5, FALSE)), \"Yes\", \"No\"), \"\")","v":""},{"$f":"IFERROR(MIN(ele_eligible*inc_per_kwh*Calculator!I15+gas_eligible*inc_per_therm*Calculator!J15, inc_cost_cap*Calculator!K15),\"\")","v":""},null,{"$f":"IFERROR(IF(AND('Hidden Cells'!L15=\"Yes\", Calculator!L15=\"Yes\"), 'Hidden Cells'!M15, 0), \"\")","v":0}]
[{"$f":"IFERROR(IF(AND(B16>=0.95, C16>=0.95), Incentives!H16, 0), \"\")","v":0},{"$f":"IFERROR((gas_eligible*INDEX('Avoided Costs'!$B$3:$G$72,MATCH(Calculator!$G16,'Avoided Costs'!$A$3:$A$72,0),MATCH(Calculator!$F16,'Avoided Costs'!$B$2:$G$2,0))*Calculator!I16+ele_eligible*VLOOKUP($E16,'Avoided Costs'!$O$4:$CI$188,MATCH(Calculator!$G16,'Avoided Costs'!$O$3:$CI$3,0),0)*Calculator!H16)/Incentives!F16, \"\")","v":""},{"$f":"IFERROR((IF(gas_eligible, INDEX('Avoided Costs'!$B$3:$G$72,MATCH(Calculator!$G16,'Avoided Costs'!$A$3:$A$72,0),MATCH(Calculator!$F16,'Avoided Costs'!$B$2:$G$2,0)), PV(discount,Calculator!G16,-gas_rate))*Calculator!I16+IF(ele_eligible, VLOOKUP($E16,'Avoided Costs'!$O$4:$CI$188,MATCH(Calculator!$G16,'Avoided Costs'!$O$3:$CI$3,0),0), PV(discount,Calculator!G16,-ele_rate))*Calculator!H16+PV(discount,Calculator!G16, -Calculator!K16))/Calculator!J16, \"\")","v":""},null,{"$f":"IF(Calculator!E16=Lists!$O$3,Lists!$O$3,\n       IF(OR(Calculator!$B$10=\"Residential\",Calculator!$B$10=\"Industrial\"),\n           INDEX(ShapeNameList,MATCH(Calculator!E16, ShapeDescriptions,0)),\n           INDEX(ShapeNameList,MATCH(Calculator!$C16&Calculator!$E16,'Avoided Costs'!$M$4:$M$188&'Avoided Costs'!$N$4:$N$188,0))))","v":{"$error":"#N/A"}},{"$f":"IFERROR(ele_eligible*VLOOKUP($E16,'Avoided Costs'!$O$4:$CI$188,MATCH(Calculator!$G16,'Avoided Costs'!$O$3:$CI$3,0),0)*MAX(Calculator!H16,0)/(ele_eligible*VLOOKUP($E16,'Avoided Costs'!$O$4:$CI$188,MATCH(Calculator!$G16,'Avoided Costs'!$O$3:$CI$3,0),0)*MAX(Calculator!H16,0)+gas_eligible*INDEX('Avoided Costs'!$B$3:$G$72,MATCH(Calculator!$G16,'Avoided Costs'!$A$3:$A$72,0),MATCH(Calculator!$F16,'Avoided Costs'!$B$2:$G$2,0))*MAX(Calculator!I16,0))*A16, \"\")","v":""},"",null,2,{"$f":"IF(AND(Calculator!I16>0,Calculator!J16>0, ele_eligible, gas_eligible), \"Dual Fuel\", IF(AND(Calculator!I16>0, ele_eligible), \"Electric Only\", IF(AND(Calculator!J16>0, gas_eligible), \"Gas Only\", \"\")))","v":""},{"$f":"IFERROR(Calculator!K16/(Calculator!I16*ele_rate+Calculator!J16*gas_rate), \"\")","v":""},{"$f":"IFERROR(IF(K16>=IF(Calculator!E16=\"Yes\",#REF!, VLOOKUP( J16,#REF!, 5, FALSE)), \"Yes\", \"No\"), \"\")","v":""},{"$f":"IFERROR(MIN(ele_eligible*inc_per_kwh*Calculator!I16+gas_eligible*inc_per_therm*Calculator!J16, inc_cost_cap*Calculator!K16),\"\")","v":""},null,{"$f":"IFERROR(IF(AND('Hidden Cells'!L16=\"Yes\", Calculator!L16=\"Yes\"), 'Hidden Cells'!M16, 0), \"\")","v":0}]
[{"$f":"IFERROR(IF(AND(B17>=0.95, C17>=0.95), Incentives!H17, 0), \"\")","v":0},{"$f":"IFERROR((gas_eligible*INDEX('Avoided Costs'!$B$3:$G$72,MATCH(Calculator!$G17,'Avoided Costs'!$A$3:$A$72,0),MATCH(Calculator!$F17,'Avoided Costs'!$B$2:$G$2,0))*Calculator!I17+ele_eligible*VLOOKUP($E17,'Avoided Costs'!$O$4:$CI$188,MATCH(Calculator!$G17,'Avoided Costs'!$O$3:$CI$3,0),0)*Calculator!H17)/Incentives!F17, \"\")","v":""},{"$f":"IFERROR((IF(gas_eligible, INDEX('Avoided Costs'!$B$3:$G$72,MATCH(Calculator!$G17,'Avoided Costs'!$A$3:$A$72,0),MATCH(Calculator!$F17,'Avoided Costs'!$B$2:$G$2,0)), PV(discount,Calculator!G17,-gas_rate))*Calculator!I17+IF(ele_eligible, VLOOKUP($E17,'Avoided Costs'!$O$4:$CI$188,MATCH(Calculator!$G17,'Avoided Costs'!$O$3:$CI$3,0),0), PV(discount,Calculator!G17,-ele_rate))*Calculator!H17+PV(discount,Calculator!G17, -Calculator!K17))/Calculator!J17, \"\")","v":""},null,{"$f":"IF(Calculator!E17=Lists!$O$3,Lists!$O$3,\n       IF(OR(Calculator!$B$10=\"Residential\",Calculator!$B$10=\"Industrial\"),\n           INDEX(ShapeNameList,MATCH(Calculator!E17, ShapeDescriptions,0)),\n           INDEX(ShapeNameList,MATCH(Calculator!$C17&Calculator!$E17,'Avoided Costs'!$M$4:$M$188&'Avoided Costs'!$N$4:$N$188,0))))","v":{"$error":"#N/A"}},{"$f":"IFERROR(ele_eligible*VLOOKUP($E17,'Avoided Costs'!$O$4:$CI$188,MATCH(Calculator!$G17,'Avoided Costs'!$O$3:$CI$3,0),0)*MAX(Calculator!H17,0)/(ele_eligible*VLOOKUP($E17,'Avoided Costs'!$O$4:$CI$188,MATCH(Calculator!$G17,'Avoided Costs'!$O$3:$CI$3,0),0)*MAX(Calculator!H17,0)+gas_eligible*INDEX('Avoided Costs'!$B$3:$G$72,MATCH(Calculator!$G17,'Avoided Costs'!$A$3:$A$72,0),MATCH(Calculator!$F17,'Avoided Costs'!$B$2:$G$2,0))*MAX(Calculator!I17,0))*A17, \"\")","v":""},"",null,3,{"$f":"IF(AND(Calculator!I17>0,Calculator!J17>0, ele_eligible, gas_eligible), \"Dual Fuel\", IF(AND(Calculator!I17>0, ele_eligible), \"Electric Only\", IF(AND(Calculator!J17>0, gas_eligible), \"Gas Only\", \"\")))","v":""},{"$f":"IFERROR(Calculator!K17/(Calculator!I17*ele_rate+Calculator!J17*gas_rate), \"\")","v":""},{"$f":"IFERROR(IF(K17>=IF(Calculator!E17=\"Yes\",#REF!, VLOOKUP( J17,#REF!, 5, FALSE)), \"Yes\", \"No\"), \"\")","v":""},{"$f":"IFERROR(MIN(ele_eligible*inc_per_kwh*Calculator!I17+gas_eligible*inc_per_therm*Calculator!J17, inc_cost_cap*Calculator!K17),\"\")","v":""},null,{"$f":"IFERROR(IF(AND('Hidden Cells'!L17=\"Yes\", Calculator!L17=\"Yes\"), 'Hidden Cells'!M17, 0), \"\")","v":0}]
[{"$f":"IFERROR(IF(AND(B18>=0.95, C18>=0.95), Incentives!H18, 0), \"\")","v":0},{"$f":"IFERROR((gas_eligible*INDEX('Avoided Costs'!$B$3:$G$72,MATCH(Calculator!$G18,'Avoided Costs'!$A$3:$A$72,0),MATCH(Calculator!$F18,'Avoided Costs'!$B$2:$G$2,0))*Calculator!I18+ele_eligible*VLOOKUP($E18,'Avoided Costs'!$O$4:$CI$188,MATCH(Calculator!$G18,'Avoided Costs'!$O$3:$CI$3,0),0)*Calculator!H18)/Incentives!F18, \"\")","v":""},{"$f":"IFERROR((IF(gas_eligible, INDEX('Avoided Costs'!$B$3:$G$72,MATCH(Calculator!$G18,'Avoided Costs'!$A$3:$A$72,0),MATCH(Calculator!$F18,'Avoided Costs'!$B$2:$G$2,0)), PV(discount,Calculator!G18,-gas_rate))*Calculator!I18+IF(ele_eligible, VLOOKUP($E18,'Avoided Costs'!$O$4:$CI$188,MATCH(Calculator!$G18,'Avoided Costs'!$O$3:$CI$3,0),0), PV(discount,Calculator!G18,-ele_rate))*Calculator!H18+PV(discount,Calculator!G18, -Calculator!K18))/Calculator!J18, \"\")","v":""},null,{"$f":"IF(Calculator!E18=Lists!$O$3,Lists!$O$3,\n       IF(OR(Calculator!$B$10=\"Residential\",Calculator!$B$10=\"Industrial\"),\n           INDEX(ShapeNameList,MATCH(Calculator!E18, ShapeDescriptions,0)),\n           INDEX(ShapeNameList,MATCH(Calculator!$C18&Calculator!$E18,'Avoided Costs'!$M$4:$M$188&'Avoided Costs'!$N$4:$N$188,0))))","v":{"$error":"#N/A"}},{"$f":"IFERROR(ele_eligible*VLOOKUP($E18,'Avoided Costs'!$O$4:$CI$188,MATCH(Calculator!$G18,'Avoided Costs'!$O$3:$CI$3,0),0)*MAX(Calculator!H18,0)/(ele_eligible*VLOOKUP($E18,'Avoided Costs'!$O$4:$CI$188,MATCH(Calculator!$G18,'Avoided Costs'!$O$3:$CI$3,0),0)*MAX(Calculator!H18,0)+gas_eligible*INDEX('Avoided Costs'!$B$3:$G$72,MATCH(Calculator!$G18,'Avoided Costs'!$A$3:$A$72,0),MATCH(Calculator!$F18,'Avoided Costs'!$B$2:$G$2,0))*MAX(Calculator!I18,0))*A18, \"\")","v":""},"",null,4,{"$f":"IF(AND(Calculator!I18>0,Calculator!J18>0, ele_eligible, gas_eligible), \"Dual Fuel\", IF(AND(Calculator!I18>0, ele_eligible), \"Electric Only\", IF(AND(Calculator!J18>0, gas_eligible), \"Gas Only\", \"\")))","v":""},{"$f":"IFERROR(Calculator!K18/(Calculator!I18*ele_rate+Calculator!J18*gas_rate), \"\")","v":""},{"$f":"IFERROR(IF(K18>=IF(Calculator!E18=\"Yes\",#REF!, VLOOKUP( J18,#REF!, 5, FALSE)), \"Yes\", \"No\"), \"\")","v":""},{"$f":"IFERROR(MIN(ele_eligible*inc_per_kwh*Calculator!I18+gas_eligible*inc_per_therm*Calculator!J18, inc_cost_cap*Calculator!K18),\"\")","v":""},null,{"$f":"IFERROR(IF(AND('Hidden Cells'!L18=\"Yes\", Calculator!L18=\"Yes\"), 'Hidden Cells'!M18, 0), \"\")","v":0}]
[{"$f":"IFERROR(IF(AND(B19>=0.95, C19>=0.95), Incentives!H19, 0), \"\")","v":0},{"$f":"IFERROR((gas_eligible*INDEX('Avoided Costs'!$B$3:$G$72,MATCH(Calculator!$G19,'Avoided Costs'!$A$3:$A$72,0),MATCH(Calculator!$F19,'Avoided Costs'!$B$2:$G$2,0))*Calculator!I19+ele_eligible*VLOOKUP($E19,'Avoided Costs'!$O$4:$CI$188,MATCH(Calculator!$G19,'Avoided Costs'!$O$3:$CI$3,0),0)*Calculator!H19)/Incentives!F19, \"\")","v":""},{"$f":"IFERROR((IF(gas_eligible, INDEX('Avoided Costs'!$B$3:$G$72,MATCH(Calculator!$G19,'Avoided Costs'!$A$3:$A$72,0),MATCH(Calculator!$F19,'Avoided Costs'!$B$2:$G$2,0)), PV(discount,Calculator!G19,-gas_rate))*Calculator!I19+IF(ele_eligible, VLOOKUP($E19,'Avoided Costs'!$O$4:$CI$188,MATCH(Calculator!$G19,'Avoided Costs'!$O$3:$CI$3,0),0), PV(discount,Calculator!G19,-ele_rate))*Calculator!H19+PV(discount,Calculator!G19, -Calculator!K19))/Calculator!J19, \"\")","v":""},null,{"$f":"IF(Calculator!E19=Lists!$O$3,Lists!$O$3,\n       IF(OR(Calculator!$B$10=\"Residential\",Calculator!$B$10=\"Industrial\"),\n           INDEX(ShapeNameList,MATCH(Calculator!E19, ShapeDescriptions,0)),\n           INDEX(ShapeNameList,MATCH(Calculator!$C19&Calculator!$E19,'Avoided Costs'!$M$4:$M$188&'Avoided Costs'!$N$4:$N$188,0))))","v":{"$error":"#N/A"}},{"$f":"IFERROR(ele_eligible*VLOOKUP($E19,'Avoided Costs'!$O$4:$CI$188,MATCH(Calculator!$G19,'Avoided Costs'!$O$3:$CI$3,0),0)*MAX(Calculator!H19,0)/(ele_eligible*VLOOKUP($E19,'Avoided Costs'!$O$4:$CI$188,MATCH(Calculator!$G19,'Avoided Costs'!$O$3:$CI$3,0),0)*MAX(Calculator!H19,0)+gas_eligible*INDEX('Avoided Costs'!$B$3:$G$72,MATCH(Calculator!$G19,'Avoided Costs'!$A$3:$A$72,0),MATCH(Calculator!$F19,'Avoided Costs'!$B$2:$G$2,0))*MAX(Calculator!I19,0))*A19, \"\")","v":""},"",null,5,{"$f":"IF(AND(Calculator!I19>0,Calculator!J19>0, ele_eligible, gas_eligible), \"Dual Fuel\", IF(AND(Calculator!I19>0, ele_eligible), \"Electric Only\", IF(AND(Calculator!J19>0, gas_eligible), \"Gas Only\", \"\")))","v":""},{"$f":"IFERROR(Calculator!K19/(Calculator!I19*ele_rate+Calculator!J19*gas_rate), \"\")","v":""},{"$f":"IFERROR(IF(K19>=IF(Calculator!E19=\"Yes\",#REF!, VLOOKUP( J19,#REF!, 5, FALSE)), \"Yes\", \"No\"), \"\")","v":""},{"$f":"IFERROR(MIN(ele_eligible*inc_per_kwh*Calculator!I19+gas_eligible*inc_per_therm*Calculator!J19, inc_cost_cap*Calculator!K19),\"\")","v":""},null,{"$f":"IFERROR(IF(AND('Hidden Cells'!L19=\"Yes\", Calculator!L19=\"Yes\"), 'Hidden Cells'!M19, 0), \"\")","v":0}]
[{"$f":"IFERROR(IF(AND(B20>=0.95, C20>=0.95), Incentives!H20, 0), \"\")","v":0},{"$f":"IFERROR((gas_eligible*INDEX('Avoided Costs'!$B$3:$G$72,MATCH(Calculator!$G20,'Avoided Costs'!$A$3:$A$72,0),MATCH(Calculator!$F20,'Avoided Costs'!$B$2:$G$2,0))*Calculator!I20+ele_eligible*VLOOKUP($E20,'Avoided Costs'!$O$4:$CI$188,MATCH(Calculator!$G20,'Avoided Costs'!$O$3:$CI$3,0),0)*Calculator!H20)/Incentives!F20, \"\")","v":""},{"$f":"IFERROR((IF(gas_eligible, INDEX('Avoided Costs'!$B$3:$G$72,MATCH(Calculator!$G20,'Avoided Costs'!$A$3:$A$72,0),MATCH(Calculator!$F20,'Avoided Costs'!$B$2:$G$2,0)), PV(discount,Calculator!G20,-gas_rate))*Calculator!I20+IF(ele_eligible, VLOOKUP($E20,'Avoided Costs'!$O$4:$CI$188,MATCH(Calculator!$G20,'Avoided Costs'!$O$3:$CI$3,0),0), PV(discount,Calculator!G20,-ele_rate))*Calculator!H20+PV(discount,Calculator!G20, -Calculator!K20))/Calculator!J20, \"\")","v":""},null,{"$f":"IF(Calculator!E20=Lists!$O$3,Lists!$O$3,\n       IF(OR(Calculator!$B$10=\"Residential\",Calculator!$B$10=\"Industrial\"),\n           INDEX(ShapeNameList,MATCH(Calculator!E20, ShapeDescriptions,0)),\n           INDEX(ShapeNameList,MATCH(Calculator!$C20&Calculator!$E20,'Avoided Costs'!$M$4:$M$188&'Avoided Costs'!$N$4:$N$188,0))))","v":{"$error":"#N/A"}},{"$f":"IFERROR(ele_eligible*VLOOKUP($E20,'Avoided Costs'!$O$4:$CI$188,MATCH(Calculator!$G20,'Avoided Costs'!$O$3:$CI$3,0),0)*MAX(Calculator!H20,0)/(ele_eligible*VLOOKUP($E20,'Avoided Costs'!$O$4:$CI$188,MATCH(Calculator!$G20,'Avoided Costs'!$O$3:$CI$3,0),0)*MAX(Calculator!H20,0)+gas_eligible*INDEX('Avoided Costs'!$B$3:$G$72,MATCH(Calculator!$G20,'Avoided Costs'!$A$3:$A$72,0),MATCH(Calculator!$F20,'Avoided Costs'!$B$2:$G$2,0))*MAX(Calculator!I20,0))*A20, \"\")","v":""},"",null,6,{"$f":"IF(AND(Calculator!I20>0,Calculator!J20>0, ele_eligible, gas_eligible), \"Dual Fuel\", IF(AND(Calculator!I20>0, ele_eligible), \"Electric Only\", IF(AND(Calculator!J20>0, gas_eligible), \"Gas Only\", \"\")))","v":""},{"$f":"IFERROR(Calculator!K20/(Calculator!I20*ele_rate+Calculator!J20*gas_rate), \"\")","v":""},{"$f":"IFERROR(IF(K20>=IF(Calculator!E20=\"Yes\",#REF!, VLOOKUP( J20,#REF!, 5, FALSE)), \"Yes\", \"No\"), \"\")","v":""},{"$f":"IFERROR(MIN(ele_eligible*inc_per_kwh*Calculator!I20+gas_eligible*inc_per_therm*Calculator!J20, inc_cost_cap*Calculator!K20),\"\")","v":""},null,{"$f":"IFERROR(IF(AND('Hidden Cells'!L20=\"Yes\", Calculator!L20=\"Yes\"), 'Hidden Cells'!M20, 0), \"\")","v":0}]
[{"$f":"IFERROR(IF(AND(B21>=0.95, C21>=0.95), Incentives!H21, 0), \"\")","v":0},{"$f":"IFERROR((gas_eligible*INDEX('Avoided Costs'!$B$3:$G$72,MATCH(Calculator!$G21,'Avoided Costs'!$A$3:$A$72,0),MATCH(Calculator!$F21,'Avoided Costs'!$B$2:$G$2,0))*Calculator!I21+ele_eligible*VLOOKUP($E21,'Avoided Costs'!$O$4:$CI$188,MATCH(Calculator!$G21,'Avoided Costs'!$O$3:$CI$3,0),0)*Calculator!H21)/Incentives!F21, \"\")","v":""},{"$f":"IFERROR((IF(gas_eligible, INDEX('Avoided Costs'!$B$3:$G$72,MATCH(Calculator!$G21,'Avoided Costs'!$A$3:$A$72,0),MATCH(Calculator!$F21,'Avoided Costs'!$B$2:$G$2,0)), PV(discount,Calculator!G21,-gas_rate))*Calculator!I21+IF(ele_eligible, VLOOKUP($E21,'Avoided Costs'!$O$4:$CI$188,MATCH(Calculator!$G21,'Avoided Costs'!$O$3:$CI$3,0),0), PV(discount,Calculator!G21,-ele_rate))*Calculator!H21+PV(discount,Calculator!G21, -Calculator!K21))/Calculator!J21, \"\")","v":""},null,{"$f":"IF(Calculator!E21=Lists!$O$3,Lists!$O$3,\n       IF(OR(Calculator!$B$10=\"Residential\",Calculator!$B$10=\"Industrial\"),\n           INDEX(ShapeNameList,MATCH(Calculator!E21, ShapeDescriptions,0)),\n           INDEX(ShapeNameList,MATCH(Calculator!$C21&Calculator!$E21,'Avoided Costs'!$M$4:$M$188&'Avoided Costs'!$N$4:$N$188,0))))","v":{"$error":"#N/A"}},{"$f":"IFERROR(ele_eligible*VLOOKUP($E21,'Avoided Costs'!$O$4:$CI$188,MATCH(Calculator!$G21,'Avoided Costs'!$O$3:$CI$3,0),0)*MAX(Calculator!H21,0)/(ele_eligible*VLOOKUP($E21,'Avoided Costs'!$O$4:$CI$188,MATCH(Calculator!$G21,'Avoided Costs'!$O$3:$CI$3,0),0)*MAX(Calculator!H21,0)+gas_eligible*INDEX('Avoided Costs'!$B$3:$G$72,MATCH(Calculator!$G21,'Avoided Costs'!$A$3:$A$72,0),MATCH(Calculator!$F21,'Avoided Costs'!$B$2:$G$2,0))*MAX(Calculator!I21,0))*A21, \"\")","v":""},"",null,7,{"$f":"IF(AND(Calculator!I21>0,Calculator!J21>0, ele_eligible, gas_eligible), \"Dual Fuel\", IF(AND(Calculator!I21>0, ele_eligible), \"Electric Only\", IF(AND(Calculator!J21>0, gas_eligible), \"Gas Only\", \"\")))","v":""},{"$f":"IFERROR(Calculator!K21/(Calculator!I21*ele_rate+Calculator!J21*gas_rate), \"\")","v":""},{"$f":"IFERROR(IF(K21>=IF(Calculator!E21=\"Yes\",#REF!, VLOOKUP( J21,#REF!, 5, FALSE)), \"Yes\", \"No\"), \"\")","v":""},{"$f":"IFERROR(MIN(ele_eligible*inc_per_kwh*Calculator!I21+gas_eligible*inc_per_therm*Calculator!J21, inc_cost_cap*Calculator!K21),\"\")","v":""},null,{"$f":"IFERROR(IF(AND('Hidden Cells'!L21=\"Yes\", Calculator!L21=\"Yes\"), 'Hidden Cells'!M21, 0), \"\")","v":0}]
[{"$f":"IFERROR(IF(AND(B22>=0.95, C22>=0.95), Incentives!H22, 0), \"\")","v":0},{"$f":"IFERROR((gas_eligible*INDEX('Avoided Costs'!$B$3:$G$72,MATCH(Calculator!$G22,'Avoided Costs'!$A$3:$A$72,0),MATCH(Calculator!$F22,'Avoided Costs'!$B$2:$G$2,0))*Calculator!I22+ele_eligible*VLOOKUP($E22,'Avoided Costs'!$O$4:$CI$188,MATCH(Calculator!$G22,'Avoided Costs'!$O$3:$CI$3,0),0)*Calculator!H22)/Incentives!F22, \"\")","v":""},{"$f":"IFERROR((IF(gas_eligible, INDEX('Avoided Costs'!$B$3:$G$72,MATCH(Calculator!$G22,'Avoided Costs'!$A$3:$A$72,0),MATCH(Calculator!$F22,'Avoided Costs'!$B$2:$G$2,0)), PV(discount,Calculator!G22,-gas_rate))*Calculator!I22+IF(ele_eligible, VLOOKUP($E22,'Avoided Costs'!$O$4:$CI$188,MATCH(Calculator!$G22,'Avoided Costs'!$O$3:$CI$3,0),0), PV(discount,Calculator!G22,-ele_rate))*Calculator!H22+PV(discount,Calculator!G22, -Calculator!K22))/Calculator!J22, \"\")","v":""},null,{"$f":"IF(Calculator!E22=Lists!$O$3,Lists!$O$3,\n       IF(OR(Calculator!$B$10=\"Residential\",Calculator!$B$10=\"Industrial\"),\n           INDEX(ShapeNameList,MATCH(Calculator!E22, ShapeDescriptions,0)),\n           INDEX(ShapeNameList,MATCH(Calculator!$C22&Calculator!$E22,'Avoided Costs'!$M$4:$M$188&'Avoided Costs'!$N$4:$N$188,0))))","v":{"$error":"#N/A"}},{"$f":"IFERROR(ele_eligible*VLOOKUP($E22,'Avoided Costs'!$O$4:$CI$188,MATCH(Calculator!$G22,'Avoided Costs'!$O$3:$CI$3,0),0)*MAX(Calculator!H22,0)/(ele_eligible*VLOOKUP($E22,'Avoided Costs'!$O$4:$CI$188,MATCH(Calculator!$G22,'Avoided Costs'!$O$3:$CI$3,0),0)*MAX(Calculator!H22,0)+gas_eligible*INDEX('Avoided Costs'!$B$3:$G$72,MATCH(Calculator!$G22,'Avoided Costs'!$A$3:$A$72,0),MATCH(Calculator!$F22,'Avoided Costs'!$B$2:$G$2,0))*MAX(Calculator!I22,0))*A22, \"\")","v":""},"",null,8,{"$f":"IF(AND(Calculator!I22>0,Calculator!J22>0, ele_eligible, gas_eligible), \"Dual Fuel\", IF(AND(Calculator!I22>0, ele_eligible), \"Electric Only\", IF(AND(Calculator!J22>0, gas_eligible), \"Gas Only\", \"\")))","v":""},{"$f":"IFERROR(Calculator!K22/(Calculator!I22*ele_rate+Calculator!J22*gas_rate), \"\")","v":""},{"$f":"IFERROR(IF(K22>=IF(Calculator!E22=\"Yes\",#REF!, VLOOKUP( J22,#REF!, 5, FALSE)), \"Yes\", \"No\"), \"\")","v":""},{"$f":"IFERROR(MIN(ele_eligible*inc_per_kwh*Calculator!I22+gas_eligible*inc_per_therm*Calculator!J22, inc_cost_cap*Calculator!K22),\"\")","v":""},null,{"$f":"IFERROR(IF(AND('Hidden Cells'!L22=\"Yes\", Calculator!L22=\"Yes\"), 'Hidden Cells'!M22, 0), \"\")","v":0}]
[{"$f":"IFERROR(IF(AND(B23>=0.95, C23>=0.95), Incentives!H23, 0), \"\")","v":0},{"$f":"IFERROR((gas_eligible*INDEX('Avoided Costs'!$B$3:$G$72,MATCH(Calculator!$G23,'Avoided Costs'!$A$3:$A$72,0),MATCH(Calculator!$F23,'Avoided Costs'!$B$2:$G$2,0))*Calculator!I23+ele_eligible*VLOOKUP($E23,'Avoided Costs'!$O$4:$CI$188,MATCH(Calculator!$G23,'Avoided Costs'!$O$3:$CI$3,0),0)*Calculator!H23)/Incentives!F23, \"\")","v":""},{"$f":"IFERROR((IF(gas_eligible, INDEX('Avoided Costs'!$B$3:$G$72,MATCH(Calculator!$G23,'Avoided Costs'!$A$3:$A$72,0),MATCH(Calculator!$F23,'Avoided Costs'!$B$2:$G$2,0)), PV(discount,Calculator!G23,-gas_rate))*Calculator!I23+IF(ele_eligible, VLOOKUP($E23,'Avoided Costs'!$O$4:$CI$188,MATCH(Calculator!$G23,'Avoided Costs'!$O$3:$CI$3,0),0), PV(discount,Calculator!G23,-ele_rate))*Calculator!H23+PV(discount,Calculator!G23, -Calculator!K23))/Calculator!J23, \"\")","v":""},null,{"$f":"IF(Calculator!E23=Lists!$O$3,Lists!$O$3,\n       IF(OR(Calculator!$B$10=\"Residential\",Calculator!$B$10=\"Industrial\"),\n           INDEX(ShapeNameList,MATCH(Calculator!E23, ShapeDescriptions,0)),\n           INDEX(ShapeNameList,MATCH(Calculator!$C23&Calculator!$E23,'Avoided Costs'!$M$4:$M$188&'Avoided Costs'!$N$4:$N$188,0))))","v":{"$error":"#N/A"}},{"$f":"IFERROR(ele_eligible*VLOOKUP($E23,'Avoided Costs'!$O$4:$CI$188,MATCH(Calculator!$G23,'Avoided Costs'!$O$3:$CI$3,0),0)*MAX(Calculator!H23,0)/(ele_eligible*VLOOKUP($E23,'Avoided Costs'!$O$4:$CI$188,MATCH(Calculator!$G23,'Avoided Costs'!$O$3:$CI$3,0),0)*MAX(Calculator!H23,0)+gas_eligible*INDEX('Avoided Costs'!$B$3:$G$72,MATCH(Calculator!$G23,'Avoided Costs'!$A$3:$A$72,0),MATCH(Calculator!$F23,'Avoided Costs'!$B$2:$G$2,0))*MAX(Calculator!I23,0))*A23, \"\")","v":""},"",null,9,{"$f":"IF(AND(Calculator!I23>0,Calculator!J23>0, ele_eligible, gas_eligible), \"Dual Fuel\", IF(AND(Calculator!I23>0, ele_eligible), \"Electric Only\", IF(AND(Calculator!J23>0, gas_eligible), \"Gas Only\", \"\")))","v":""},{"$f":"IFERROR(Calculator!K23/(Calculator!I23*ele_rate+Calculator!J23*gas_rate), \"\")","v":""},{"$f":"IFERROR(IF(K23>=IF(Calculator!E23=\"Yes\",#REF!, VLOOKUP( J23,#REF!, 5, FALSE)), \"Yes\", \"No\"), \"\")","v":""},{"$f":"IFERROR(MIN(ele_eligible*inc_per_kwh*Calculator!I23+gas_eligible*inc_per_therm*Calculator!J23, inc_cost_cap*Calculator!K23),\"\")","v":""},null,{"$f":"IFERROR(IF(AND('Hidden Cells'!L23=\"Yes\", Calculator!L23=\"Yes\"), 'Hidden Cells'!M23, 0), \"\")","v":0}]
[{"$f":"IFERROR(IF(AND(B24>=0.95, C24>=0.95), Incentives!H24, 0), \"\")","v":0},{"$f":"IFERROR((gas_eligible*INDEX('Avoided Costs'!$B$3:$G$72,MATCH(Calculator!$G24,'Avoided Costs'!$A$3:$A$72,0),MATCH(Calculator!$F24,'Avoided Costs'!$B$2:$G$2,0))*Calculator!I24+ele_eligible*VLOOKUP($E24,'Avoided Costs'!$O$4:$CI$188,MATCH(Calculator!$G24,'Avoided Costs'!$O$3:$CI$3,0),0)*Calculator!H24)/Incentives!F24, \"\")","v":""},{"$f":"IFERROR((IF(gas_eligible, INDEX('Avoided Costs'!$B$3:$G$72,MATCH(Calculator!$G24,'Avoided Costs'!$A$3:$A$72,0),MATCH(Calculator!$F24,'Avoided Costs'!$B$2:$G$2,0)), PV(discount,Calculator!G24,-gas_rate))*Calculator!I24+IF(ele_eligible, VLOOKUP($E24,'Avoided Costs'!$O$4:$CI$188,MATCH(Calculator!$G24,'Avoided Costs'!$O$3:$CI$3,0),0), PV(discount,Calculator!G24,-ele_rate))*Calculator!H24+PV(discount,Calculator!G24, -Calculator!K24))/Calculator!J24, \"\")","v":""},null,{"$f":"IF(Calculator!E24=Lists!$O$3,Lists!$O$3,\n       IF(OR(Calculator!$B$10=\"Residential\",Calculator!$B$10=\"Industrial\"),\n           INDEX(ShapeNameList,MATCH(Calculator!E24, ShapeDescriptions,0)),\n           INDEX(ShapeNameList,MATCH(Calculator!$C24&Calculator!$E24,'Avoided Costs'!$M$4:$M$188&'Avoided Costs'!$N$4:$N$188,0))))","v":{"$error":"#N/A"}},{"$f":"IFERROR(ele_eligible*VLOOKUP($E24,'Avoided Costs'!$O$4:$CI$188,MATCH(Calculator!$G24,'Avoided Costs'!$O$3:$CI$3,0),0)*MAX(Calculator!H24,0)/(ele_eligible*VLOOKUP($E24,'Avoided Costs'!$O$4:$CI$188,MATCH(Calculator!$G24,'Avoided Costs'!$O$3:$CI$3,0),0)*MAX(Calculator!H24,0)+gas_eligible*INDEX('Avoided Costs'!$B$3:$G$72,MATCH(Calculator!$G24,'Avoided Costs'!$A$3:$A$72,0),MATCH(Calculator!$F24,'Avoided Costs'!$B$2:$G$2,0))*MAX(Calculator!I24,0))*A24, \"\")","v":""},"",null,10,{"$f":"IF(AND(Calculator!I24>0,Calculator!J24>0, ele_eligible, gas_eligible), \"Dual Fuel\", IF(AND(Calculator!I24>0, ele_eligible), \"Electric Only\", IF(AND(Calculator!J24>0, gas_eligible), \"Gas Only\", \"\")))","v":""},{"$f":"IFERROR(Calculator!K24/(Calculator!I24*ele_rate+Calculator!J24*gas_rate), \"\")","v":""},{"$f":"IFERROR(IF(K24>=IF(Calculator!E24=\"Yes\",#REF!, VLOOKUP( J24,#REF!, 5, FALSE)), \"Yes\", \"No\"), \"\")","v":""},{"$f":"IFERROR(MIN(ele_eligible*inc_per_kwh*Calculator!I24+gas_eligible*inc_per_therm*Calculator!J24, inc_cost_cap*Calculator!K24),\"\")","v":""},null,{"$f":"IFERROR(IF(AND('Hidden Cells'!L24=\"Yes\", Calculator!L24=\"Yes\"), 'Hidden Cells'!M24, 0), \"\")","v":0}]

{"sheet":"Incentives","index":4,"n_rows":24,"n_cols":8,"rows_kept":24,"cut":false,"hidden":true,"merged":[]}
[]
["Existing Buildings Program 2017 Incentive Rules",null,null,null,null,null,"Utility Eligibility"]
["Project Type","$/kWh","$/therm","% of Cost Cap","Minimum Simple Payback (yrs)",null,"Electric","Gas"]
["Electric Only",0.22,0,0.6,1,null,{"$f":"ele_eligible","v":true},{"$f":"gas_eligible","v":true}]
["Gas Only",0,3,0.75,1]
["Dual Fuel",0.22,3,0.65,1]
["RCx Ele Only",0.15,0,0.6,0]
["RCx Gas Only",0,1.8,0.75,0]
["RCx Dual Fuel",0.15,1.8,0.75,0]
[]
[]
[]
["Incentive Calculator"]
["Measure","Project Type","Cost Cap","Simple Payback","≥ Min Payback?","Incentive if C/E","Cost Effective?","Eligible Incentive"]
[{"$f":"A20","v":0},{"$f":"IF(Calculator!E15=\"No\",\n  IF(AND(Calculator!I15>0,Calculator!J15>0, ele_eligible, gas_eligible),\"Dual Fuel\",\n  IF( AND(Calculator!I15>0, ele_eligible),\"Electric Only\",\n  IF(AND(Calculator!J15>0, gas_eligible),\"Gas Only\",\"\"))),\n  IF( AND(Calculator!I15>0,Calculator!J15>0, ele_eligible, gas_eligible),\"RCx Dual Fuel\",\n  IF( AND(Calculator!I15>0, ele_eligible),\"RCx Ele Only\",\n  IF( AND(Calculator!J15>0, gas_eligible),\"RCx Gas Only\",\"\"))))","v":""},{"$f":"VLOOKUP(B15, $A$4:$D$9, 4, FALSE)","v":{"$error":"#N/A"}},{"$f":"IFERROR(Calculator!J15/(Calculator!H15*ele_rate+Calculator!I15*gas_rate), \"\")","v":""},{"$f":"IFERROR(IF(D15>=IF(Calculator!D15=\"Yes\", Incentives!$E$9, VLOOKUP(B15, $A$4:$E$9, 5, FALSE)), \"Yes\", \"No\"), \"\")","v":""},{"$f":"IF(Calculator!D15=\"No\",(IFERROR(MIN(ele_eligible*inc_per_kwh*MAX(0, Calculator!H15)+gas_eligible*inc_per_therm*MAX(0, Calculator!I15),C15*Calculator!J15),\"\")),(IFERROR(MIN(ele_eligible*RCx_Ele_Only*MAX(0, Calculator!H15)+gas_eligible*RCx_Gas_Only*MAX(0, Calculator!I15),C15*Calculator!J15),\"\")))","v":""},{"$f":"IF(AND(N('Hidden Cells'!B15)>=0.95, N('Hidden Cells'!C15)>=0.95), \"Yes\", \"No\")","v":"No"},{"$f":"IFERROR(IF(AND(E15=\"Yes\", G15=\"Yes\"), F15, 0), \"\")","v":0}]
[0,{"$f":"IF(Calculator!E16=\"No\",\n  IF(AND(Calculator!I16>0,Calculator!J16>0, ele_eligible, gas_eligible),\"Dual Fuel\",\n  IF( AND(Calculator!I16>0, ele_eligible),\"Electric Only\",\n  IF(AND(Calculator!J16>0, gas_eligible),\"Gas Only\",\"\"))),\n  IF( AND(Calculator!I16>0,Calculator!J16>0, ele_eligible, gas_eligible),\"RCx Dual Fuel\",\n  IF( AND(Calculator!I16>0, ele_eligible),\"RCx Ele Only\",\n  IF( AND(Calculator!J16>0, gas_eligible),\"RCx Gas Only\",\"\"))))","v":""},{"$f":"VLOOKUP(B16, $A$4:$D$9, 4, FALSE)","v":{"$error":"#N/A"}},{"$f":"IFERROR(Calculator!J16/(Calculator!H16*ele_rate+Calculator!I16*gas_rate), \"\")","v":""},{"$f":"IFERROR(IF(D16>=IF(Calculator!D16=\"Yes\", Incentives!$E$9, VLOOKUP(B16, $A$4:$E$9, 5, FALSE)), \"Yes\", \"No\"), \"\")","v":""},{"$f":"IF(Calculator!D16=\"No\",(IFERROR(MIN(ele_eligible*inc_per_kwh*MAX(0, Calculator!H16)+gas_eligible*inc_per_therm*MAX(0, Calculator!I16),C16*Calculator!J16),\"\")),(IFERROR(MIN(ele_eligible*RCx_Ele_Only*MAX(0, Calculator!H16)+gas_eligible*RCx_Gas_Only*MAX(0, Calculator!I16),C16*Calculator!J16),\"\")))","v":""},{"$f":"IF(AND(N('Hidden Cells'!B16)>=0.95, N('Hidden Cells'!C16)>=0.95), \"Yes\", \"No\")","v":"No"},{"$f":"IFERROR(IF(AND(E16=\"Yes\", G16=\"Yes\"), F16, 0), \"\")","v":0}]
[0,{"$f":"IF(Calculator!E17=\"No\",\n  IF(AND(Calculator!I17>0,Calculator!J17>0, ele_eligible, gas_eligible),\"Dual Fuel\",\n  IF( AND(Calculator!I17>0, ele_eligible),\"Electric Only\",\n  IF(AND(Calculator!J17>0, gas_eligible),\"Gas Only\",\"\"))),\n  IF( AND(Calculator!I17>0,Calculator!J17>0, ele_eligible, gas_eligible),\"RCx Dual Fuel\",\n  IF( AND(Calculator!I17>0, ele_eligible),\"RCx Ele Only\",\n  IF( AND(Calculator!J17>0, gas_eligible),\"RCx Gas Only\",\"\"))))","v":""},{"$error":"#N/A"},{"$f":"IFERROR(Calculator!J17/(Calculator!H17*ele_rate+Calculator!I17*gas_rate), \"\")","v":""},{"$f":"IFERROR(IF(D17>=IF(Calculator!D17=\"Yes\", Incentives!$E$9, VLOOKUP(B17, $A$4:$E$9, 5, FALSE)), \"Yes\", \"No\"), \"\")","v":""},{"$f":"IF(Calculator!D17=\"No\",(IFERROR(MIN(ele_eligible*inc_per_kwh*MAX(0, Calculator!H17)+gas_eligible*inc_per_therm*MAX(0, Calculator!I17),C17*Calculator!J17),\"\")),(IFERROR(MIN(ele_eligible*RCx_Ele_Only*MAX(0, Calculator!H17)+gas_eligible*RCx_Gas_Only*MAX(0, Calculator!I17),C17*Calculator!J17),\"\")))","v":""},{"$f":"IF(AND(N('Hidden Cells'!B17)>=0.95, N('Hidden Cells'!C17)>=0.95), \"Yes\", \"No\")","v":"No"},0]
[0,{"$f":"IF(Calculator!E18=\"No\",\n  IF(AND(Calculator!I18>0,Calculator!J18>0, ele_eligible, gas_eligible),\"Dual Fuel\",\n  IF( AND(Calculator!I18>0, ele_eligible),\"Electric Only\",\n  IF(AND(Calculator!J18>0, gas_eligible),\"Gas Only\",\"\"))),\n  IF( AND(Calculator!I18>0,Calculator!J18>0, ele_eligible, gas_eligible),\"RCx Dual Fuel\",\n  IF( AND(Calculator!I18>0, ele_eligible),\"RCx Ele Only\",\n  IF( AND(Calculator!J18>0, gas_eligible),\"RCx Gas Only\",\"\"))))","v":""},{"$error":"#N/A"},{"$f":"IFERROR(Calculator!J18/(Calculator!H18*ele_rate+Calculator!I18*gas_rate), \"\")","v":""},{"$f":"IFERROR(IF(D18>=IF(Calculator!D18=\"Yes\", Incentives!$E$9, VLOOKUP(B18, $A$4:$E$9, 5, FALSE)), \"Yes\", \"No\"), \"\")","v":""},{"$f":"IF(Calculator!D18=\"No\",(IFERROR(MIN(ele_eligible*inc_per_kwh*MAX(0, Calculator!H18)+gas_eligible*inc_per_therm*MAX(0, Calculator!I18),C18*Calculator!J18),\"\")),(IFERROR(MIN(ele_eligible*RCx_Ele_Only*MAX(0, Calculator!H18)+gas_eligible*RCx_Gas_Only*MAX(0, Calculator!I18),C18*Calculator!J18),\"\")))","v":""},{"$f":"IF(AND(N('Hidden Cells'!B18)>=0.95, N('Hidden Cells'!C18)>=0.95), \"Yes\", \"No\")","v":"No"},0]
[0,{"$f":"IF(Calculator!E19=\"No\",\n  IF(AND(Calculator!I19>0,Calculator!J19>0, ele_eligible, gas_eligible),\"Dual Fuel\",\n  IF( AND(Calculator!I19>0, ele_eligible),\"Electric Only\",\n  IF(AND(Calculator!J19>0, gas_eligible),\"Gas Only\",\"\"))),\n  IF( AND(Calculator!I19>0,Calculator!J19>0, ele_eligible, gas_eligible),\"RCx Dual Fuel\",\n  IF( AND(Calculator!I19>0, ele_eligible),\"RCx Ele Only\",\n  IF( AND(Calculator!J19>0, gas_eligible),\"RCx Gas Only\",\"\"))))","v":""},{"$error":"#N/A"},{"$f":"IFERROR(Calculator!J19/(Calculator!H19*ele_rate+Calculator!I19*gas_rate), \"\")","v":""},{"$f":"IFERROR(IF(D19>=IF(Calculator!D19=\"Yes\", Incentives!$E$9, VLOOKUP(B19, $A$4:$E$9, 5, FALSE)), \"Yes\", \"No\"), \"\")","v":""},{"$f":"IF(Calculator!D19=\"No\",(IFERROR(MIN(ele_eligible*inc_per_kwh*MAX(0, Calculator!H19)+gas_eligible*inc_per_therm*MAX(0, Calculator!I19),C19*Calculator!J19),\"\")),(IFERROR(MIN(ele_eligible*RCx_Ele_Only*MAX(0, Calculator!H19)+gas_eligible*RCx_Gas_Only*MAX(0, Calculator!I19),C19*Calculator!J19),\"\")))","v":""},{"$f":"IF(AND(N('Hidden Cells'!B19)>=0.95, N('Hidden Cells'!C19)>=0.95), \"Yes\", \"No\")","v":"No"},0]
[0,{"$f":"IF(Calculator!E20=\"No\",\n  IF(AND(Calculator!I20>0,Calculator!J20>0, ele_eligible, gas_eligible),\"Dual Fuel\",\n  IF( AND(Calculator!I20>0, ele_eligible),\"Electric Only\",\n  IF(AND(Calculator!J20>0, gas_eligible),\"Gas Only\",\"\"))),\n  IF( AND(Calculator!I20>0,Calculator!J20>0, ele_eligible, gas_eligible),\"RCx Dual Fuel\",\n  IF( AND(Calculator!I20>0, ele_eligible),\"RCx Ele Only\",\n  IF( AND(Calculator!J20>0, gas_eligible),\"RCx Gas Only\",\"\"))))","v":""},{"$error":"#N/A"},{"$f":"IFERROR(Calculator!J20/(Calculator!H20*ele_rate+Calculator!I20*gas_rate), \"\")","v":""},{"$f":"IFERROR(IF(D20>=IF(Calculator!D20=\"Yes\", Incentives!$E$9, VLOOKUP(B20, $A$4:$E$9, 5, FALSE)), \"Yes\", \"No\"), \"\")","v":""},{"$f":"IF(Calculator!D20=\"No\",(IFERROR(MIN(ele_eligible*inc_per_kwh*MAX(0, Calculator!H20)+gas_eligible*inc_per_therm*MAX(0, Calculator!I20),C20*Calculator!J20),\"\")),(IFERROR(MIN(ele_eligible*RCx_Ele_Only*MAX(0, Calculator!H20)+gas_eligible*RCx_Gas_Only*MAX(0, Calculator!I20),C20*Calculator!J20),\"\")))","v":""},{"$f":"IF(AND(N('Hidden Cells'!B20)>=0.95, N('Hidden Cells'!C20)>=0.95), \"Yes\", \"No\")","v":"No"},0]
[0,{"$f":"IF(Calculator!E21=\"No\",\n  IF(AND(Calculator!I21>0,Calculator!J21>0, ele_eligible, gas_eligible),\"Dual Fuel\",\n  IF( AND(Calculator!I21>0, ele_eligible),\"Electric Only\",\n  IF(AND(Calculator!J21>0, gas_eligible),\"Gas Only\",\"\"))),\n  IF( AND(Calculator!I21>0,Calculator!J21>0, ele_eligible, gas_eligible),\"RCx Dual Fuel\",\n  IF( AND(Calculator!I21>0, ele_eligible),\"RCx Ele Only\",\n  IF( AND(Calculator!J21>0, gas_eligible),\"RCx Gas Only\",\"\"))))","v":""},{"$error":"#N/A"},{"$f":"IFERROR(Calculator!J21/(Calculator!H21*ele_rate+Calculator!I21*gas_rate), \"\")","v":""},{"$f":"IFERROR(IF(D21>=IF(Calculator!D21=\"Yes\", Incentives!$E$9, VLOOKUP(B21, $A$4:$E$9, 5, FALSE)), \"Yes\", \"No\"), \"\")","v":""},{"$f":"IF(Calculator!D21=\"No\",(IFERROR(MIN(ele_eligible*inc_per_kwh*MAX(0, Calculator!H21)+gas_eligible*inc_per_therm*MAX(0, Calculator!I21),C21*Calculator!J21),\"\")),(IFERROR(MIN(ele_eligible*RCx_Ele_Only*MAX(0, Calculator!H21)+gas_eligible*RCx_Gas_Only*MAX(0, Calculator!I21),C21*Calculator!J21),\"\")))","v":""},{"$f":"IF(AND(N('Hidden Cells'!B21)>=0.95, N('Hidden Cells'!C21)>=0.95), \"Yes\", \"No\")","v":"No"},0]
[0,{"$f":"IF(Calculator!E22=\"No\",\n  IF(AND(Calculator!I22>0,Calculator!J22>0, ele_eligible, gas_eligible),\"Dual Fuel\",\n  IF( AND(Calculator!I22>0, ele_eligible),\"Electric Only\",\n  IF(AND(Calculator!J22>0, gas_eligible),\"Gas Only\",\"\"))),\n  IF( AND(Calculator!I22>0,Calculator!J22>0, ele_eligible, gas_eligible),\"RCx Dual Fuel\",\n  IF( AND(Calculator!I22>0, ele_eligible),\"RCx Ele Only\",\n  IF( AND(Calculator!J22>0, gas_eligible),\"RCx Gas Only\",\"\"))))","v":""},{"$error":"#N/A"},{"$f":"IFERROR(Calculator!J22/(Calculator!H22*ele_rate+Calculator!I22*gas_rate), \"\")","v":""},{"$f":"IFERROR(IF(D22>=IF(Calculator!D22=\"Yes\", Incentives!$E$9, VLOOKUP(B22, $A$4:$E$9, 5, FALSE)), \"Yes\", \"No\"), \"\")","v":""},{"$f":"IF(Calculator!D22=\"No\",(IFERROR(MIN(ele_eligible*inc_per_kwh*MAX(0, Calculator!H22)+gas_eligible*inc_per_therm*MAX(0, Calculator!I22),C22*Calculator!J22),\"\")),(IFERROR(MIN(ele_eligible*RCx_Ele_Only*MAX(0, Calculator!H22)+gas_eligible*RCx_Gas_Only*MAX(0, Calculator!I22),C22*Calculator!J22),\"\")))","v":""},{"$f":"IF(AND(N('Hidden Cells'!B22)>=0.95, N('Hidden Cells'!C22)>=0.95), \"Yes\", \"No\")","v":"No"},0]
[0,{"$f":"IF(Calculator!E23=\"No\",\n  IF(AND(Calculator!I23>0,Calculator!J23>0, ele_eligible, gas_eligible),\"Dual Fuel\",\n  IF( AND(Calculator!I23>0, ele_eligible),\"Electric Only\",\n  IF(AND(Calculator!J23>0, gas_eligible),\"Gas Only\",\"\"))),\n  IF( AND(Calculator!I23>0,Calculator!J23>0, ele_eligible, gas_eligible),\"RCx Dual Fuel\",\n  IF( AND(Calculator!I23>0, ele_eligible),\"RCx Ele Only\",\n  IF( AND(Calculator!J23>0, gas_eligible),\"RCx Gas Only\",\"\"))))","v":""},{"$error":"#N/A"},{"$f":"IFERROR(Calculator!J23/(Calculator!H23*ele_rate+Calculator!I23*gas_rate), \"\")","v":""},{"$f":"IFERROR(IF(D23>=IF(Calculator!D23=\"Yes\", Incentives!$E$9, VLOOKUP(B23, $A$4:$E$9, 5, FALSE)), \"Yes\", \"No\"), \"\")","v":""},{"$f":"IF(Calculator!D23=\"No\",(IFERROR(MIN(ele_eligible*inc_per_kwh*MAX(0, Calculator!H23)+gas_eligible*inc_per_therm*MAX(0, Calculator!I23),C23*Calculator!J23),\"\")),(IFERROR(MIN(ele_eligible*RCx_Ele_Only*MAX(0, Calculator!H23)+gas_eligible*RCx_Gas_Only*MAX(0, Calculator!I23),C23*Calculator!J23),\"\")))","v":""},{"$f":"IF(AND(N('Hidden Cells'!B23)>=0.95, N('Hidden Cells'!C23)>=0.95), \"Yes\", \"No\")","v":"No"},0]
[0,{"$f":"IF(Calculator!E24=\"No\",\n  IF(AND(Calculator!I24>0,Calculator!J24>0, ele_eligible, gas_eligible),\"Dual Fuel\",\n  IF( AND(Calculator!I24>0, ele_eligible),\"Electric Only\",\n  IF(AND(Calculator!J24>0, gas_eligible),\"Gas Only\",\"\"))),\n  IF( AND(Calculator!I24>0,Calculator!J24>0, ele_eligible, gas_eligible),\"RCx Dual Fuel\",\n  IF( AND(Calculator!I24>0, ele_eligible),\"RCx Ele Only\",\n  IF( AND(Calculator!J24>0, gas_eligible),\"RCx Gas Only\",\"\"))))","v":""},{"$error":"#N/A"},{"$f":"IFERROR(Calculator!J24/(Calculator!H24*ele_rate+Calculator!I24*gas_rate), \"\")","v":""},{"$f":"IFERROR(IF(D24>=IF(Calculator!D24=\"Yes\", Incentives!$E$9, VLOOKUP(B24, $A$4:$E$9, 5, FALSE)), \"Yes\", \"No\"), \"\")","v":""},{"$f":"IF(Calculator!D24=\"No\",(IFERROR(MIN(ele_eligible*inc_per_kwh*MAX(0, Calculator!H24)+gas_eligible*inc_per_therm*MAX(0, Calculator!I24),C24*Calculator!J24),\"\")),(IFERROR(MIN(ele_eligible*RCx_Ele_Only*MAX(0, Calculator!H24)+gas_eligible*RCx_Gas_Only*MAX(0, Calculator!I24),C24*Calculator!J24),\"\")))","v":""},{"$f":"IF(AND(N('Hidden Cells'!B24)>=0.95, N('Hidden Cells'!C24)>=0.95), \"Yes\", \"No\")","v":"No"},0]

{"sheet":"Lists","index":5,"n_rows":29,"n_cols":17,"rows_kept":29,"cut":false,"hidden":true,"merged":[]}
["LOOKUPS",{"$f":"ROWS(_xlfn.ANCHORARRAY(B3))","v":11},null,null,{"$f":"ROWS(_xlfn.ANCHORARRAY(E3))","v":14},{"$f":"ROWS(_xlfn.ANCHORARRAY(F3))","v":16},{"$f":"ROWS(_xlfn.ANCHORARRAY(G3))","v":27},{"$f":"ROWS(_xlfn.ANCHORARRAY(H3))","v":6}]
["Sector","Commercial","Industrial","Residential","Com End Use","Ind End Use","Res End Use","Gas Load Profiles","Electric Utility","Gas Utility","Yes/No","State","Electric Rate:","Gas Rate:","None","Active Sub-sector","Active Elec End Use"]
["Commercial",{"$f":"_xlfn.UNIQUE(INDEX(_xlfn._xlws.FILTER('Avoided Costs'!$L$4:$P$188,ShapeSector=$B$2),,2))","v":"College"},"Not applicable","Not applicable",{"$f":"_xlfn.VSTACK(_xlfn.UNIQUE(INDEX(_xlfn._xlws.FILTER('Avoided Costs'!$L$4:$P$188,ShapeSector=$B$2),,3)),$O$3)","v":"Compressed Air"},{"$f":"_xlfn.VSTACK(_xlfn.TAKE(_xlfn._xlws.FILTER('Avoided Costs'!$L$4:$P$188,ShapeSector=$C$2),,-1),$O$3)","v":"Ag-Irrigation"},{"$f":"_xlfn.VSTACK(_xlfn.TAKE(_xlfn._xlws.FILTER('Avoided Costs'!$L$4:$P$188,ShapeSector=$D$2),,-1),$O$3)","v":"Res Refrigerator"},{"$f":"TRANSPOSE('Avoided Costs'!$B$2:$G$2)","v":"DHW"},"PGE","NWN","No","OR",0.16358127865305985,1.1665886823743341,"None - ele",{"$f":"INDIRECT(Calculator!$B$10)","v":"College"},{"$f":"OFFSET(Lists!$D$3,,MATCH(Calculator!$B$10,Lists!$A$3:$A$5,0),OFFSET(Lists!$D$1,,MATCH(Calculator!$B$10,Lists!$A$3:$A$5,0)))","v":"Compressed Air"}]
["Industrial","Grocery",null,null,"Cooking","Flat","Res Freezer","FLAT","PAC","NWN-Firm","Yes","WA",null,null,null,"Grocery","Cooking"]
["Residential","Healthcare",null,null,"Cooling","1-Shift Industrial","Res Dryer","Res Heating","Other","CNG",null,null,null,null,null,"Healthcare","Cooling"]
[null,"Lodging",null,null,"Exterior Lights","2-Shift Industrial","Res Clotheswasher","Com Heating",null,"Avista",null,null,null,null,null,"Lodging","Exterior Lights"]
[null,"Large Office",null,null,"Heating","3-Shift Industrial","Res Central AC","Clotheswasher",null,"Other",null,null,null,null,null,"Large Office","Heating"]
[null,"Other",null,null,"Hot Water","Cold Storage","Res Window AC","None",null,null,null,null,null,null,null,"Other","Hot Water"]
[null,"Restaurant",null,null,"Interior Lights","Food Products","Res Water Heat",null,null,null,null,null,null,null,null,"Restaurant","Interior Lights"]
[null,"Retail",null,null,"Other","Wood Products","Res HP Water Heat",null,null,null,null,null,null,null,null,"Retail","Other"]
[null,"School",null,null,"Motors","Pulp & Paper","Res HP Water Heat Convert",null,null,null,null,null,null,null,null,"School","Motors"]
[null,"Small Office",null,null,"Office Eqpmt","Chemicals","Res Solar Water Heat",null,null,null,null,null,null,null,null,"Small Office","Office Eqpmt"]
[null,"Warehouse",null,null,"Process","Oil & Petroleum","Res Air Source HP",null,null,null,null,null,null,null,null,"Warehouse","Process"]
[null,null,null,null,"Refrigeration","Primary Metals","Res Ductless HP",null,null,null,null,null,null,null,null,null,"Refrigeration"]
[null,null,null,null,"Ventilation","Transportation & Equipment","Res Ductless HP - HZ 2",null,null,null,null,null,null,null,null,null,"Ventilation"]
[null,null,null,null,"None - ele","Other Industrial","Res Ductless HP - HZ 3",null,null,null,null,null,null,null,null,null,"None - ele"]
[null,null,null,null,null,"Street Lighting","Res Ductless HP Convert"]
[null,null,null,null,null,"None - ele","Res Ductless HP Convert - HZ 2"]
[null,null,null,null,null,null,"Res Ductless HP Convert - HZ 3"]
[null,null,null,null,null,null,"Res Ductless HP - Cooling"]
[null,null,null,null,null,null,"Res Zonal Ele Heat"]
[null,null,null,null,null,null,"Res Ele Resistance Heat"]
[null,null,null,null,null,null,"Res Lighting"]
[null,null,null,null,null,null,"Res Other"]
[null,null,null,null,null,null,"Res Whole Home"]
[null,null,null,null,null,null,"Res Spa Cover"]
[null,null,null,null,null,null,"Res Power Strip"]
[null,null,null,null,null,null,"Res Space Conditioning"]
[null,null,null,null,null,null,"None - ele"]

{"sheet":"Avoided Costs","index":6,"n_rows":188,"n_cols":87,"rows_kept":188,"cut":false,"hidden":true,"merged":[[1,8,1,9],[1,16,1,23],[1,25,1,26],[8,8,8,9]]}
["Gas Avoided Costs",null,null,null,null,null,null,null,null,null,null,null,null,null,"Electric Avoided Costs"]
["Lifetime","DHW","FLAT","Res Heating","Com Heating","Clotheswasher","None",null,"Gas Avoided Cost Info",null,null,null,null,null,null,null,"Lifetime (yrs)",null,null,null,null,null,null,null,null,"Electric Avoided Cost Info"]
[1,1.4104576543049419,1.3266310501664833,2.0159526696608738,1.9907115922220784,1.3710050781643239,0,null,"Updated on","2025-01-21",null,"Sector","Subsector","End Use","Load Profile Name","Friendly Name",0,1,2,3,4,5,6,7,8,9,10,11,12,13,14,15,16,17,18,19,20,21,22,23,24,25,26,27,28,29,30,31,32,33,34,35,36,37,38,39,40,41,42,43,44,45,46,47,48,49,50,51,52,53,54,55,56,57,58,59,60,61,62,63,64,65,66,67,68,69,70]
[2,2.7418415159690075,2.5776409728367407,3.9277508849556213,3.8780457394151777,2.6649357185780902,0,null,"Base Year","2025$",null,"Residential","Not applicable","Not applicable","R-All-Ref-Refrig-All-All-C","Res Refrigerator",0,0.13618744729744195,0.27495246384631106,0.39490771126821284,0.50529685105289879,0.61415074339928277,0.68758257942297507,0.75797228098845537,0.82459948828687124,0.88619112181587933,0.94537302407041712,1.0025429507559724,1.0572477195876111,1.1107063724105464,1.1624418216031494,1.2122959194837055,1.2608450309703489,1.3079250516278036,1.3536560140090561,1.3972681570598635,1.4389281329920829,1.4787266889148007,1.5167501712940499,1.5530807488672551,1.5877966237897647,1.6209722316575477,1.6526784310138201,1.682982682913172,1.7119492210845118,1.7396392132037732,1.7661109137586803,1.7914198089608828,1.8156187541353197,1.8387581039926832,1.8608858361682434,1.8820476683889598,1.9022871696107118,1.9216458654485162,1.940163338204713,1.9578773217832472,1.9748237917622697,1.9910370508822655,2.0065498101927828,2.0213932660874678,2.0355971734445326,2.0491899150778754,2.0621985676928758,2.0746936715397695,2.0866955002275933,2.0982235270144765,2.109296456403472,2.1199322544910673,2.1301481781176115,2.1399608028669577,2.1493860499607491,2.1584392120909874,2.1671349782327978,2.1754874574776442,2.1835102019256771,2.1912162286743393,2.1986180409389275,2.2057276483393582,2.2125565863860688,2.2191159351966641,2.2254163374736744,2.2314680157725983,2.2372807890882496,2.2428640887863103,2.2482269739059535,2.2533781458583535,2.2583259625449346]
[3,4.0560819849408736,3.8145352571443287,5.8006810627795362,5.7276858857675084,3.9427726859722552,0,null,"Discount Rate",4.1000000000000002E-2,null,"Residential","Not applicable","Not applicable","R-All-Ref-Freezer-All-All-R","Res Freezer",0,0.13537443097366775,0.27331562635893369,0.39269525200076127,0.50280477326522222,0.6112167101442183,0.68410820274572437,0.75398894051897125,0.82008714210304712,0.8811716597602226,0.93989436315930508,0.99658243317667394,1.0508745804950068,1.1039382144836869,1.1553198638170956,1.2048043618994253,1.2529708845640473,1.2996378080983695,1.3450018713872338,1.3882564924320469,1.4295769723926037,1.4690531202345456,1.5067703946231148,1.5428101240602508,1.5772497154106577,1.6101628514518866,1.6416196780476986,1.6716869815102613,1.7004283566849629,1.7279043662616815,1.7541726917881215,1.779288276834228,1.8033034627316078,1.8262681172882409,1.8482297568564803,1.8692336621113106,1.8893229878760298,1.9085388673138171,1.9269205107860337,1.944505299661474,1.9613288753451099,1.9774252237800798,1.9928267556627191,2.0075643825972684,2.0216675894044784,2.035164502786607,2.0480819565402451,2.0604894618266139,2.0724071501239618,2.0838543581705928,2.0948496593391943,2.1054108937725835,2.1155551973297722,2.1252990293893137,2.1346581995550435,2.1436478933075462,2.1522826966429629,2.160576619739127,2.168543119687417,2.1761951223272109,2.1835450432183778,2.1906048077858231,2.197385870668779,2.2038992343062356,2.2101554667886636,2.2161647190050009,2.2219367411127107,2.2274808983576539,2.2328061862694231,2.2379212452568105,2.2428343746270798]
[4,5.2966050044216217,4.9810416878814641,7.5757898346336701,7.4802594825195108,5.148787203419869,0,null,"Source","Link",null,"Residential","Not applicable","Not applicable","R-All-Plug-Dryer-All-All-R","Res Dryer",0,0.15409002404019834,0.34257038560876218,0.50911380163428688,0.66198947193964819,0.81073796143007759,0.92520546132889681,1.0348312671027933,1.1389019267303444,1.2370279995577622,1.3310384619013842,1.4218168890548866,1.508543360259494,1.5928033812222329,1.6740924565166528,1.7525323615413448,1.8282265385844214,1.9019146241196025,1.972992094495412,2.0409502029648392,2.1059886679077695,2.1682367757112471,2.2278178713434653,2.28484964320119,2.3394443936798357,2.3917092962131399,2.4417466394887981,2.489654059508084,2.5355247601213433,2.5794477226370724,2.6215079050700716,2.661786431563709,2.7003607724925884,2.7373049157247484,2.7726895294968905,2.8065821173318968,2.8390471654050122,2.8701462827434518,2.8999383346237462,2.9284795695118535,2.9558237398727973,2.9820222171593618,3.0071241012730594,3.0311763247751946,3.054223752111251,3.0763092740980746,3.097473897910294,3.1178029957992761,3.1373295522193914,3.1560852494820129,3.1741005191608349,3.1914045914678391,3.2080255426800224,3.2239903406938382,3.2393248887812605,3.2540540676184739,3.2682017756553705,3.2817909678913675,3.2948436931204492,3.3073811297058704,3.3194236199425635,3.3309907030630064,3.3421011469401005,3.3527729785385003,3.3630235131638004,3.3728693825570386,3.3823265618800988,3.3914103956357997,3.4001356225647221,3.4085163995591725,3.4165663246330849]
[5,6.490515570619622,6.1038949410513386,9.2829099737409688,9.1657131665584295,6.3096103412003588,0,null,"Inputs","Inputs received from OPUC in new Avoided Cost Input Template",null,"Residential","Not applicable","Not applicable","R-All-WH-Cwash-All-All-R","Res Clotheswasher",0,0.14869484178000522,0.30877267953942611,0.44817689620991635,0.57664926270741368,0.70275117475598137,0.79171081058988046,0.87703567345239886,0.95789526375225864,1.0330313180456128,1.1052426810665761,1.1749628596372843,1.2418008532036262,1.3068292008163724,1.369642113154365,1.4301420843324684,1.4889673672127317,1.5458908246078296,1.6012548676880261,1.6540960532499771,1.7046185739108037,1.7529277806513355,1.799124038875425,1.8433029749345637,1.8855557099207001,1.9259690814113342,1.9646258538129591,2.0016049179130886,2.0369814802173187,2.0708272426160059,2.1032105728950738,2.1341966665771217,2.1638477005522532,2.1922229789328167,2.2193790715424355,2.2453699454272571,2.2702470897561411,2.2940596344565112,2.3168544629137249,2.3386763190439721,2.3595679090339376,2.3795699980245337,2.398721502001067,2.4170595751380128,2.4346196928332371,2.4514357306538548,2.4675400394040259,2.4830085906960937,2.4978664826296906,2.5121378224948301,2.5258457658865692,2.5390125542755224,2.5516595510951876,2.563807276404634,2.5754754401827982,2.5866829743084003,2.5974480632773771,2.6077881737076689,2.6177200826792295,2.6272599049552459,2.636423119128732,2.6452245927369211,2.6536786063842075,2.6617988769127701,2.6695985796584831,2.6770903698282207,2.6842864030332318,2.691198355011919,2.6978374405740042,2.7042144317968315,2.7103396755033224]
[6,7.6500681848975915,7.1951144060249153,10.936008527450992,10.798038339048707,7.437261983575012,0,null,null,null,null,"Residential","Not applicable","Not applicable","R-All-HVAC-CAC-All-All-E","Res Central AC",0,0.33408606205268782,0.79182959837618105,1.2049397587452386,1.5965387473882895,1.9923972298266401,2.3092341183317848,2.613618209094819,2.9042578134487287,3.1794480023450338,3.4440426952585512,3.6977464122848902,3.9421297326215674,4.1771112767936227,4.4034356219021538,4.6197528899069535,4.8283733595833178,5.0290772666965173,5.2232727099678486,5.4090682748656125,5.5872541893716177,5.7581473243390047,5.922051050898026,6.0792558331864814,6.2300397940624821,6.3746692550854096,6.5133992519868684,6.6464740267926992,6.7741274976995349,6.896583707754826,7.0140572533374606,7.1267536933870463,7.2348699402833434,7.3385946332331606,7.4381084949801446,7.5335846726131122,7.6251890632108408,7.7130806250254382,7.7974116748724054,7.8783281723632399,7.955969991585798,8.0304711808085276,8.1019602107570634,8.1705602119854372,8.2363892018392146,8.2995603014842221,8.3601819434519697,8.4184103960192047,8.4743401362624411,8.5280619115417,8.5796628867402962,8.6292267856919782,8.6768340270248796,8.7225618546426897,8.7664844630547609,8.8086731177585094,8.8491962708694007,8.888119672186173,8.9255064758714795,8.9614173429210471,8.9959105395876175,9.0290420319193565,9.0608655765661119,9.0914328080008975,9.1207933222980699,9.1489947576041608,9.176082871431932,9.2021016149030412,9.2270932040598055,9.2510981883617607,9.2741555164781335]
[7,8.7759515021988221,8.2552682805075204,12.536633192607233,12.378740047744673,8.5323855885606648,0,null,"Electric Avoided Cost Info",null,null,"Residential","Not applicable","Not applicable","R-All-HVAC-RAC-All-All-E","Res Window AC",0,0.35112209418449836,0.83983250261313702,1.2820674095730571,1.7014597819929569,2.12432936980067,2.4663497841451876,2.7949374904134974,3.1087801612737822,3.4061930787220605,3.6921263697453326,3.96635324408811,4.2304652344450364,4.4843722121438541,4.7288687378639729,4.9626179579374403,5.1880118025228503,5.4048032353753861,5.6145213677046346,5.8152222765423796,6.007723748508897,6.1923660205355073,6.369474902361203,6.5393624061834634,6.702327347815257,6.8586559206935052,7.0086222440177908,7.1524888862350533,7.2905073650262322,7.4229186248940886,7.5499534933976404,7.6718331170276084,7.7887693776688076,7.9009652905494736,8.0086153845338686,8.1119060655731001,8.2110159640897677,8.3061162670347013,8.3973710353186366,8.4849375072879756,8.5689663888818064,8.6496021310769553,8.7269831951990557,8.8012423066500531,8.8725066975766733,8.9408983389794336,9.0065341627383759,9.0695788498567538,9.1301346918684505,9.1882999420958029,9.2441689750679981,9.2978324396460366,9.3493774061027057,9.3988875073962124,9.4464430748666821,9.4921212685757101,9.5359962025004332,9.5781390647852493,9.6186182332463162,9.6574993863162106,9.6948456096087803,9.7307174982770821,9.76517325533049,9.7982687860704836,9.8300577887983618,9.8605918419420338,9.8899204877432751,9.9180913126412111,9.9451500244824711,9.9711405266832784,9.9961049894638059]
[8,9.8614730634943299,9.2776733018447661,14.078028157177354,13.900992982338341,9.5883827782203266,0,null,"Updated on","2025-01-21",null,"Residential","Not applicable","Not applicable","Residential-res-Water Heating","Res Water Heat",0,0.14048841060178532,0.2844001418111019,0.40859921093834883,0.52192212933026183,0.63245697658325739,0.7089081523197508,0.78219276566552876,0.85151611572227148,0.91575363655147812,0.97741899566993196,1.0371079364622613,1.094171827935714,1.1498793431399938,1.2036968015433045,1.2556733991386446,1.3062915715029308,1.3554408972485723,1.403256261049328,1.4488806064068644,1.4924689746585105,1.5341156712002837,1.5739104457985171,1.6119387224779009,1.6482818173154445,1.6830171448003581,1.7162184133827318,1.7479558107989237,1.7782961797285881,1.8073031843072127,1.8350374679887353,1.8615568032251986,1.8869162334043721,1.9111682074617244,1.934362707559985,1.9565473702077163,1.9777676011677343,1.9980666844868094,2.0174858859597746,2.0360645513239044,2.0538401994631279,2.070848610886304,2.0871239117292477,2.1026986535165655,2.1176038889064137,2.1318692436291347,2.1455229848192294,2.1586377107726396,2.1712347004502979,2.1833343927734736,2.1949564197864175,2.2061196385098292,2.2168421615368312,2.2271413864210898,2.2370340239047692,2.2465361250321148,2.2556631071926616,2.2644297791363246,2.2728503650009508,2.2809385273913323,2.2887073895471119,2.2961695566355558,2.3033371362037474,2.3102217578233724,2.3168345919599829,2.323186368097347,2.3292873921462998,2.3351475631663292,2.3407763894270435,2.3461830038355673,2.3513761787549066]
[9,10.911951013677447,10.267550865942361,15.566242830182278,15.370851341148553,10.610473333742409,0,null,"Base Year","2025$",null,"Residential","Not applicable","Not applicable","R-All-WH-HPWH-All-All-R","Res HP Water Heat",0,0.13922278018147069,0.28619150454843295,0.41378789233739588,0.52999301564422407,0.6423405510376754,0.72292437292791711,0.80012716390650418,0.87330040391608932,0.94138701961007576,1.006718355700694,1.0699777666984989,1.1303643611260188,1.1893072015333781,1.2462053914180553,1.3012601858492463,1.3547818279347665,1.4068497693052202,1.4573306844954874,1.5055537356799695,1.5516386633535435,1.595683760939568,1.6377826122144932,1.6780243270387261,1.7164937647783955,1.7532717460855107,1.7884352536666406,1.8220576226350542,1.8542087210080622,1.8849551208800113,1.9143602607718815,1.9424845996306195,1.9693857629251006,1.9951186812608823,2.01973572191257,2.0432868136506173,2.0658195652186135,2.0873793777975398,2.1080095517749906,2.1277513881199321,2.1466442846471159,2.1647258274397556,2.1820318776844161,2.1985966541582478,2.2144528115956459,2.2296315151491086,2.2441625111474206,2.2581198601036321,2.2715262081549352,2.2844033074261896,2.2967720513232739,2.3086525084331426,2.3200639550855957,2.3310249066295903,2.341553147474845,2.3516657599474748,2.3613791520064793,2.3707090838660552,2.3796706935669256,2.3882785215381777,2.3965465341894618,2.4044881465718304,2.4121162441439838,2.4194432036792377,2.4264809133471412,2.4332407920023171,2.439733807711832,2.4459704955511503,2.4519609746975517,2.4577149648487393,2.463241801993286]
[10,11.929938590603197,11.227317468348742,17.00480622700108,16.791814488012591,11.601135441141096,0,null,"Discount Rate",4.1099999999999998E-2,null,"Residential","Not applicable","Not applicable","R-All-WH-WHConvert-All-All-N","Res HP Water Heat Convert",0,0.14693780098366313,0.3062509170363063,0.44543939827663626,0.57378126054407252,0.69907083537292602,0.78828163832496967,0.87388765117477119,0.95501015845549142,1.0304729080526605,1.1029376455851818,1.1729902141673714,1.2401401635731664,1.3055177811992584,1.368636769833165,1.429484235862442,1.4886673208546719,1.5458622733493228,1.6015235140814998,1.6546641790838872,1.705476736748067,1.7540667661743288,1.8005348606715503,1.8449768737559156,1.8874841524710817,1.9281437587097878,1.9670386791791818,2.004248024616575,2.0398472188287817,2.0739081780965618,2.1064994814558506,2.1376865323392842,2.1675317120350006,2.1960945253946091,2.2234317391985967,2.2495975135651265,2.2746435267671266,2.2986190938026922,2.321571279045092,2.3435450032809348,2.3645831454283708,2.3847266392114057,2.4040145650515155,2.4224842374236863,2.4401712879107174,2.4571097441770733,2.4733321050717447,2.4889140481076408,2.5038808553652494,2.5182568108523387,2.5320652399053487,2.5453285470353175,2.5580682522797398,2.5703050261193545,2.5820587230164969,2.5933484136294465,2.6041924157550347,2.6146083240497116,2.6246130385773045,2.6342227922297807,2.6434531770655085,2.6523191696077504,2.6608351551444338,2.669014951068633,2.676871829297621,2.6844185378068786,2.6916673213139934,2.6986299411460126,2.705317694322479,2.711741431885121,2.717911576503929]
[11,12.917780203245892,12.159194148519415,18.396945925198626,18.167082744068317,12.562645540684692,0,null,"Source","Link",null,"Residential","Not applicable","Not applicable","R-All-WH-SWH-All-All-C","Res Solar Water Heat",0,0.13699197787598727,0.27867556265591531,0.40121823764548209,0.5129768771879798,0.62154596953152508,0.69753892207281565,0.77035080010139367,0.83929100421887282,0.9032596225178039,0.96464293991254602,1.024091333041703,1.0808513655780965,1.1362996761182633,1.1898744459594102,1.2416803524167093,1.2920948582054952,1.3410976074396674,1.3886575732365802,1.4340664751142693,1.4774502303924639,1.5189025668330538,1.5585126888531244,1.5963655055473562,1.6325418467265371,1.6671186676255876,1.7001692428977835,1.7317633504772576,1.7619674458592429,1.790844827316779,1.8184557925436198,1.8448577871857617,1.8701055456982483,1.8942512249396257,1.9173445308935169,1.9394328388851916,1.960561307640643,1.9807729875164664,2.0001089232107319,2.0186082512479437,2.0363082925150593,2.0532446401103321,2.0694512427524057,2.0849604839835156,2.0998032573879213,2.1140090380345904,2.1276059503418132,2.140666090873196,2.1532106500235018,2.1652599816441969,2.1768336360680709,2.1879503918301242,2.1986282861361977,2.2088846441287768,2.2187361069974529,2.2281986589796601,2.2372876532954873,2.2460178370586479,2.254403375204034,2.2624578734706611,2.2701944004773145,2.277625508926699,2.2847632559725004,2.291619222782415,2.2982045333288696,2.3045298724379419,2.3106055031257449,2.3164412832504242,2.3220466815067673,2.3274307927893947,2.3326023529494444]
[12,13.872010175623167,13.059647936071453,19.739660160899799,19.493593188043342,13.491564626167094,0,null,"Inputs","PAC and PGE avoided costs",null,"Residential","Not applicable","Not applicable","R-All-HVAC-ASHP-All-All-E","Res Air Source HP",0,0.16165989080289461,0.35286105566514436,0.52241284976277846,0.67879904278096115,0.83099856743862788,0.95110797393911761,1.0662589102645392,1.1762123313927695,1.2796912645845817,1.3789424784583408,1.4748961751079379,1.5664263566129293,1.6551005987445828,1.7407211321404936,1.8235212200855169,1.9037212563269361,1.981644101841898,2.056680187459039,2.1285859507495322,2.1974012453309921,2.2632629533024313,2.3263016661058002,2.3866419860632089,2.4444028128055342,2.4996976153824844,2.5526346908012871,2.6033174097006468,2.6518444498283968,2.6983100179551425,2.7428040608221234,2.785412465689316,2.826217251019413,2.8652967478045821,2.9027257720158115,2.9385757886290125,2.9729150676578522,3.0058088326004269,3.0373194016852665,3.0675063222817616,3.0964264988207835,3.1241343145530407,3.1506817474554767,3.1761184805796976,3.200492007121023,3.22384773047217,3.2462290595118048,3.2677268301770956,3.2883759231223375,3.3082098420016397,3.3272607678294199,3.3455596111948802,3.3631360624151858,3.3800186397087271,3.3962347354666185,3.4118106606975203,3.4267716877178849,3.4411420911569057,3.4549451873426911,3.468203372133571,3.4809381572559221,3.4931702052074649,3.5049193627826667,3.5162046932746485,3.5270445074058383,3.5374563930375644,3.5474572437067851,3.5570632860362639,3.5662901060626586,3.5751526745252407,3.5836653711562874]
[13,14.788713024504576,13.92470884368243,21.029406991552058,20.767742849235955,14.384013939798024,0,null,null,null,null,"Residential","Not applicable","Not applicable","R-All-HVAC-DHP-HZ1-All-N","Res Ductless HP",0,0.14199098371995963,0.30689144018693232,0.45277244691481389,0.58599397457912461,0.71320269905188816,0.813713720232766,0.91002248702715116,1.0018081957746399,1.088139066208399,1.1707720218181199,1.2509019127047278,1.3271821637635739,1.401337850653825,1.4729572526694774,1.5424509301954408,1.6097675021025579,1.6752530649324138,1.7383321358749515,1.798782979238899,1.8566088585698752,1.9119274763825354,1.9648510502655219,2.0154865796669497,2.0639360991217632,2.1102969186389813,2.1546618519274499,2.1971194331015313,2.2377541224730773,2.2766465020029232,2.3138734609538956,2.3495083722578349,2.3836212600813034,2.4162789590483631,2.447545265554012,2.4774810815784511,2.5061445513902201,2.5335911915053821,2.5598740142502048,2.5850436452561567,2.6091484351984571,2.6322345660727828,2.6543461522890479,2.6755253368463308,2.6958123828390064,2.7152457605308973,2.7338622302217326,2.7517437686818575,2.7689193891411068,2.7854169594602398,2.8012632473472179,2.8164839637884609,2.8311038047655455,2.8451464913250355,2.8586348080664532,2.8715906401108464,2.8840350086099273,2.8959881048534015,2.907469323029825,2.9184972916941443,2.9290899039929816,2.9392643466966963,2.949037128085338,2.958424104733731,2.9674405072391505,2.9761009649333392,2.9844195296189495,2.992409698368935,3.00008443542588,3.0074561932367967,3.0145369326575215]
[14,15.674786221996513,14.76119046201355,22.273732407207358,21.99710192839532,15.24677590680008,0,null,null,null,null,"Residential","Not applicable","Not applicable","R-All-HVAC-DHP-HZ2-All-N","Res Ductless HP - HZ 2",0,0.1396907129181596,0.29819881087119554,0.43761776254098927,0.56462978842510614,0.68648486644512463,0.78184050385234649,0.8731989388901189,0.9603164793352934,1.0422338529589468,1.1205927404370353,1.1966842100836961,1.2689968065614556,1.3393081548066337,1.4072801488786881,1.473324438944416,1.5373408229183259,1.5997956377175278,1.6598261225310367,1.7173819808743078,1.7724216065895888,1.8250587252294668,1.875401716155227,1.9235538749183865,1.9696136621942628,2.0136749399850609,2.0558271957703464,2.0961557552454027,2.1347419842527149,2.171663480478581,2.2069942554554598,2.2408049073810727,2.2731627852373397,2.3041321446658682,2.3337742960318306,2.3621477450845898,2.3893083266012702,2.415309331378535,2.4402016269180846,2.4640337721327463,2.4868521263824004,2.5087009531323594,2.5296225185111267,2.5496571850295955,2.5688435007097685,2.587218283857815,2.6048167037037846,2.6217203823571023,2.6379567464463518,2.6535521398660515,2.6685318665202638,2.6829202313787901,2.6967405799125777,2.7100153359723107,2.7227660381716503,2.735013374834161,2.7467772175606147,2.7580766534711456,2.7689300161745654,2.7793549155150901,2.7893682661447361,2.7989863149677561,2.808224667501634,2.8170983131974148,2.8256216497604552,2.8338085065110454,2.8416721668228222,2.8492253896753597,2.8564804303559259,2.8634490603439833,2.8701425864106982]
[15,16.53427957716487,15.573013944736799,23.477610893140046,23.186632560931251,16.083808117070635,0,null,null,null,null,"Residential","Not applicable","Not applicable","R-All-HVAC-DHP-HZ3-All-N","Res Ductless HP - HZ 3",0,0.13805867933289154,0.29074929209588074,0.42414006583331304,0.54515895322513319,0.66131933425039646,0.75086266593198214,0.83659085158884416,0.91814258253646541,0.99477883258556743,1.0681067054643489,1.1393067530606213,1.2068471078202101,1.2726307718019738,1.3362755724547735,1.3980618220672598,1.4579478865297051,1.516495820290964,1.5727915980205776,1.6267337056570255,1.6783007471551972,1.7276009728938413,1.7747374969852487,1.8198085517592129,1.8629077290866349,1.9041242092503912,1.9435429780317626,1.9812450326436502,2.0173075771068305,2.0518042076325371,2.0848050885435461,2.1163771192366077,2.1465840926613931,2.1754868457650227,2.203143402326595,2.2296091085829146,2.2549367620246712,2.2791767337216324,2.3023770845158809,2.3245836754036895,2.3458402724092271,2.3661886462368593,2.3856686669732978,2.4043183940962201,2.4221741620321304,2.4392706614932078,2.4556410168105236,2.4713651118228332,2.4864684592556543,2.5009755646565006,2.5149099661557281,2.5282942726577238,2.5411502005243993,2.5534986088105156,2.5653595331080044,2.5767522180542048,2.5876951485567505,2.5982060797857831,2.6083020659821452,2.6179994881283002,2.6273140805268738,2.6362609563299415,2.644854632060484,2.653109051165798,2.6610376066410781,2.6686531627598753,2.6759680759466939,2.6829942148255905,2.6897429794773018,2.6962253199361541,2.7024517539567596]
[16,17.364034161373407,16.356984962470474,24.638130621471941,24.333374938156258,16.891984552199325,0,null,null,null,null,"Residential","Not applicable","Not applicable","R-All-HVAC-ERconvertDHP-HZ1-All-N","Res Ductless HP Convert",0,0.13635303944937938,0.28976231794351259,0.42484206447683825,0.54777859721509603,0.66487000900452331,0.75619301436159014,0.84368023490856481,0.92702301429990541,1.005240132388499,1.0800890171202451,1.1527403878234808,1.22181433900172,1.2890661031910076,1.3540468241937582,1.4171898083032499,1.4784147183508038,1.538052928515121,1.5954874301866508,1.6505281839620276,1.7031577749660802,1.7534854491526353,1.8016153024853947,1.8476465344302557,1.8916736884187586,1.9337868799795104,1.9740720131958849,2.0126109861119188,2.0494818856740435,2.0847591727639201,2.1185138578471299,2.1508136677336793,2.1817232039190952,2.211304092949264,2.2396151292279676,2.2667124106632284,2.2926494675270463,2.3174773848827446,2.3412449189149638,2.363998607479191,2.3857828751706234,2.4066401331959768,2.4266108743166126,2.4457337631169271,2.4640457218383482,2.4815820120064127,2.4983763120662661,2.5145076155528221,2.5300020958972231,2.5448848932696189,2.5591801553697011,2.5729110766069332,2.5860999357340413,2.5987681319948308,2.6109362198449793,2.6226239423021385,2.6338502629794598,2.6446333968545161,2.6549908398235456,2.6649393970889661,2.6744952104262252,2.6836737843742218,2.6924900113917958,2.700958196021106,2.7090920780970924,2.7169048550406969,2.7244092032719949,2.7316172987779961,2.7385408368684789,2.7451910511519126,2.7515787317622613]
[17,18.165743982320393,17.114701680382197,25.757670866945855,25.439685634858318,17.672948597888752,0,null,null,null,null,"Residential","Not applicable","Not applicable","R-All-HVAC-ERconvertDHP-HZ2-All-N","Res Ductless HP Convert - HZ 2",0,0.13230476140516989,0.27488512622599309,0.3993583230692635,0.51220113068286899,0.62011942193933711,0.70273940019263603,0.78187383958926182,0.85723999528800854,0.92783203845460527,0.99532661499499586,1.0609667474941167,1.1231991422804348,1.1838543780586124,1.2425743930834643,1.2996921890465805,1.3551609450319275,1.4093383554136916,1.4614424434368076,1.51138849911102,1.5591189801233738,1.6047357303969265,1.6483357173798991,1.6900112758477768,1.7298503389929543,1.7679366574902573,1.8043500071882115,1.8391663860396712,1.8724582008512383,1.9042944443986722,1.934740863425102,1.963860118010186,1.9917119327713528,2.018353240332746,2.0438383174734751,2.068218914344079,2.0915443771187219,2.1138617644304643,2.13521595791789,2.1556497671934269,2.1752040295267214,2.1939177045204401,2.2118279640407552,2.2289702776505393,2.2453784937798087,2.2610849168552791,2.2761203805988872,2.2905622821872145,2.3044340539558514,2.3177582031909263,2.3305563486477268,2.3428492556276521,2.35465686967042,2.3659983489161869,2.376892095190096,2.3873557838596851,2.3974063925135982,2.4070602285081359,2.4163329554263355,2.4252396184925149,2.433794668983515,2.4420119876762434,2.449904907369576,2.4574862345171433,2.4647682700061142,2.4717628291156815,2.4784812606876416,2.4849344655401633,2.4911329141546301,2.4970866636642515,2.502805374172004]
[18,18.944258921871395,17.850906571347554,26.841866129491663,26.511200738596184,18.431454214787085,0,null,null,null,null,"Residential","Not applicable","Not applicable","R-All-HVAC-ERconvertDHP-HZ3-All-N","Res Ductless HP Convert - HZ 3",0,0.12952135243200102,0.26769748931671672,0.38819222816171339,0.49711479492978045,0.60054246942415901,0.67943472660332271,0.75492178019040801,0.82670906967969682,0.8938770379228016,0.95815879102014556,1.0206127953412938,1.0797808770909396,1.1375891958905373,1.1935377350890992,1.2479420668908174,1.3007617372656057,1.3523894491169077,1.4020554815990092,1.4496463900017735,1.4951198301713526,1.5385734776845843,1.5801003134737013,1.6197888594280125,1.6577234016678581,1.6939842021603204,1.7286476993086775,1.7617866981122412,1.7934705504599031,1.8237653260893019,1.8527339747139084,1.8804364797924054,1.9069300043883961,1.9322690295436644,1.9565054855647688,1.9796888766006833,2.0018663988683576,2.0230830528634174,2.0433817498746842,2.0628034131037158,2.0813870736740419,2.0991699617992259,2.116187593364165,2.1324738521601856,2.1480610680013976,2.1629800909374168,2.1772603617658994,2.1909768835490926,2.2041519116762593,2.2168068229500721,2.2289621502709953,2.2406376159524122,2.251852163720558,2.2626239894511757,2.2729705706927641,2.2829086950243251,2.2924544872936186,2.3016234357801162,2.3104304173251151,2.3188897214697684,2.327015073640216,2.3348196574174209,2.3423161359278475,2.3495166723896923,2.3564329498480001,2.3630761901306898,2.3694571720562392,2.3755862489225819,2.3814733653055833,2.387128073194356,2.3925595474895949]
[19,19.695006512586822,18.56101768877889,27.886203475136956,27.543355496530264,19.162988767012816,0,null,null,null,null,"Residential","Not applicable","Not applicable","R-All-HVAC-DHP_cool-All-All-N","Res Ductless HP - Cooling",0,0.31855738743965478,0.75228900502470797,1.1426492550910436,1.5125399579966747,1.8877666868959362,2.1846305201352596,2.4698378911350698,2.742103988952473,2.9998283727534107,3.2476483797446298,3.4850905776418419,3.7139423156136333,3.9340223414317412,4.1460821742911405,4.3487296376775326,4.5440865386805038,4.7321109638605732,4.91410986099861,5.0881916648920704,5.2551259242340391,5.4152112880771348,5.5687336237741647,5.7159665814456861,5.8571721325405273,5.9926010837316017,6.12249356732696,6.2470795093169773,6.3665790761225161,6.4812031010558746,6.5911534914559819,6.6966236174116371,6.7977986829413304,6.8948560804553356,6.9879657292850821,7.0772903990262286,7.1629860184053005,7.2452019703450175,7.3240813738705111,7.3997613534673654,7.4723732964727825,7.5420430990529717,7.6088914012931825,7.6730338119013854,7.7345811230025339,7.7936395154774578,7.8503107552786835,7.9047447575851146,7.9570298428856923,8.0072508449993958,8.0554892487201748,8.1018233220280038,8.146328243080573,8.1890762221916731,8.2301366189941927,8.2695760549777848,8.3074585215838663,8.3438454840332792,8.3787959810550934,8.4123667206783903,8.4446121722424063,8.4755846547743587,8.505334421878338,8.5339097432729965,8.5613569831103398,8.5877206752026893,8.6130435952798674,8.6373668303938587,8.6607298455835533,8.683170547907725,8.7047253479501521]
[20,20.426878296273259,19.253805994444686,28.900474538513979,28.545974919289115,19.876290365564163,0,null,null,null,null,"Residential","Not applicable","Not applicable","R-All-HVAC-Zonal-All-All-E","Res Zonal Ele Heat",0,0.13973886298085594,0.29640613354660345,0.43417557050817079,0.55951705134794427,0.67945015708684231,0.77283589461704216,0.86224613390737703,0.94749027396636987,1.0274681333519426,1.1041236372718868,1.1784406458919783,1.2490726635972778,1.3177930394417752,1.3841786212468479,1.4486548002752762,1.5111966593436175,1.5722272734957117,1.6309376587895814,1.6872048907696309,1.7410058830674773,1.7924524500842571,1.84165113131044,1.8887034511619254,1.9337061654517129,1.9767514952123835,2.0179273485450437,2.0573175311330347,2.0950019460234954,2.1310567832466347,2.1655546998112372,2.1985649905853508,2.2301537505432112,2.2603840288331316,2.289315975096252,2.3170069784425937,2.343511799468748,2.3688826956806324,2.3931695406650562,2.4164199373352053,2.4386793255575991,2.4599910844514836,2.4803966296359525,2.4999355056853036,2.5186454740391588,2.536562596600676,2.5537213152437306,2.5702026509877083,2.5860333451995783,2.6012390835646442,2.6158445377621904,2.6298734054958821,2.6433484489438621,2.6562915316909366,2.668723654202775,2.6806649878996711,2.6921349078851633,2.7031520243826108,2.71373421293073,2.7238986433870931,2.733661807786635,2.7430395471003819,2.7520470769378105,2.7606990122345434,2.7690093909654365,2.776991696921534,2.7846588815878461,2.7920233851574476,2.7990971567159928,2.8058916736293971,2.8124179601661412]
[21,21.138945049357307,19.928286857583402,29.884140895142789,29.518487975705199,20.570426674396888,0,null,null,null,null,"Residential","Not applicable","Not applicable","R-All-HVAC-ER-All-All-E","Res Ele Resistance Heat",0,0.14550116657812989,0.31226800375816843,0.45951914320775178,0.59379562689315313,0.72218874091602614,0.82360310925995939,0.92079359574018749,1.0135281659284929,1.1006408107185659,1.1841208248384147,1.2650530484452924,1.3420670670623789,1.4169015225558785,1.4891060418236974,1.5592172145207071,1.627230866111008,1.6934955772975719,1.7573180147372105,1.8184863589960127,1.8769901305310841,1.932949262508888,1.9864780753382112,2.0376855508880389,2.0866755927101512,2.1335472730103926,2.1783950670716372,2.2213090757928051,2.2623752369718475,2.3016755259262216,2.3392881460119042,2.375287709571392,2.4097454098122104,2.4427291840901795,2.4743038690459334,2.5045313480188942,2.5334706911399216,2.5611782884822327,2.5877079766296927,2.6131111590022802,2.6374369202602743,2.6607321350914837,2.683041571669559,2.7044079900560476,2.7248722358043347,2.7444733290098773,2.763248549038174,2.7812825707731621,2.7986046548524897,2.8152429067776921,2.8312243225160474,2.8465748323021929,2.8613193427105541,2.875481777066871,2.889085114264371,2.9021514260475803,2.9147019128242682,2.9267569380636189,2.938336061336456,2.9494580700511204,2.9601410099364958,2.9704022143216418,2.98025833225954,2.9897253555405872,2.9988186446396625,3.0075529536388705,3.0159424541663968,3.0240007583903199,3.0317409411046823,3.0391755609436633,3.046316680758264]
[22,21.827428429478996,20.580653813532994,30.833610538344249,30.457253466902628,21.241662546857768,0,null,null,null,null,"Residential","Not applicable","Not applicable","R-All-Lgt-Lighting-All-All-R","Res Lighting",0,0.14215951352751185,0.29377271264509758,0.42591969047619205,0.54704172092090164,0.66476172386429411,0.74966956354294578,0.83111819370677353,0.90842951483062739,0.9803561581726894,1.0493486000186569,1.1161733257159043,1.1799980296691888,1.2421567337480492,1.3021884261438248,1.3602286325519903,1.4167126639336503,1.4714823596482662,1.5246529795416299,1.575450715560571,1.6240027962345587,1.6704121146297273,1.7147766511717197,1.7571897186860239,1.7977401946831617,1.8365127415785896,1.8735880154986466,1.9090428642875816,1.9429505152964359,1.9753807535022996,2.0064000904759931,2.0360719246875436,2.0644566936117328,2.091612018070474,2.1175928392246872,2.1424515486056128,2.1662381115540978,2.1890001844161335,2.2107832258238758,2.2316306023733636,2.2515836889931622,2.2706819642821254,2.2889631010793514,2.3064630525150998,2.3232161337779824,2.3392550998209827,2.3546112192168693,2.3693611177817391,2.3835287275837471,2.3971370359134054,2.4102081225810252,2.4227631957417395,2.4348226263062522,2.4464059809931342,2.4575320540762982,2.4682188978791642,2.478483852064993,2.4883435717709079,2.497814054631263,2.5069106667341874,2.515648167553441,2.5240407338960145,2.5321019829043454,2.5398449941504611,2.5472823308579007,2.5544260602858522,2.5612877733085693,2.567878603221851,2.57420924380708,2.5802899666821433,2.5861306379673836]
[23,22.495267007628449,21.213767140646546,31.752392157783206,31.365774993862491,21.892875046522587,0,null,null,null,null,"Residential","Not applicable","Not applicable","Residential-res-Other","Res Other",0,0.13926822526304533,0.28363298201883086,0.4087140144481603,0.52345320259838601,0.63574057714860976,0.71377126235414179,0.78857581827189727,0.8594127490224821,0.92512212087879409,0.98821556132518118,1.0492496256547903,1.1075867896801312,1.1645240469262559,1.2195800302804618,1.2727083482241373,1.3244216272332086,1.3746000024597493,1.4233308012275272,1.4698440556488686,1.5142874304002418,1.5567564982241484,1.5973422304689544,1.6361312285262917,1.6732059431287731,1.7086448821688733,1.7425228076627421,1.7749109224477546,1.8058770471696526,1.8354857880840654,1.8637986961679183,1.8908744180086277,1.9167688389129522,1.9415352186528212,1.9652243202423254,1.9878845321182164,2.0095619840756882,2.0303006572917885,2.0501424887504966,2.0691274703662335,2.0872937430862586,2.1046776862370438,2.121314002365196,2.1372357978098138,2.1524746592302351,2.1670607263009511,2.1810227607739345,2.1944336093696344,2.2073150315151535,2.2196879276303387,2.2315723730392185,2.2429876505427053,2.2539522817054052,2.2644840569073068,2.2746000642091047,2.2843167170779912,2.2936497810189063,2.3026143991544505,2.3112251167949687,2.3194959050386714,2.3274401834400762,2.3350708417835637,2.3424002609973642,2.3494403332419136,2.3562024812051732,2.3626976766362162,2.3689364581471599,2.3749289483123159,2.3806848700923133,2.3862135626098411,2.3915239963025958]
[24,23.13955383063778,21.824691086765494,32.637774004455132,32.241299526860182,22.521188652106009,0,null,null,null,null,"Residential","Not applicable","Not applicable","R-All-Bld-Bldg-All-All-R","Res Whole Home",0,0.14415787851194756,0.29782757110381336,0.43131920117454126,0.55346519110421255,0.67287184907958464,0.75871766071803515,0.84101205739776985,0.91915278375415665,0.99195534631993976,1.0617817079915901,1.1293731597835899,1.1939161250882959,1.2567708866672906,1.3174920435269339,1.3761867404201464,1.4332264600404265,1.4886700491571065,1.5423720505985183,1.5936871268808868,1.642735747695921,1.6896216436244798,1.7344435988164781,1.777295697398398,1.8182675570701092,1.8574445505831338,1.8949080157538647,1.9307354546288509,1.9650007223849373,1.9977742065146817,2.0291229968169526,2.0591110466838281,2.0877993261477763,2.115245967127489,2.1415064012865885,2.1666334908966598,2.190677653074538,2.2136869777435386,2.2357073396491507,2.2567825047416821,2.276954231221286,2.2962623655247372,2.3147449335181238,2.3324382271453112,2.3493768867684994,2.3655939794244207,2.3811210732076731,2.3960351965226789,2.4103605478962313,2.4241203705583696,2.4373369901550834,2.4500318509722128,2.4622255507293254,2.4739378740000122,2.4851878243128418,2.4959936549850439,2.50637289873896,2.5163423961493105,2.5259183229674367,2.5351162163668466,2.5439510001526595,2.5524370089758404,2.5605880115915163,2.5684172331991202,2.5759373769005931,2.5831606443114787,2.5900987553583383,2.5967629672946169,2.6031640929658093,2.6093125183535655,2.6152182194271951]
[25,23.764936957033058,22.418001388949072,33.494945072990781,33.089027923221948,23.131169295108648,0,null,null,null,null,"Residential","Not applicable","Not applicable","Residential-Spa Heater","Res Spa Cover",0,0.15997430170550742,0.35048019516689144,0.51984881340354394,0.67821499010717012,0.83297558333116772,0.95042145031682934,1.0634928733027709,1.171106202047818,1.2719406446625166,1.3685378637176171,1.4620234201953821,1.5516616668572745,1.6386660571870042,1.7226239329255426,1.8035500593287837,1.882254105479622,1.9580919711070504,2.0317083555820812,2.1021645464516823,2.1695994530241225,2.2341465802616312,2.2959333117264134,2.3550812023881131,2.4117062567861827,2.4659191933119224,2.5178256953334812,2.5675266498479208,2.6151183743074715,2.6606928322321783,2.7043378381881791,2.7461372526797074,2.7861711674735186,2.8245160818466521,2.8612450702222207,2.8964279416331231,2.9301313914301703,2.9624191456289872,2.9933520982691411,3.0229884421392095,3.0513837932027972,3.0785913090428947,3.104661801625253,3.1296438446657024,3.1535838758714054,3.1765262943119441,3.1985135531627908,3.2196328105356149,3.2399183329377128,3.2594030341211706,3.2781185284862246,3.2960951823763929,3.3133621633486032,3.3299474874982624,3.3458780649160507,3.3611797433501955,3.3758773501450712,3.3899947325241659,3.4035547962827817,3.4165795429532415,3.4290901055029099,3.4411067826229451,3.4526490716634162,3.4637357002682299,3.4743846567611834,3.484613219332457,3.4944379840728983,3.5038748919015812,3.5129392544303326,3.5216457788071951,3.5300085915791306]
[26,24.372017640026609,22.994242697728502,34.324911554185988,33.909948086026198,23.723394387231657,0,null,null,null,null,"Residential","Not applicable","Not applicable","Residential-Res-TV","Res Power Strip",0,0.14442309109335436,0.30008962806997952,0.43595614345123646,0.56082476888321708,0.68282194512618333,0.77034616979162862,0.8542389953416426,0.93381259232893032,1.0079490742024457,1.0790996078628838,1.1479094658575633,1.2136864113302221,1.2777956133337849,1.3397074734545,1.3994505435824252,1.4575048811520492,1.5137985052683576,1.5683628607005633,1.6204835781386504,1.670314386598954,1.7179594603366282,1.7635180379298732,1.8070846665872602,1.8487494338273827,1.8885981872097317,1.9267127427579476,1.9631710826810416,1.9980475429646176,2.0314129913725005,2.0633349963693215,2.0938779874464704,2.1231034073072834,2.1510698563422581,2.177833229801494,2.2034468480492229,2.2279615802642843,2.2514259619305217,2.2738863064423502,2.2953868111330649,2.3159696580167433,2.3356751095188697,2.3545415994558923,2.3726058195099133,2.3899028014314228,2.4064659951904717,2.4223273432848522,2.4375625253945254,2.4521962609719652,2.4662522936080618,2.4797534295566708,2.4927215747383138,2.5051777702830673,2.5171422266703054,2.5286343565206924,2.5396728060936322,2.5502754855412735,2.5604595979681695,2.5702416673437298,2.5796375653127628,2.5886625369476044,2.5973312254836154,2.6056576960781892,2.6136554586318099,2.6213374897081909,2.6287162535890678,2.6358037224977959,2.6426113960245736,2.6491503197848059,2.6554311033408831,2.661463937416455]
[27,24.956304085829547,23.548897994825815,35.123356348696234,34.699710669918929,24.293393580622361,0,null,null,null,null,"Residential","Not applicable","Not applicable","Res-Conditioning-Synthetic-ETO","Res Space Conditioning",0,0.24332272561572149,0.56424659826179113,0.85317738391322961,1.1245842645786168,1.3944364369131603,1.6116891936295366,1.8202686198824147,2.0194552000783577,2.2078404031278551,2.3888387804725464,2.5628385060478789,2.729938663650568,2.8910086989680424,3.0461908773540252,3.1951122229652218,3.3389024317458715,3.4776409975213123,3.6116666604470216,3.7399743004156996,3.8629563873564825,3.9808386375171572,4.0938369297317649,4.2021577495352167,4.3059986123792786,4.4055484669786233,4.5009880797627009,4.592490401359048,4.6802209159862525,4.7643379745898544,4.8449931125120003,4.9223313524453696,4.9964914933838456,5.067606386246255,5.135803196815357,5.2012036566018613,5.263924302212593,5.3240767037728434,5.3817676829254362,5.4370995209028825,5.490170157144334,5.5410733789055282,5.5898990022877211,5.6367330450905291,5.681657891873594,5.7247524515930346,5.7660923081606859,5.8058001715433107,5.8439404687122911,5.8805750832248078,5.9157634556314118,5.9495626799197652,5.9820275961510143,6.0132108794391224,6.0431631254175171,6.0719329323317384,6.0995669798912635,6.1261101050084701,6.1516053745476187,6.1760941552018771,6.1996161806117884,6.2222096158340641,6.2439111192653156,6.2647559021211903,6.2847777855674245,6.3040092555955045,6.3224815157319751,6.3402245376669208,6.3572671098837539,6.3736368843692333,6.3893604214794824]
[28,25.520158550272217,24.084268770114068,35.893084317806995,35.461115120253105,24.843483197657221,0,null,null,null,null,"Industrial","Not applicable","Not applicable","A-Irr-Irr-Irrigation-All-All-E","Ag-Irrigation",0,0.14376727065501621,0.29490178554147328,0.42614431631034938,0.54935638567941425,0.67371052005399013,0.75318556489006194,0.82954510941913406,0.9015350162900797,0.96825634467434074,1.0324644381571457,1.0941339931137191,1.1538436488660064,1.2121419344247999,1.2685470306887499,1.3225225013464499,1.3748860159661533,1.4253699200228975,1.4746780289738493,1.5215900908559432,1.5664424027513135,1.6093286874311452,1.6503382224162793,1.6895560604048154,1.7270632382807558,1.7629369753190445,1.7972508611680951,1.830075034158573,1.8614763504567384,1.8915185445519187,1.9202623815405861,1.9477658016439596,1.9740840573719491,1.999269843723521,2.0233734217921211,2.0464427361245545,2.0685235261626294,2.0896594320788635,2.1098920953005558,2.1292612540004705,2.1478048338172684,2.1655590340544948,2.1825584095934798,2.1988359487427491,2.2144231472345277,2.2293500785675682,2.24364546088482,2.2573764975933512,2.2705654676332427,2.283233770428259,2.2954019606069322,2.3070897813529436,2.3183161964389218,2.32909942099562,2.3394569510664081,2.3494055919950303,2.3589614856926793,2.3681401368286394,2.3769564379869919,2.3854246938301888,2.3935586443087185,2.4013714869545062,2.4088758982942311,2.4160840544172979,2.4230076507318374,2.4296579209407887,2.4360456552688561,2.4421812179699107,2.4480745641432415,2.4537352558859467,2.4591724778076696]
[29,26.06197207895914,24.598713000491703,36.632713916692069,36.19274838257553,25.372069394682118,0,null,null,null,null,"Industrial","Not applicable","Not applicable","DSI-0","Flat",0,0.12924425971291548,0.25989294280232783,0.37274594830487751,0.47629457815629217,0.5777433824765954,0.64651114355319172,0.7123991898759805,0.77476103907719762,0.83240842836044049,0.88777808843967421,0.94132895204140798,0.99248648449148968,1.04253729878352,1.0909913263513407,1.1377579216845581,1.1832986608960196,1.2275212694481079,1.2704280031142126,1.3113624703472659,1.3504576250094495,1.387799323640881,1.423469241710978,1.4575450862517536,1.4901007972272031,1.5212067382569932,1.550929877277742,1.5793339576922794,1.6064796605262721,1.6324247580823807,1.6572242595545807,1.6809305490393238,1.703593516355761,1.7252606810641831,1.7459773100501041,1.7657865290209167,1.7847294282427308,1.8028451628267919,1.8201710478576931,1.8367426486394021,1.8525938663198451,1.8677570191403852,1.8822629195429343,1.8961409473546356,1.9094191192579388,1.9221241547425025,1.9342815387245762,1.9459589798753527,1.9571754251263147,1.9679490734319165,1.9782974052978295,1.9882372111434861,1.9977846185449426,2.0069551184022631,2.0157635900738806,2.0242243255187149,2.0323510524852257,2.0401569567850153,2.0476547036871282,2.0548564584677571,2.0617739061486993,2.0684182704565872,2.0748003320336577,2.0809304459296047,2.0868185584028995,2.0924742230588347,2.0979066163504836,2.1031245524677145,2.1081364976384287,2.1129505838652216,2.1175746221197533]
[30,26.582604484821822,25.093048739321663,37.343408016352107,36.895760964241589,25.879991617391344,0,null,null,null,null,"Industrial","Not applicable","Not applicable","IndShift1","1-Shift Industrial",0,0.13998636042274551,0.28354016765025775,0.40706314058895671,0.519805104946231,0.63022693604178681,0.70561394479867745,0.77790459738778561,0.84623759570497925,0.9094437640009988,0.97013576021983938,1.0288873188166163,1.0851412991962834,1.1400100383078906,1.1929812527736696,1.2440952860457191,1.2939307611912514,1.3422283497786018,1.3893395278111926,1.4342694639257398,1.4771959970948796,1.5182118507562083,1.5574052724388188,1.5948602594840353,1.6306567728973813,1.6648709399792359,1.6975752463452365,1.7288387179131797,1.7587270934008379,1.7873029878486355,1.8146260476523972,1.8407530975643025,1.8657382800946403,1.8896331877228947,1.9124869883039843,1.9343465440340797,1.9552565243202351,1.97525951287904,1.9943961093715268,2.0127050258646566,2.030223178393705,2.0469857738848223,2.0630263926828007,2.078377066915678,2.093068354915145,2.1071294118997703,2.1205880571167928,2.1335153889936751,2.1459323824399172,2.1578591843285371,2.1693151461848621,2.1803188555848476,2.1908881663138704,2.2010402273349277,2.2107915106132463,2.2201578378424442,2.2291544061156152,2.2377958125829776,2.2460960781361066,2.2540686701571695,2.2617265243700815,2.2690820658290312,2.2761472290784304,2.2829334775170045,2.2894518219974325,2.2957128386917254,2.3017266862513193,2.3075031222897335,2.3130515192145387,2.3183808794343115,2.3234998499652617]
[31,27.082868684400403,25.568056377213189,38.026219902230608,37.571196276093339,26.368045860659215,0,null,null,null,null,"Industrial","Not applicable","Not applicable","IndShift2","2-Shift Industrial",0,0.1387072134705834,0.28063932622021437,0.40279504222604012,0.51433605991822751,0.62358192987582906,0.69806409822445914,0.76947982200188614,0.83699312982944618,0.89943033339947553,0.95938583927675658,1.0174192816989216,1.0729737111599105,1.1271797028474686,1.1795247369386974,1.2300372905988552,1.2792819149943491,1.3270166974642621,1.3735556443687407,1.417940790724181,1.4603447852428708,1.5008594275215907,1.5395720804884945,1.5765658944061007,1.6119200190836003,1.6457098049422203,1.6780069935411839,1.7088798981376687,1.7383935748219985,1.7666099847389884,1.7935881478777798,1.8193842888855611,1.8440519753351745,1.8676422488526569,1.8902037494881929,1.9117828336926608,1.9324236862418815,1.9521684264317418,1.9710572088495146,1.9891283190098421,2.0064182641279755,2.0229618592878684,2.0387923092485756,2.0539412861190889,2.0684390031191189,2.0823142846314933,2.0955946327405939,2.1083507062293076,2.1206032021362469,2.1323720004331821,2.1436761962807807,2.1545341310109682,2.1649634218861848,2.1749809906838187,2.1846030911522023,2.1938453353827114,2.2027227191407643,2.2112496461968143,2.2194399516968137,2.2273069246100783,2.2348633292909588,2.2421214261893168,2.2490929917434017,2.2557893374874083,2.262221328404713,2.2683994005565769,2.274333578014903,2.2800334891265406,2.28550838213551,2.2907671401885015,2.2958182957479978]
[32,27.563570970536233,26.024496404650158,38.682284129308393,38.220175550280992,26.837017086238401,0,null,null,null,null,"Industrial","Not applicable","Not applicable","IndShift3","3-Shift Industrial",0,0.13455121552924626,0.27099139947947626,0.38859828392845219,0.49620318544478897,0.60159874149967518,0.67323571447111219,0.74189764226902666,0.80684363196213926,0.86688611173694774,0.92455026005101604,0.98034573058661956,1.0337066192945701,1.0858399921885633,1.1362381806676949,1.1848777195988294,1.232274349146387,1.2782543261764998,1.3229846753810228,1.3656509296686148,1.406406698107757,1.4453408188719989,1.4825378208547282,1.5180781420044702,1.5520383361321441,1.5844912688212902,1.6155063030367085,1.645149474993441,1.6734836608164338,1.7005687344914497,1.7264617175797456,1.7512169211425723,1.7748860802966331,1.797518481798128,1.8191610850308544,1.8398586367529408,1.8596537799370954,1.8785871570206707,1.8966975078643304,1.9140217627015839,1.9305951303458646,1.9464511819071408,1.9616219302561733,1.976137905461453,1.9900282264115192,2.0033206688237044,2.0160417298293676,2.0282605954577058,2.0399970911145484,2.0512702595487449,2.0620983917494913,2.0724990566238994,2.0824891295029775,2.0920848195222628,2.101301695921538,2.1101547133062994,2.1186582359119681,2.1268260609102088,2.1346714407951772,2.1422071048860127,2.1494452799804655,2.1563977101931764,2.1630756760107834,2.169490012594788,2.1756511273618657,2.1815690168701529,2.1872532830389044,2.1927131487278406,2.1979574727014612,2.2029947640026042,2.2078331957585773]
[33,28.025475208971635,26.46309491244336,39.312638275518196,38.84372520864266,27.287650836483813,0,null,null,null,null,"Industrial","Not applicable","Not applicable","Commercial-Ref.warehouse-Refrig","Cold Storage",0,0.13482885150999058,0.27097788926994526,0.38819553255896105,0.4961031006620325,0.60310565690515816,0.67426465182486706,0.74248677101122862,0.80702419879544529,0.86657616886685274,0.92381607190213499,0.97910032563506233,1.0320228295486751,1.0837040386679295,1.1337345648024599,1.1818904710647582,1.2288199264806361,1.2743026263021706,1.3185459238493993,1.3607161508337304,1.4009942289044481,1.439468358703873,1.4762224510732174,1.5113363449827824,1.5448860139272407,1.5769437614187121,1.6075784061746115,1.6368554575635901,1.6648372818411752,1.6915832596768143,1.7171499354458626,1.7415911587335029,1.7649582184725503,1.787299970113511,1.8086629562030216,1.8290915207258238,1.8486279175456686,1.8673124132618961,1.8851833847808686,1.9022774118848527,1.9186293650653181,1.9342724888728751,1.9492384810221681,1.9635575674769215,1.9772585737279615,1.9903689924653574,2.0029150478348146,2.0149658166077056,2.0265408514486345,2.037658933132362,2.0483381010160699,2.0585956823086522,2.0684483201845354,2.0779120007876317,2.0870020791692441,2.0957333042020094,2.1041198425103036,2.1121753014559328,2.1199127512164067,2.127344745991619,2.1344833443733426,2.1413401289105853,2.1479262249025579,2.1542523184497413,2.1603286737923439,2.16616514996428,2.1717712167896916,2.1771559702479681,2.1823281472321927,2.1872961397249644,2.1920680084145925]
[34,28.469319575525752,26.884551328163191,39.918299909171836,39.442851454950173,27.720666826023901,0,null,null,null,null,"Industrial","Not applicable","Not applicable","SIC 20-IND_SIC 20","Food Products",0,0.13292347842432511,0.26787557968796871,0.38446927975106698,0.49177792199265796,0.59739247035307685,0.66891831488365872,0.73748978809923593,0.80237925194151283,0.86232331666460804,0.91993757300336187,0.97562851219398794,1.0288488580431776,1.0808410706488347,1.1311747302211872,1.1796655352711383,1.2269270910349266,1.2727229391061254,1.317254374411952,1.3597226811986158,1.4002865753981462,1.4390347636665921,1.4760516418935206,1.5114175140060218,1.5452087992010748,1.577498228240539,1.6083550294072497,1.6378451046869655,1.6660311967091412,1.6929730469495432,1.7187275456694988,1.7433488740399639,1.7668886388735141,1.7893960003637253,1.8109177932091158,1.8314986414778214,1.8511810675493492,1.8700055954510877,1.8880108488896243,1.9052336442603199,1.9217090789029077,1.9374706148561185,1.9525501583503897,1.966978135264563,1.9807835627600716,1.9939941172944162,2.0066361992046797,2.0187792036329415,2.0304428328983932,2.0416460115223987,2.0524069169339878,2.0627430089631771,2.0726710581699672,2.0822071730549832,2.0913668261959071,2.100164879352111,2.1086156075782219,2.1167327223857435,2.1245293939903171,2.1320182726807158,2.1392115093442432,2.1461207751818452,2.1527572806449151,2.1591317936245229,2.1652546569225808,2.1711358050332885,2.1767847802620923,2.1822107482083068,2.1874225126365219,2.1924285297609232,2.1972369219657084]
[35,28.895821474284968,27.289541119344097,40.50028635343736,40.018559453444603,28.136763080010311,0,null,null,null,null,"Industrial","Not applicable","Not applicable","SIC 24-IND_SIC 24","Wood Products",0,0.13207250056981187,0.26758612715065971,0.3848623039366284,0.49232420447627123,0.59740755965834358,0.66979652683324997,0.73915307825897913,0.80483117443592578,0.86565357287857381,0.92405673602481853,0.98056140372775469,1.0345254413582063,1.087284252795091,1.1382995105617282,1.1875467659033059,1.2354992231359412,1.2820501718014854,1.3272195612065236,1.3703265857956157,1.4115064861527422,1.4508487048323384,1.4884383546903579,1.5243564378060879,1.558680052866539,1.5914825916439395,1.6228339251613644,1.652800580108081,1.6814459060346627,1.70883023382821,1.7350110259400084,1.7600430188115488,1.7839783579199484,1.8068667258403437,1.8287554637007004,1.8496896863836287,1.8697123918101171,1.8888645646215465,1.9071852745588544,1.9247117698212139,1.9414795656710284,1.9575225285373594,1.9728729558560556,1.987561651871776,2.0016179996147794,2.0150700292537049,2.0279444830145992,2.0403106858393945,2.0521887021920939,2.0635978044423093,2.074556504135149,2.0850825820266481,2.0951931169334768,2.1049045134437336,2.1142325285337895,2.1231922971343615,2.1317983566873075,2.1400646707329765,2.1480046515663922,2.1556311819990266,2.1629566362614745,2.1699929000809424,2.176751389966129,2.183243071730788,2.1894784782860266,2.1954677267302096,2.2012205347641958,2.2067462364585442,2.2120537973982697,2.2171518292297225,2.2220486036331928]
[36,29.305657216212012,27.678707777920625,41.059512095860036,40.57175398110784,28.536599894467003,0,null,null,null,null,"Industrial","Not applicable","Not applicable","SIC 26-IND_SIC 26","Pulp & Paper",0,0.13136401963969332,0.26499656437988695,0.38047588113691799,0.48654400023927236,0.59097461435533083,0.66161487020213794,0.72927821151881278,0.79331909054936434,0.85256697889095345,0.90947793447678538,0.96447332859360846,1.0170283294682825,1.0684484529151348,1.1182026183046634,1.1661665435802364,1.2128431599372509,1.2581660439268345,1.3021156616657845,1.3440333607497474,1.384073295252739,1.4223228230643581,1.458865062521322,1.4937791073108346,1.527140230022404,1.5590200749696714,1.5894868408687703,1.6186054539267138,1.6464377318621806,1.6730425393517454,1.6984759353669507,1.7227913128415631,1.7460395310837871,1.7682690413250688,1.7895260057752711,1.809854410533442,1.8292961726839714,1.8478912418896463,1.8656776967758473,1.882691836383859,1.8989682669559131,1.914539984300107,1.9294384519696777,1.9436936754782295,1.9573342727603538,1.9703875410756131,1.9828795205430305,1.9948783481939931,2.0064034924173746,2.017473653039199,2.0281067916635629,2.0383201608157706,2.0481303319349786,2.0575532222617561,2.0666041206641932,2.075297712444462,2.0836481031660723,2.0916688415404936,2.0993729414102673,2.106772902864281,2.1138807325194664,2.1207079630018275,2.1272656716584026,2.133564498530534,2.139614663617587,2.1454259834591514,2.1510078870626139,2.1563694312019499,2.1615193151125593,2.1664658946059889,2.1712171956274369]
[37,29.699466241766338,28.052665181009186,41.596805492928731,41.103255639550454,28.920803402668987,0,null,null,null,null,"Industrial","Not applicable","Not applicable","SIC 28-IND_SIC 28","Chemicals",0,0.1279935886151595,0.25663097745553426,0.36756933194120689,0.46912345883650891,0.56844732635054218,0.63571936022955089,0.70015037320713536,0.761108554602133,0.81744046020663697,0.87153701412867424,0.92387500027343972,0.97382801570474664,1.0227220524685536,1.0700700187434626,1.115792650151413,1.1603133247492334,1.2035852389741135,1.2455525549427,1.2855922185966988,1.3238281252523683,1.3603447094277623,1.3952222820034237,1.4285372405022947,1.4603622682041613,1.4907665227086007,1.5198158145256795,1.5475727762409217,1.5740970227702424,1.5994453031914782,1.6236716446117745,1.6468274885042842,1.6689618199233096,1.6901212899841023,1.7103503319719227,1.729691271424598,1.7481844305136127,1.7658682270306585,1.7827792682695094,1.7989524400769805,1.8144209913315632,1.8292166140940036,1.8433695196605981,1.8569085107372452,1.869861049940277,1.8822533248187694,1.8941103095823331,1.9054992105174631,1.9164385063921434,1.926945946479244,1.937038579355145,1.9467327805614665,1.9560442791747803,1.9649881833274208,1.9735790047207937,1.9818306821709646,1.9897566042247257,1.9973696308828381,2.0046821144656954,2.0117059196552618,2.0184524427458066,2.0249326301346695,2.0311569960830531,2.0371356397756708,2.0428782617069139,2.0483941794201437,2.0536923426256282,2.058781347721665,2.0636694517424479,2.0683645857553028,2.0728743677290367]
[38,30.077882766607562,28.412011548866115,42.113058738999868,41.613946158606652,29.289991048614731,0,null,null,null,null,"Industrial","Not applicable","Not applicable","SIC 29-IND_SIC 29","Oil & Petroleum",0,0.12837121184197003,0.25712427228867435,0.36818905958296189,0.47009666076717532,0.57002751404114471,0.63714774412668485,0.70147255090904048,0.76231545876893969,0.818513069874785,0.87248052899840045,0.92469315465510005,0.97458308992088105,1.0234120899546395,1.070700281146334,1.1163441418315871,1.1608103895163875,1.2039850986757947,1.245905035028875,1.2858901020786691,1.3240734508037315,1.3605394481712729,1.3953683391517904,1.4286364570064265,1.4604164224037708,1.4907773319805859,1.5197849369261738,1.5475018121373321,1.5739875164599979,1.5992987445045765,1.6234894704945508,1.6466110845821382,1.6687125220404087,1.6898403857183433,1.710039062123671,1.7293508314779422,1.7478159720690729,1.7654728592084705,1.7823580590827695,1.7985064177740917,1.8139511457075574,1.8287238977704396,1.8428548493338517,1.856372768395103,1.8693050840468457,1.8816779514677855,1.8935163136190398,1.9048873271155862,1.9158094417026059,1.9263003787759128,1.936377160135347,1.9460561356030581,1.9553530095514888,1.9642828663840994,1.9728601950101781,1.9810989123534481,1.9890123859326145,1.9966134555504864,2.0039144541268694,2.0109272277090255,2.0176631546921739,2.024133164281213,2.030347754223619,2.0363170078422974,2.0420506103960179,2.0475578647939821,2.0528477066900193,2.057928718980901,2.0628091457323006,2.0674969055549877,2.0719996044529676]
[39,30.441507648944388,28.757318052166866,42.609087806055228,42.104632748168889,29.644749282521666,0,null,null,null,null,"Industrial","Not applicable","Not applicable","SIC 33-IND_SIC 33","Primary Metals",0,0.12693526394773216,0.25518898070507301,0.36608536622179477,0.46766375461779636,0.56661280586887119,0.63421688881053706,0.69897502859751903,0.76027612325937255,0.81695388730036667,0.87139530870075688,0.9240572171668513,0.97432537981763667,1.0235318117745886,1.0711878022683536,1.1172271087512808,1.1620493737005768,1.2056029406341922,1.2478397781446471,1.2881500999768658,1.3266467892946947,1.3634146210109785,1.3985342359810673,1.4320823515101639,1.4641319606974281,1.4947525212300337,1.5240101342057304,1.5519677135297998,1.5786851464015303,1.604219445376327,1.6286248924622651,1.6519531756841164,1.6742535185236287,1.6955728026219326,1.7159556841084014,1.7354447038999437,1.7540803922955412,1.7719013681727749,1.7889444330760296,1.8052446604700088,1.8208354804170235,1.8357487599222377,1.8500148791775581,1.863662803922153,1.8767201541255789,1.8892132691881831,1.9011672698427688,1.9126493567264358,1.9236781598036301,1.9342715735748279,1.9444467861107977,1.9542203069406601,1.9636079938390005,1.9726250785554935,1.9812861915287838,1.9896053856247307,1.997596158937522,2.0052714766906594,2.0126437922733484,2.0197250674464242,2.026526791750598,2.0330600011485171,2.0393352959308815,2.0453628579156709,2.0511524669683934,2.0567135168701536,2.0620550305592906,2.0671856747713129,2.0721137741008899,2.0768473245087056,2.0813940062951004]
[40,30.790921541691333,29.089134891641162,43.085692923038195,42.576106711180742,29.985644241329556,0,null,null,null,null,"Industrial","Not applicable","Not applicable","SIC 37-IND_SIC 37","Transportation & Equipment",0,0.1316497143929137,0.26541261458980286,0.38085703802392362,0.48660493108503572,0.59018600399545296,0.66058605565576223,0.72803543796864967,0.79184136199941346,0.8508616874207835,0.90753871054178481,0.96236329545624633,1.0147586818747201,1.0659942231765012,1.1155599433408423,1.1633947046661095,1.2099707507489506,1.2551887738847429,1.2991009565054985,1.3409919632569762,1.3810056133220907,1.4192292838500284,1.455746109687136,1.4906351985032333,1.5239718345508912,1.5558276716802393,1.5862709161967716,1.615366500116526,1.643176245341843,1.669759019251517,1.6951708821714713,1.7194652271659761,1.7426929125648238,1.7649023876186876,1.7861398116530063,1.8064491670701415,1.8258723665300898,1.8444493546217224,1.8622182043192224,1.8792152085020934,1.895474966801741,1.9110304680231103,1.925913168376203,1.9401530657393671,1.9537787701640974,1.9668175708195779,1.979295499564371,1.9912808311797707,2.0027930121570066,2.0138507212889207,2.0244718999767639,2.0346737813405555,2.0444729181802366,2.0538852098329894,2.0629259279702987,2.0716097413766086,2.0799507397497812,2.0879624565619728,2.0956578910180208,2.1030495291469689,2.1101493640609523,2.1169689154143128,2.1235192480945169,2.1298109901752045,2.1358543501604967,2.1416591335485404,2.1472347587411669,2.1525902723254782,2.1577343637521533,2.1626753794342926,2.1674213362896757]
[41,31.126688757599997,29.407993422729518,43.543674106791073,43.029158514162354,30.313225000968689,0,null,null,null,null,"Industrial","Not applicable","Not applicable","Other SICs-IND_Other SICs","Other Industrial",0,0.13164971423332464,0.26541261408115269,0.38085703715795921,0.48660492986455117,0.59018600245443242,0.66058605377418544,0.72803543575853025,0.79184135947688072,0.85086168459934297,0.90753870743409271,0.9623632920700288,1.0147586782265734,1.0659942192723417,1.1155599391917919,1.1633947002828173,1.209970746134795,1.2551887690519512,1.2991009514627603,1.3409919580117888,1.3810056078824549,1.4192292782236284,1.4557461038813522,1.4906351925251544,1.523971828407326,1.555827665377727,1.5862709097415932,1.6153664935147147,1.6431762385991928,1.6697590123735933,1.6951708751636194,1.71946522003333,1.7426929053123148,1.7649023802510519,1.7861398041747931,1.8064491594857197,1.8258723588436565,1.8444493468373082,1.8622181964406987,1.8792152005331793,1.8954749587460071,1.9110304598839878,1.9259131601569861,1.9401530574432211,1.9537787617940614,1.9668175623785715,1.9792954910551983,1.9912808226051231,2.0027930035194679,2.0138507125909744,2.0244718912207946,2.034673772528854,2.0444729093150027,2.0538852009163366,2.062925919004257,2.071609732363128,2.0799507306907343,2.0879624474591578,2.0956578818731662,2.1030495199617341,2.1101493548369317,2.1169689061530366,2.1235192387974564,2.1298109808437728,2.1358543407960502,2.1416591241523828,2.1472347493145496,2.1525902628696043,2.1577343542681775,2.1626753699233241,2.16742132675278]
[42,31.449341301859697,29.714399857733095,43.983750550081183,43.464499723297052,30.628010973416057,0,null,null,null,null,"Industrial","Not applicable","Not applicable","S-All-Lgt-Streetlight-All-All-U","Street Lighting",0,0.12537611516896607,0.26002789228706047,0.37880275394011748,0.48895598273216684,0.59632135876131498,0.67456119570223683,0.7494966049586379,0.82089828950832744,0.88744937990758577,0.95132596507545308,1.0130373598445319,1.0717532223819426,1.1291509725698494,1.1847988441739277,1.2385763381383719,1.2907478550156204,1.3414847605971947,1.3902159600194575,1.4368246355599918,1.4813653969817622,1.523933365023469,1.5646191007005248,1.6035088336050654,1.6406846782826572,1.6762248393323134,1.7102038058402516,1.7426925357237266,1.7737586305291144,1.8034665011981132,1.8318775252873469,1.859050196099707,1.885040264160355,1.9099008714463415,1.9336826787561925,1.956433986584498,1.9782008498464234,1.9990271867780953,2.0189548823209122,2.0380238862809521,2.0562723065387027,2.0737364975693175,2.0904511445194043,2.1064493430729589,2.1217626753264232,2.1364212818809087,2.1504539303483634,2.1639326052762806,2.176879176141632,2.189314649069642,2.2012592009167369,2.2127322120079809,2.223752297582128,2.234337337995294,2.2445045077322701,2.2542703032725413,2.2636505698562233,2.2726605271933487,2.2813147941582184,2.2896274125088762,2.2976118696702033,2.3052811206175927,2.3126476088967105,2.3197232868134501,2.3265196348268398,2.3330476801763633,2.3393180147739274,2.3453408123894919,2.35112584515826,2.3566824994362046,2.3620197910296583]
[43,31.759382190637481,30.008837121371901,44.406573748115889,43.882775743817739,30.930494709571796,0,null,null,null,null,"Commercial","College","Compressed Air","Commercial-college-AirComp","College Compressed Air",0,0.14301047080957913,0.29353862273022507,0.42399258795149702,0.54313820296019799,0.65876149213719004,0.74015203090521053,0.81820962424726484,0.89203397230818315,0.96054733959065242,1.0263027280023305,1.0899844646355998,1.1509233267206838,1.2103308781309052,1.2676442663966727,1.3230018874220775,1.3769235218922997,1.4291586126164972,1.4800694665913847,1.5286545160116873,1.5750887655424508,1.6194709359483275,1.6618950248913393,1.7024505430275962,1.7412227377887894,1.7782928055157559,1.8137380925740885,1.8476322860465932,1.8800455945642272,1.9110449198058874,1.9406940191679427,1.969053660076594,1.9961817663899379,2.0221335573118928,2.0469616792168117,2.070716330761627,2.0934453816416263,2.1151944853263718,2.1360071860938263,2.1559250206633185,2.1749876147115459,2.1932327745402951,2.2106965741499209,2.2274134379588109,2.2434162193960092,2.2587362755818723,2.2734035383000024,2.2874917745099057,2.3010238427165173,2.3140216990286984,2.3265064327835545,2.3384983007643982,2.3500167600678692,2.3610804996735468,2.3717074707672725,2.3819149158673834,2.3917193968011179,2.4011368215765807,2.410182470193873,2.4188710194372618,2.4272165666886201,2.4352326528007691,2.4429322840678411,2.450327953328308,2.4574316602349136,2.464254930724401,2.4708088357186258,2.4771040090873941,2.4831506649021753,2.4889586140086788,2.4945372799451917]
[44,32.057311082679576,30.291776143116824,44.812849052819537,44.284683592197382,31.221162527265431,0,null,null,null,null,"Commercial","College","Cooking","Commercial-college-Cook","College Cooking",0,0.14182523215316906,0.28907271086022324,0.41631476906879572,0.53254660358914097,0.64586972895556949,0.72443779215135895,0.79977001005675363,0.87100244838140406,0.93700514596268469,1.0003743801010374,1.0617143050199009,1.1204136460015226,1.177671675286398,1.2329435542710128,1.2862980718656971,1.3382795689295215,1.3886599350897169,1.4377532117798366,1.4845896027162107,1.5293443007301879,1.5721132961730435,1.6129879641263112,1.6520552962427468,1.6893981204398452,1.7250953091065973,1.7592219764471257,1.7918496655498966,1.8230465257382924,1.852877480727291,1.8814043880817319,1.9086861904440704,1.9347790589735052,1.9597365294138369,1.9836096311842939,2.0064470098657368,2.0282950434340909,2.0491979525734436,2.0691979053829437,2.0883351167743727,2.1066479428409597,2.1241729704626495,2.140945102398522,2.1569976381033844,2.1723623504926217,2.1870695588672291,2.2011481981994057,2.2146710483887979,2.2276600505878115,2.2401362797675377,2.2521199789124098,2.2636305918649331,2.2746867948737921,2.2853065268965178,2.2955070187058784,2.3053048208472293,2.3147158304921729,2.3237553172321057,2.3324379478534993,2.3407778101351182,2.3487884357057824,2.3564828219997644,2.3638734533454393,2.3709723212214113,2.3777909437129798,2.3843403842005109,2.3906312693100404,2.3966738061552326,2.4024777988986692,2.4080526646593428,2.4134074487921571]
[45,32.343602062527211,30.563666858386448,45.203225077036919,44.670864784173773,31.500476896441462,0,null,null,null,null,"Commercial","College","Cooling","Commercial-college-Cool","College Cooling",0,0.16756029217919632,0.35095867572545836,0.51011079630669576,0.65767803993323559,0.80522936596089723,0.90781293762303961,1.0062688256873094,1.0995154080124769,1.1861420446308899,1.2694384017073022,1.3497656081289808,1.4269872242764656,1.5019087620461942,1.5741971873539164,1.6434945209733829,1.7109316187211525,1.7759167254623265,1.8393371263074154,1.8998226238348364,1.9576835150775103,2.0130375149201822,2.0659968458251674,2.1166685055615249,2.1651545212903538,2.2115521907309539,2.2559543110926774,2.2984493964196906,2.339121883960336,2.3780523301393113,2.4153175966792544,2.4509910273885014,2.4851426161036425,2.5178391662489181,2.5491444424494314,2.5791193146114741,2.6078218948609111,2.6353076677094731,2.6616296137988833,2.6868383275539216,2.7109821290577645,2.7341071704461615,2.7562575371011477,2.7774753439100239,2.7978008268411765,2.8172724300749619,2.8359268889152225,2.8538449168090469,2.8710555861912628,2.8875868217903551,2.9034654459370199,2.9187172220840423,2.933366896608125,2.9474382389614839,2.9609540802383636,2.9739363502190375,2.986406112951411,2.9983836009279488,3.0098882479133851,3.0209387204764782,3.0315529482769712,3.0417481531568993,3.0515408770834456,3.0609470089886872,3.069981810549768,3.078659940951344,3.0869954806704638,3.0950019543224863,3.1026923526050929,3.1100791533760153,3.1171743418986564]
[46,32.618617413005232,30.824849101681,45.578226060915277,45.041836150145336,31.768790411500088,0,null,null,null,null,"Commercial","College","Exterior Lights","Commercial-college-ExtLight","College Exterior Lights",0,0.12838238623199538,0.26723361886482033,0.38986057706672583,0.50382348689150991,0.61504278129238688,0.6960232442156965,0.77358380263272075,0.8474313179010714,0.91630604614307831,0.98244530288681076,1.046295291312654,1.1071248215268057,1.1665596646267629,1.2241750970284642,1.2797917720830243,1.3337194489549549,1.3861012965444941,1.4364573730601893,1.4846133914358515,1.5306440281962537,1.5746464665568067,1.6167132605595709,1.6569325654103537,1.6953883558539731,1.7321606332333068,1.7673256218417732,1.8009559551449443,1.833120852415008,1.8638862862916199,1.8933151417542415,1.9214673669642237,1.9484001164095934,1.9741678867616257,1.9988226458297731,2.0224139549802751,2.0449890853637362,2.0665931282780416,2.0872690999751535,2.1070580412034707,2.1259991117615629,2.1441296803240815,2.1614854097864904,2.1781003383619026,2.1940069566506875,2.2092362808915929,2.2238179225918944,2.2378239178856236,2.251276991839835,2.2641989723932987,2.2766108257728628,2.2885326905116625,2.2999839101243791,2.3109830644925631,2.3215480000109419,2.3316958585436272,2.3414431052372064,2.350805555235842,2.3597983993417255,2.368436228662524,2.3767330582858062,2.3847023500188596,2.3923570342308018,2.3997095308324181,2.4067717694277659,2.4135552086702474,2.4200708548545538,2.4263292797746443,2.4323406378767389,2.4381146827351525,2.443660782877707]
[47,32.882801227105169,31.075744628380853,45.938457553593821,45.398196732250568,32.02653634335276,0,null,null,null,null,"Commercial","College","Heating","Commercial-college-Heat","College Heating",0,0.14111781021251768,0.29211227480958568,0.42347546146225107,0.54336027118071994,0.65953423830305524,0.7434925283413002,0.82393889505358098,0.90024062522483084,0.97134652653929932,1.0395767284053656,1.1056157327261782,1.1686952092055318,1.2301834212049274,1.2895485614273883,1.3469768873999359,1.4027780168325854,1.4570361685464737,1.5096166326568126,1.5598615279711789,1.6078886087155579,1.6537993062912426,1.6976902190756253,1.7396533529925147,1.7797763495842229,1.8181427022602656,1.8548319613598676,1.8899199286300088,1.9234788416872806,1.9555775490002847,1.9862816758995643,2.0156537820939993,2.0437535111461447,2.070637732334037,2.0963606753034454,2.1209740578923473,2.1445272074884483,2.167067176260812,2.1886388505879908,2.2092850549874723,2.2290466508346252,2.2479626301436579,2.2660702046683072,2.2834048905659992,2.3000005888560358,2.315889661889913,2.3311030060401197,2.3457157657656089,2.3597516506234411,2.3732334341772128,2.3861829909477175,2.3986213319048821,2.4105686385585798,2.4220442957036168,2.4330669228720319,2.4436544045437394,2.4538239191645328,2.4635919670185271,2.4729743970002716,2.4819864323299652,2.4906426952535021,2.4989572307674166,2.5069435294072351,2.5146145491361929,2.5219827363698482,2.5290600461706885,2.5358579616455135,2.5423875125770521,2.5486592933200534,2.5546834799908833,2.5604698469785219]
[48,33.136580107124317,31.316758582943638,46.284501254533815,45.740521979229676,32.274130898446579,0,null,null,null,null,"Commercial","College","Hot Water","Commercial-college-HotWater","College Hot Water",0,0.14422959990661857,0.29776362676793666,0.43080203841671699,0.55223442062190931,0.67033574065280876,0.75370550937215919,0.83363649050114763,0.90926539521217364,0.97955490956334945,1.0470228988318731,1.1123063750266171,1.1748067059521563,1.2357422718873179,1.2945126677781043,1.3512597687645014,1.4064719533722974,1.4600300903583547,1.5121631309224595,1.5619202594241375,1.609480182256722,1.6549434603497666,1.6984058583888764,1.73995858382998,1.7796885134813765,1.8176784083255715,1.8540071172154231,1.888749770043741,1.9219779609521555,1.9537599221136246,1.984160688593309,2.0132422547645907,2.0410637227306396,2.0676814431770731,2.0931491490577918,2.1175180824939561,2.1408371152451804,2.1631528630923547,2.1845097944528842,2.2049503335316452,2.2245149582943728,2.2432422935346077,2.2611691992905678,2.2783308548544166,2.2947608386032514,2.3104912038687457,2.3255525510506652,2.3400193142644961,2.3539149661844179,2.3672620528426851,2.38008223021111,2.3923962993384031,2.4042242401003793,2.4155852436177896,2.426497743394382,2.436979445225707,2.4470473559272006,2.4567178109281551,2.466006500776349,2.4749284965963407,2.4834982745427361,2.4917297392880973,2.4996362465836124,2.507230624929127,2.5145251963876945,2.5215317965784227,2.5282617938800542,2.5347261078764345,2.5409352270738026,2.546899225918648,2.5526277811437419]
[49,33.380363853540402,31.548280153128825,46.616915952843144,46.069364675655322,32.511973890851777,0,null,null,null,null,"Commercial","College","Interior Lights","C-Unv-Lgt-LPD Int-All-All-C","College Interior Lights",0,0.14340960611668657,0.29354262953662186,0.42343274038174117,0.54207207387670442,0.65758434461824566,0.73841299707368135,0.8159207565792751,0.88924733031520875,0.95724229299113806,1.0225180444708613,1.0857113539044663,1.1461835689160389,1.2051327143879129,1.2620147482941233,1.3169320238044397,1.3704345755155434,1.4222780580226273,1.4727957126288698,1.5210009940231026,1.5670690579382425,1.6110981737868266,1.6531819005742396,1.6934093228042264,1.731865274057947,1.7686305489154472,1.8037821038509723,1.8373932476982517,1.86953382224861,1.9002703735133815,1.9296663141525299,1.957782077543488,1.9846752639379253,2.0104007791293634,2.0350109660311562,2.0585557295422974,2.0810826550577186,2.1026371209600896,2.1232624054116416,2.1429997877470459,2.1618886447519001,2.179966542095825,2.1972693211744878,2.213831181601027,2.2296847595742633,2.2448612023387473,2.2593902389400489,2.2733457058512982,2.2867502461560236,2.2996256090459717,2.3119926851097001,2.3238715402280645,2.3352814481315938,2.3462409216725884,2.3567677428626701,2.3668789917245294,2.3765910740046747,2.3859197477921543,2.3948801490864393,2.4034868163559477,2.4117537141270629,2.4196942556419176,2.4273213246217034,2.4346472961708203,2.4416840568557854,2.4484430239914734,2.4549351641659891,2.4611710110342204,2.4671606824089505,2.4729138966772526,2.478439988568812]
[50,33.614546126754703,31.770683198455615,46.936238429605211,46.385255834565648,32.740449387878876,0,null,null,null,null,"Commercial","College","Other","Commercial-college-Misc","College Other",0,0.13989610273657002,0.28630823971085567,0.41324093479522062,0.5293372216082064,0.64202915898196089,0.7212126299059064,0.79714509087169505,0.86897074661238982,0.93560773446962398,0.99955225759367849,1.0614936114511211,1.1207103539133523,1.1784759162338108,1.2342589045419108,1.2881377598975761,1.3406175452224822,1.391467453100218,1.4409720762978822,1.4882221726607197,1.5333755498462573,1.5765287073683598,1.6177735146707743,1.6571974432223027,1.6948837864748794,1.7309118683435871,1.7653572408307179,1.7982918713812002,1.8297843205239077,1.8598999103224432,1.8887008841298325,1.9162465581140815,1.9425934649956194,1.967795490413216,1.9919040023119006,2.0149679737246773,2.0370340992993148,2.0581469059021509,2.0783488576126041,2.0976804554048578,2.1161803317969574,2.1338853407322129,2.1508306429433479,2.1670497870361851,2.1825747865167688,2.197436192973671,2.2116631656157413,2.2253284932903838,2.2384543483231787,2.2510620277322602,2.2631719877832461,2.2748038771800245,2.285976568945252,2.2967081910422915,2.3070161557882707,2.3169171881059918,2.3264273526605219,2.3355620799245025,2.3443361912144653,2.3527639227387791,2.360858948696241,2.3686344034627975,2.376102902902387,2.3832765648364851,2.3901670287055641,2.3967854744543673,2.4031426406716401,2.4092488420137523,2.4151139859404762,2.4207475887900816,2.4261587912198239]
[51,33.839505082772284,31.984326853908826,47.242984324669649,46.688705554940611,32.959926330268019,0,null,null,null,null,"Commercial","College","Motors","Commercial-college-Motors","College Motors",0,0.14261212274464458,0.29446182965520867,0.42642980416152726,0.54701460313200456,0.66365328612254726,0.74665698381751822,0.82626117620647643,0.90157720894866811,0.97155735961589851,1.0387170337546892,1.1037606068977237,1.165991053134116,1.2266514764110328,1.2851626786390746,1.3416983627518091,1.396746739694539,1.4500691868872171,1.502010265068326,1.5515926215241527,1.5989858156911108,1.6442900200906547,1.6876006306975451,1.7290085049089581,1.7686001871389889,1.8064581227072936,1.8426608606533013,1.8772832460722437,1.9103966025360739,1.9420689051310736,1.9723649446144436,2.0013464831643688,2.0290724021718067,2.0555988424975085,2.0809793375944459,2.1052649398737997,2.1285043406718938,2.1507439841558664,2.1720281754873776,2.1923991835462076,2.2118973384991327,2.2305611244839296,2.2484272676636858,2.26553081989276,2.2819052382226528,2.2975824604637185,2.3125929770069984,2.3270109162474935,2.3408596716413035,2.3541617131299306,2.3669386235983074,2.3792111338935498,2.3909991564612589,2.4023218176539491,2.4131974887640153,2.4236438158316034,2.4336777482757381,2.4433155663951638,2.4525729077835283,2.4614647927017534,2.470005648448776,2.4782093327701884,2.4860891563427678,2.4936579043713714,2.5009278573332425,2.5079108109033812,2.5146180950933132,2.5210605926343104,2.5272487566348838,2.5331926275412071,2.5389018494279845]
[52,34.055603983845849,32.189556109867723,47.537648969304065,46.980203845406457,33.170759127952117,0,null,null,null,null,"Commercial","College","Office Eqpmt","Commercial-college-OffEquip","College Office Eqpmt",0,0.13961821542730049,0.2846221947248247,0.41002854680613554,0.52455017544587179,0.6358866472053406,0.71329476915015921,0.78750709789740991,0.85769180984642635,0.92272277596093399,0.98515475911531358,1.045602139432612,1.1034246368748599,1.15985342120866,1.2143305619639944,1.2669481451986575,1.3182120996101612,1.3679091106578338,1.4163119260101611,1.4624972143831618,1.506627824929734,1.5487985998218288,1.5890998163365695,1.6276174163983257,1.664433224083089,1.6996251517403518,1.7332673953509115,1.7654306197043745,1.796182133947462,1.8255860580234295,1.8537034804938837,1.8805926082069027,1.9063089082495734,1.9309052425987174,1.9544319958606347,1.9769371964690603,1.9984666316901147,2.019063956763782,2.0387707984933008,2.0576268535767128,2.0756699819586633,2.0929362954653032,2.1094602419707518,2.125274685330008,2.1404109813003944,2.1548990496615081,2.168767442732273,2.182088346651939,2.1948833749101908,2.2071732877506975,2.2189780258551135,2.2303167426973145,2.2412078356203775,2.2516689756867145,2.2617171363497985,2.2713686209940054,2.2806390893872504,2.2895435830893396,2.2980965498572665,2.3063118670870493,2.3142028643301416,2.3217823449209511,2.3290626067505635,2.3360554622203669,2.3427722574079608,2.3492238904764395,2.3554208293569308,2.3613731287330624,2.3670904463549354,2.3725820587090545,2.3778568760696523]
[53,34.26319178506926,32.386702369194225,47.820708186051839,47.260221415498535,33.373288232355662,0,null,null,null,null,"Commercial","College","Process","Commercial-college-Process","College Process",0,0.14733987465196557,0.30513530643223774,0.44218856714707666,0.56743625520496987,0.68916042074185258,0.77598315210649471,0.85923621187251009,0.93806249530697428,1.0112863457729135,1.0816025165020164,1.149638403195167,1.2147568543274225,1.278146649807697,1.3392697266448559,1.3982632430077497,1.4557086911611101,1.5113389486436091,1.565533862280917,1.6172638179955801,1.6667155281786612,1.7139929425732041,1.7591950694705114,1.802416221147459,1.8437462465761967,1.8832707520924512,1.9210713106704316,1.9572256604162903,1.9918078928581142,2.0248886315783761,2.0565352017045564,2.0868117907451413,2.1157796012313228,2.1434969955993712,2.1700196337247242,2.1954006034962705,2.2196905447980235,2.2429377672452708,2.2651883620033471,2.2864863079992754,2.3068735728196379,2.3263902085721018,2.3450744429729755,2.3629627659089816,2.3800900117079968,2.3964894373408852,2.4121927967645576,2.4272762271974386,2.4417642018712269,2.4556802278762104,2.4690468843020903,2.4818858588731016,2.4942179831368723,2.5060632662641127,2.517440927513984,2.5283694274178075,2.5388664977317292,2.5489491702069205,2.5586338042240095,2.5679361133365721,2.5768711907667545,2.5854535338943907,2.5936970677793547,2.6016151677553077,2.6092206811314984,2.6165259480378391,2.6235428214470606,2.6302826864064515,2.636756478510371,2.6429747016435181,2.6489474450237385]
[54,34.462603697867912,32.576083982380112,48.092619057087155,47.5292104357599,33.567840686153495,0,null,null,null,null,"Commercial","College","Refrigeration","Commercial-college-Refrig","College Refrigeration",0,0.13195581226720171,0.26456836218356883,0.37886166829396717,0.4835541327281937,0.58609767794104695,0.65519744575429661,0.72140770409934274,0.78403171574374486,0.84186839843123284,0.89741402995521069,0.95115747639363468,1.002503395816297,1.0527435558158666,1.1013712838892598,1.1483118594549397,1.1940474633286045,1.2384581317018553,1.2815948714164327,1.3227392976062968,1.3620311234909148,1.3995570280673388,1.4353994589295025,1.4696368479644828,1.5023438155989342,1.5335913642251795,1.5634470614008342,1.5919752133823073,1.6192370295209051,1.6452907780204862,1.6701919335275439,1.6939933169981451,1.7167452282612152,1.7384955716741683,1.7592899752447266,1.7791719035718887,1.7981827649393289,1.8163620128759406,1.8337472424807424,1.8503742817928663,1.8662772784717776,1.8814887820382091,1.896039821912451,1.9099599814735766,1.9232774683508738,1.9360191811471374,1.9482107727825126,1.959921071154787,1.9711690765070824,1.9819730390008825,1.9923504883273639,2.0023182621497462,2.0118925334228051,2.0210888366338886,2.029922093007996,2.0384066347178296,2.0465562281380905,2.054384096181757,2.0619029397545798,2.0691249583626132,2.0760618699062046,2.0827249296925761,2.0891249486978314,2.0952723111080278,2.1011769911677689,2.1068485693636587,2.1122962479688741,2.1175288659740761,2.1225549134288855,2.1273825452171953,2.1320195942886677]
[55,34.654161731296021,32.758006761617274,48.353820662308401,47.78760526790338,33.754730651377166,0,null,null,null,null,"Commercial","College","Ventilation","Commercial-college-Vent","College Ventilation",0,0.14324034615117084,0.29141109069660104,0.41925656315015319,0.53620019166370336,0.65080138955747557,0.72962663752785062,0.80520427268416306,0.87667806419794569,0.94287576511449822,1.006446948612862,1.0679490727852405,1.1268316347771832,1.1842538333541699,1.2397013109052448,1.2931785765302453,1.3452763132853667,1.3957665675739626,1.4449605342794773,1.49188547328472,1.5367245305754791,1.5795739069390531,1.620525176724779,1.6596655203047577,1.6970779443515902,1.7328414905958951,1.7670314336892035,1.7997194687627773,1.830973889239871,1.8608597554278059,1.8894390543868846,1.9167708515454787,1.94291143450454,1.9679144494501708,1.9918310305696836,2.0147099228447027,2.0365975985742137,2.0575383679610013,2.077574484076556,2.0967462425021997,2.1150920759278442,2.1326486439743726,2.1494509184910808,2.1655322645658925,2.1809245174730991,2.1956580557711445,2.2097618707514397,2.2233089027179127,2.2363211320584879,2.2488196714308595,2.2608248000182871,2.2723559964330673,2.2834319703210513,2.2940706927184999,2.304289425210527,2.3141047479384365,2.323532586501408,2.3325882377961649,2.3412863948365614,2.3496411705933538,2.3576661208928376,2.3653742664115041,2.3727781138024047,2.3798896759874979,2.3867204916489069,2.3932816439507123,2.3995837785216518,2.4056371207279139,2.4114514922640411,2.417036327088868,2.4224006867323475]
[56,34.838175212014669,32.93276447462128,48.604734788361469,48.035823166216041,33.934259916721707,0,null,null,null,null,"Commercial","Grocery","Compressed Air","Commercial-Grocery-AirComp","Grocery Compressed Air",0,0.13947228280182386,0.2810789008448909,0.40280150923068164,0.5138974881912709,0.62273470870772307,0.6964331012320657,0.76709555880412317,0.83386926065364897,0.89557514059040289,0.95482410828593989,1.0121830693180458,1.0670747537792415,1.1206655099780847,1.1724375418391828,1.2224031663215618,1.2711212759920767,1.3183709907150569,1.3644363665458084,1.4083619341018836,1.4503202131192896,1.4904027091143293,1.5286964874358702,1.5652843983133085,1.6002452900179318,1.6336542107885286,1.6655826001353802,1.6960984701022068,1.7252665770330382,1.7531485843602808,1.7798032169012969,1.8052864071235344,1.8296514338125196,1.8529490535527855,1.8752276254089484,1.8965332291725929,1.9169097775203054,1.9363991224090358,1.955041156016897,1.9728739065204672,1.9899336289835881,2.0062548916174934,2.0218706576577952,2.0368123630903696,2.0511099904454442,2.0647921388671957,2.0778860906548133,2.0904631262783058,2.1025436522830052,2.1141472696153452,2.1252928054258722,2.1359983436167544,2.1462812541833496,2.1561582213974457,2.1656452708778948,2.1747577955925705,2.1835105808338309,2.1919178282080125,2.1999931786778819,2.2077497346954305,2.2152000814609178,2.2223563073426646,2.2292300234907265,2.2358323826762629,2.2421740973871809,2.248265457209405,2.2541163455219819,2.2597362555331024,2.2651343056830591,2.2703192544391415,2.2752995145064565]
[57,35.014941283790499,33.100639319005523,48.845766609738092,48.274264951338672,34.106718384872075,0,null,null,null,null,"Commercial","Grocery","Cooking","Commercial-Grocery-Cook","Grocery Cooking",0,0.13729635165002094,0.27498080996161772,0.39318538124106367,0.5010177149585453,0.60666890138162244,0.67759515831774852,0.7455946965954342,0.80983076578938296,0.86912626964737749,0.92605779188390314,0.98117740079412163,1.0339117641023392,1.0854432485390695,1.1352439116504565,1.1833196118051577,1.2302034156230515,1.2756988413036057,1.3200503177676417,1.3623325116999101,1.4027128983667925,1.4412803613704575,1.4781194498982264,1.5133105994589733,1.5469303409114601,1.5790514984278869,1.6097433769995773,1.6390719400574532,1.6670999777476658,1.6938872663723237,1.7194907194765876,1.7439645310363756,1.7673603111754599,1.7897272148167189,1.8111120636496871,1.8315594617752073,1.8511119053678791,1.8698098866780319,1.8876919926770783,1.904794998633228,1.9211539568886649,1.9368022810942724,1.9517718261438652,1.9660929640365363,1.9797946558831503,1.9929045202611355,2.0054488981105343,2.0174980555876245,2.0290715427426433,2.0401881378391944,2.0508658778224342,2.0611220875844554,2.0709734080743414,2.0804358232985143,2.0895246862551691,2.098254743844886,2.1066401607978364,2.1146945426563999,2.122430957850487,2.1298619589013819,2.1369996027885154,2.1438554705122055,2.1504406858841101,2.1567659335758833,2.1628414764553114,2.1686771722380689,2.1742824894820965,2.1796665229505696,2.1848380083683714,2.1898053365960166,2.1945765672440292]
[58,35.184745387321563,33.261902377972135,49.077305343048977,48.503315657508345,34.272384540636132,0,null,null,null,null,"Commercial","Grocery","Cooling","Commercial-Grocery-Cool","Grocery Cooling",0,0.16708881417501403,0.34925676094663805,0.50733493063908397,0.65425982297738017,0.80185963053910425,0.90337187038449374,1.0007966794602852,1.0930648471308964,1.178763176870077,1.261202429197791,1.340617238182475,1.4170242048972979,1.4911732189096791,1.5627432136586246,1.6312942245624642,1.6979714052908661,1.7622399485580631,1.8249265911652195,1.8846894293511103,1.941857682749575,1.9965477998356238,2.0488707912046298,2.0989324948878276,2.1468338281343966,2.1926710263796139,2.2365358700789111,2.2785159000502975,2.3186946219323383,2.3571517003316047,2.3939631432021033,2.4292014769695838,2.4629359128856469,2.4952325050701911,2.5261543006758367,2.5557614825844466,2.5841115050236669,2.611259222470466,2.6372570121888494,2.6621548907302639,2.6860006247075408,2.7088398361365811,2.7307161026242364,2.7516710526659716,2.771744456302855,2.7909743113741463,2.8093969255892111,2.8270922614984082,2.8440890302134183,2.8604148094037076,2.8760960880419648,2.8911583093831008,2.9056259122465491,2.9195223706688411,2.9328702319908007,2.945691153441151,2.9580059372758933,2.9698345645304722,2.981196227439491,2.992109360576575,3.0025916707649185,3.0126601658070316,3.022331182080312,3.0316204110432174,3.0405429246950333,3.049113200030559,3.0573451425293832,3.0652521087178606,3.0728469278404016,3.0801419226752311,3.0871489295283956]
[59,35.347861721165039,33.416814058055337,49.299724875528213,48.723345154309193,34.431525900640018,0,null,null,null,null,"Commercial","Grocery","Exterior Lights","Commercial-Grocery-ExtLight","Grocery Exterior Lights",0,0.12980625881523358,0.26979932797863249,0.393202812853026,0.50776943434519284,0.61961986548481451,0.70063398396682952,0.77822840493610357,0.85206360354115751,0.92088518081478299,0.98698297891616726,1.0507932496768548,1.111622379887053,1.1710461507785292,1.2286333754991308,1.2842090619845234,1.3381148486042966,1.3904575850707788,1.4408310955747312,1.4889940681131266,1.5350316952134717,1.5790411443116461,1.6211149549791763,1.6613412691746072,1.6998040495381779,1.7365832863751278,1.7717551939369955,1.8053923965763523,1.837564105318432,1.8683362853629693,1.8977718150011169,1.9259306364054938,1.9528698987261259,1.9786440939011765,2.0033051855688599,2.0269027314457002,2.0494839995162644,2.0710940783605962,2.0917759819277508,2.1115707490469839,2.1305175379522874,2.1486537160809513,2.1660149453926905,2.1826352634425188,2.1985471604279323,2.2137816524190645,2.2283683509692311,2.2423792034811574,2.2558369429028522,2.2687634047429199,2.2811795624992044,2.2931055616887965,2.3045607525346252,2.3155637213616629,2.3261323207536879,2.3362836985195372,2.3460343255158382,2.3554000223713767,2.3643959851564484,2.3730368100388533,2.3813365169665306,2.3893085724152652,2.3969659112383699,2.4043209576538005,2.4113856454027491,2.4181714371124303,2.42468934289447,2.4309499382090789,2.4369633810239946,2.4427394282960297,2.4482874518019706]
[60,35.504553684511322,33.565624509624215,49.51338436878396,48.93470874393536,34.58439944531235,0,null,null,null,null,"Commercial","Grocery","Heating","Commercial-Grocery-Heat","Grocery Heating",0,0.13744746252843859,0.28962123669541934,0.42284821985548021,0.54437944337670607,0.66192560170247272,0.75333093834533504,0.840716312891016,0.9241977235901484,1.0026622088832924,1.0778234507540416,1.1507211106566979,1.2198044675581918,1.2870400870006,1.3521878138971106,1.4154251291679063,1.4766709643823959,1.5366296937465445,1.5939176345608146,1.6488938058726463,1.7014580413913991,1.7517197909679652,1.799783337048773,1.8457480493766285,1.88970862658528,1.9317553253893405,1.971974178032345,2.0104471986190968,2.0472525789238833,2.0824648742335636,2.1161551797537661,2.1483912980774345,2.179237898187588,2.2087566664403324,2.2370064499497944,2.2640433927736505,2.2899210652762152,2.3146905870255652,2.3384007435618459,2.3610980973556313,2.382827093257994,2.4036301587276494,2.4235477991051764,2.4426186881898109,2.4608797543605898,2.4783662624706841,2.4951118917315247,2.5111964458193556,2.5266460223132858,2.5414856885258787,2.5557395221754731,2.5694306504528668,2.582581287545743,2.5952127706817301,2.6073455947485704,2.6189994455475722,2.6301932317342991,2.6409451154983246,2.6512725420318231,2.6611922678348185,2.6707203879030113,2.6798723618422993,2.6886630389523636,2.6971066823200172,2.7052169919614095,2.7130071270506346,2.7204897272708113,2.7276769333222721,2.7345804066211499,2.7412113482203018,2.7475805169832945]
[61,35.655074302519274,33.708574030823911,49.718628838770272,49.13774773493072,34.731252033854453,0,null,null,null,null,"Commercial","Grocery","Hot Water","Commercial-Grocery-HotWater","Grocery Hot Water",0,0.13800007348759646,0.27939757235760337,0.40118913907962467,0.51218863853466523,0.62043242010928412,0.69454004030804373,0.76556869281433615,0.83269633938013399,0.89483275562390296,0.95448289966794009,1.0122274274678484,1.0674623643394596,1.121423006677857,1.1735355129580298,1.2238684921591039,1.2728952315445095,1.320500121458497,1.3668488564912515,1.4110580386025706,1.4532909143938524,1.4936392106514462,1.5321902135437258,1.5690269931793139,1.6042286163290587,1.6378703479587191,1.6700238421828941,1.7007573232163979,1.7301357568669322,1.7582210130824192,1.785072020037604,1.8107449102174578,1.8352931589293604,1.8587677156519653,1.8812171286059487,1.9026876629104368,1.9232234126687209,1.9428664073078306,1.9616567124785904,1.9796325258058445,1.9968302677625673,2.0132846679265142,2.0290288468638473,2.0440943938707661,2.0585114407915222,2.0723087321192515,2.0855136915748012,2.0981973525637065,2.1103802946335422,2.1220822849032914,2.1333223101359766,2.1441186075451455,2.1544886943851882,2.1644493963735107,2.1740168749906688,2.1832066537027592,2.1920336431486245,2.2005121653327238,2.2086559768629317,2.2164782912709686,2.223991800451679,2.2312086952559338,2.238140685270587,2.2447990178175594,2.2511944962028947,2.2573374972453837,2.2632379881132052,2.2689055424958982,2.274349356137904,2.2795782617588882,2.2846007433850373]
[62,35.79966663489963,33.845893455607474,49.915789712916585,49.332789993331644,34.872320802867023,0,null,null,null,null,"Commercial","Grocery","Interior Lights","C-Gro-Lgt-LPD Int-All-All-C","Grocery Interior Lights",0,0.13630305858358982,0.27399167957979781,0.39248261192890693,0.50080288057078681,0.60692810805306585,0.67865431534576437,0.74740508536893502,0.81240203308802994,0.87245245906117852,0.93011864104740105,0.98592972006084356,1.0393015158535372,1.0914565711329194,1.1418841544357086,1.1905552837961755,1.237995667384584,1.2840302751205468,1.3288357388420138,1.3715660753441059,1.4123784927342855,1.451362414022515,1.4886029124102851,1.5241809322749353,1.5581734984580382,1.5906539144993146,1.6216919504213396,1.6513540206361743,1.6797033525129039,1.7068001461147595,1.7327017255859378,1.7574626826413209,1.781135012586921,1.803768243274958,1.8254095573749354,1.8461039083208162,1.8658941302743657,1.8848210424258252,1.9029235479352675,1.9202387278011719,1.9368019299269179,1.9526468536409411,1.9678056299121991,1.9823088974892937,1.9961858751790507,2.0094644304685154,2.0221711446831594,2.0343762298955728,2.0460994891525255,2.0573599437264884,2.0681758639781096,2.078564799000318,2.088543605092152,2.0981284731085137,2.1073349547302231,2.1161779876969979,2.1246719200442987,2.1328305333833639,2.1406670652622086,2.1481942306438673,2.1554242425367294,2.1623688318104417,2.1690392662295297,2.1754463687356176,2.181600535007914,2.187511750330454,2.1931896057934641,2.1986433138551393,2.2038817232890797,2.20891333354164,2.2137463085224875]
[63,35.938564168406224,33.977804526485059,50.105185365314576,49.520150472102941,35.00783354927681,0,null,null,null,null,"Commercial","Grocery","Other","Commercial-Grocery-Misc","Grocery Other",0,0.13647760142258089,0.27409635180621628,0.39244691800786052,0.50056088322174686,0.6064721859772636,0.67790403337452088,0.74637916833325735,0.81109812682944815,0.87087671768956232,0.92827709767726374,0.98383603543583509,1.0369762812583707,1.0889069667963287,1.1391077487524062,1.1875648826397245,1.2348024859202351,1.2806418139109021,1.3252819000186955,1.3678487558002412,1.4085035838846411,1.4473356091592728,1.484429712418768,1.5198666512521573,1.5537232692300824,1.5860726940341832,1.6169845251344952,1.6465250115865311,1.6747572204874976,1.701741196600778,1.7275341136291857,1.7521904175905616,1.7757619627238634,1.7982981403299574,1.8198460009287423,1.84045037009295,1.8601539582989066,1.8789974651156114,1.8970196780356521,1.9142575662346515,1.9307463695300782,1.9465196827952767,1.9616095360704762,1.9760464705992049,1.9898596110059892,2.00307673381936,2.0157243325330141,2.0278726359751951,2.0395413550628723,2.0507494225757692,2.0615150238752573,2.071855626410545,2.0817880080600384,2.0913282843538563,2.1004919346216675,2.1092938271082784,2.117748243097723,2.1258689000849911,2.1336689740329962,2.1411611207508954,2.1483574964284475,2.1552697773597242,2.1619091788881817,2.1682864736038256,2.1744120088220025,2.1802957233721676,2.1859471637238772,2.1913754994761683,2.1965895382354521,2.2015977399060742,2.2064082304167085]
[64,36.071991193868847,34.104520252592245,50.287121630826576,49.700131719721867,35.138009098181499,0,null,null,null,null,"Commercial","Grocery","Motors","Commercial-Grocery-Motors","Grocery Motors",0,0.13829115390467922,0.27865295012698676,0.39939989913433527,0.5097017028013755,0.61777618116686228,0.69098533474185331,0.76116962563900259,0.82750964155298234,0.88881992002789589,0.947692022623566,1.0046760925380627,1.0591935205372012,1.112435221676078,1.1638875371254844,1.2135432678571625,1.2619493134281581,1.3089036128769238,1.354645088675662,1.3982659563918578,1.439932485334543,1.4797356135582511,1.5177618647812063,1.5540935722046376,1.5888090905067207,1.6219829966587902,1.6536862801749534,1.6839865233718101,1.7129480721825618,1.7406321980392172,1.767097251307798,1.792398806734294,1.8165898013335158,1.8397206651288718,1.8618394451283349,1.8829919229004322,1.9032217260938538,1.9225704342252137,1.9410776790415183,1.958781239746922,1.9757171333673755,1.9919197005116656,2.0074216867731236,2.0222543200028515,2.0364473836726478,2.050029286533857,2.0630271287671023,2.0755118489988233,2.0875037039903908,2.0990221508173699,2.1100858784390959,2.1207128380219662,2.1309202720656408,2.1407247423794198,2.1501421569541757,2.1591877957734593,2.1678763356056403,2.1762218738173216,2.1842379512466565,2.1919375741736911,2.1993332354233632,2.2064369346354207,2.2132601977341211,2.2198140956293284,2.2261092621793304,2.2321559114445333,2.2379638542600189,2.2435425141538681,2.2489009426370576,2.2540478338897612,2.2589915388678645]
[65,36.200163168376648,34.226245253655833,50.461892298945692,49.873024368731393,35.263057656207138,0,null,null,null,null,"Commercial","Grocery","Office Eqpmt","Commercial-Grocery-OffEquip","Grocery Office Eqpmt",0,0.13935912935440031,0.28085120949546227,0.40244609561572836,0.51341440272979322,0.62213429153047273,0.69569986669222794,0.76623413785993655,0.83288313854173612,0.89446681215282708,0.95359842276067408,1.0108459428384005,1.0656302725618514,1.1191169273875459,1.1707894856901684,1.2206586549105121,1.2692866211062523,1.31644727878096,1.3624293629674169,1.4062752057566967,1.4481568760958694,1.4881657584027426,1.5263888015911047,1.5629087439417446,1.5978043260934234,1.6311504928044056,1.6630185840984677,1.6934765163747354,1.7225889540281116,1.7504174720963626,1.7770207104209832,1.8024545197816888,1.8267721004386632,1.8500241334924603,1.8722589054485954,1.8935224263523294,1.9138585418388179,1.9333090394246579,1.9519137493487873,1.9697106402536613,1.9867359099815614,2.0030240717457346,2.0186080359217651,2.0335191876910876,2.047787460755838,2.0614414073322198,2.0745082646182382,2.0870592753626607,2.0991148038848224,2.1106944105721355,2.1218168836172926,2.132500269502565,2.1427619022806579,2.1526184316996311,2.1620858502175189,2.1711795189504821,2.1799141925965904,2.1883040433756773,2.1963626840241139,2.2041031898818,2.2115381201072211,2.2186795380549889,2.225539030848926,2.232127728182455,2.2384563203767964,2.2445350757262745,2.2503738571588729,2.2559821382390743,2.2613690185389514,2.2665432384024391,2.2715131931267574]
[66,36.323287063196823,34.343176090412399,50.629779588205174,50.039107605051797,35.383181150948388,0,null,null,null,null,"Commercial","Grocery","Process","Commercial-Grocery-Process","Grocery Process",0,0.14273797539491073,0.28899792582004408,0.41494069090062813,0.52997594625527467,0.64264807855273354,0.71975108568616897,0.79368648660928509,0.86358504242906886,0.92826434118261125,0.99037002474927227,1.0504888626202882,1.1080373326841673,1.1641655873144634,1.2183689110792186,1.2706673398326949,1.3216478588765737,1.3710606897897823,1.4192354570936903,1.4651846889129903,1.5090859497564251,1.551033978266162,1.5911189423737437,1.6294266696779292,1.6660388657148208,1.7010333207805011,1.7344841059292846,1.7664617587357339,1.7970334593756179,1.8262631975499297,1.8542119307467904,1.8809377343084532,1.9064959437446019,1.9309392897085822,1.9543180260300748,1.9766800511758895,1.9980710234899837,2.0185344705443979,2.0381118929144972,2.0568428626746322,2.0747651168940591,2.0919146463975697,2.1083257800408064,2.12403126473653,2.1390623414552308,2.1534488174112552,2.1672191346341556,2.1804458344928626,2.1931503776286876,2.2053533774709941,2.2170746336829872,2.2283331642871489,2.2391472365224407,2.2495343964833396,2.2595114975888038,2.2690947279273539,2.2782996365226373,2.2871411585620987,2.295633639629683,2.3037908589818912,2.3116260519049612,2.3191519311894391,2.3263807077569907,2.3333241104729177,2.3399934051765263,2.346399412960225,2.3525525277270085,2.3584627330548198,2.3641396183951433,2.3695923946321265,2.3748299090274618]
[67,36.441561697990458,34.455501582013326,50.791054601903035,50.198649618808176,35.498573557039883,0,null,null,null,null,"Commercial","Grocery","Refrigeration","Commercial-Grocery-Refrig","Grocery Refrigeration",0,0.13264626610429492,0.2657771127711458,0.38044659002418763,0.48563496079949908,0.5890037566163272,0.65812399294986124,0.72436089154396022,0.78699844307068789,0.84480211506904945,0.90033409038050194,0.95403654273902649,1.0053771972583416,1.0556071321545819,1.1042290298196353,1.1511242770136554,1.1968250710591659,1.2411729969560392,1.284272624926901,1.3253696542249471,1.3646162017367278,1.4020988535452896,1.4378999683261515,1.4720978928756328,1.5047671661962059,1.5359787127680862,1.5658000256006825,1.5942953396239989,1.6215257959484795,1.6475495974920087,1.6724221564447272,1.6961962340158723,1.7189220728819339,1.7406475227319211,1.761418159283396,1.7812773971220508,1.8002665966979325,1.8184251657928612,1.8357906557560946,1.8523988527888025,1.8682838645423505,1.8834782022807315,1.8980128588436411,1.9119173826336506,1.9252199478386167,1.9379474210888534,1.9501254247376449,1.9618226715427467,1.9730581405707959,1.9838500616427861,1.9942159449123951,2.0041726092766341,2.013736209664915,2.0229222632508153,2.031745674629069,2.0402207599986344,2.0483612703910699,2.056180413981922,2.0636908775213052,2.0709048469184648,2.0778340270137106,2.0844896605698002,2.0908825465136003,2.0970230574576014,2.1029211565297379,2.1085864135388017,2.1140280205016908,2.1192548065576791,2.1242752522939079,2.1290975035053474,2.1337293844115419]
[68,36.555178061865227,34.563403110928711,50.945977765877934,50.351908037402204,35.609421209385218,0,null,null,null,null,"Commercial","Grocery","Ventilation","Commercial-Grocery-Vent","Grocery Ventilation",0,0.13493799635608028,0.27111883745432991,0.38840840665594079,0.49580590273069503,0.60115930374639848,0.67215658195182348,0.74020238235454439,0.80454514342328176,0.863981244653378,0.92106770990092601,0.9762948257961287,1.0291039683309187,1.0807302575935354,1.130667497932994,1.1788504979262462,1.2258039514872248,1.2713693245386795,1.3156852655621831,1.3579464244545965,1.3983093704620331,1.4368626788946999,1.4736906128673353,1.5088733425502803,1.5424871528079775,1.5746046398621796,1.6052948975811503,1.6346236939622316,1.6626536383431842,1.6894443398475987,1.715052557541288,1.739532342749819,1.7629351739621286,1.7853100847214001,1.8067037848819696,1.8271607755899093,1.8467234583250183,1.8654322383231767,1.8833256226803099,1.9004403134225103,1.916811295811123,1.9324719221367475,1.9474539912420925,1.9617878240004198,1.9755023349638359,1.9886251003839324,2.001182422796187,2.0132440138174665,2.0248294436717358,2.0359575099999168,2.0466462683595181,2.0569130615202149,2.0667745476029129,2.0762467271079537,2.0853449688763148,2.0940840350259267,2.1024781049035677,2.110540798091197,2.1182851965040577,2.125723865616401,2.1328688748492732,2.1397318171534447,2.1463238278192511,2.1526556025438754,2.158737414785374,2.1645791324316126,2.1701902338111516,2.1755798230720678,2.1807566449536502,2.1857290989749569,2.1905052530632356]
[69,36.664319621783363,34.667054915842641,51.094799249043064,50.499130341527113,35.715903104049332,0,null,null,null,null,"Commercial","Healthcare","Compressed Air","Commercial-Healthcare-AirComp","Healthcare Compressed Air",0,0.13490612411163203,0.26982772434830105,0.38571839831004828,0.49154043654749457,0.59522865938743763,0.66469133444630735,0.73127327648724882,0.79418876698215679,0.85224809456654838,0.90799785760219986,0.96196532453086159,1.0135706328279501,1.0640323084918095,1.1128282031465895,1.159937833388202,1.2058727020924509,1.2504655382629322,1.293888339859671,1.3352890597524243,1.3748241236437939,1.412580904952031,1.4486425073780849,1.4830879827777974,1.5159925374580088,1.5474277275334971,1.5774616439456304,1.6061590877096468,1.6335817359254841,1.659788299056923,1.6848346699553989,1.7087740650780558,1.7316571583243803,1.7535322078919686,1.774445176529555,1.7944398455442987,1.813557922900396,1.8318391457273064,1.8493213775381663,1.8660407004422646,1.8820315026197065,1.8973265613115435,1.9119571215646392,1.9259529709573284,1.9393425105194726,1.9521528220487543,1.9644097320139655,1.9761827701132946,1.9874910383865909,1.99835288477339,2.0087859328828888,2.0188071105886793,2.0284326774946351,2.0376782513165117,2.0465588332220697,2.055088832170834,2.0632820882929779,2.0711518953452726,2.0787110222805278,2.0859717339655304,2.092945811081083,2.0996445692364505,2.1060788773292058,2.1122591751802813,2.1181954904728335,2.1238974550223979,2.1293743204047484,2.1346349729667979,2.1396879482449176,2.1445414448140454,2.149203337590079]
[70,36.769162618822861,34.76662437301259,51.237759367357299,50.640554264797913,35.818191187300144,0,null,null,null,null,"Commercial","Healthcare","Cooking","Commercial-Healthcare-Cook","Healthcare Cooking",0,0.14057496666024161,0.28286525173176558,0.40505649447703462,0.51646561190536722,0.62560434994687875,0.699358790933861,0.77008867626815802,0.83690270516991849,0.89863125891292717,0.95789448802814336,1.0152767607628641,1.0702107694125542,1.1238346490128246,1.175619378713511,1.2256026789567145,1.2743492061545618,1.3216221220556874,1.3677541784977703,1.4117360910050261,1.4537472858663762,1.4938794774723321,1.5322199273208921,1.5688516698406176,1.6038537262799133,1.6373013073162204,1.6692660050019692,1.6998159746293884,1.7290161070635246,1.756928192061981,1.783611073070787,1.8091207939584095,1.8335107381240698,1.85683176039218,1.879132312081738,1.9004585596178833,1.9208544970323851,1.9403620526806038,1.9590211904842967,1.976870005992531,1.9939448175368197,2.0102802527413597,2.0259093306348945,2.0408635395971642,2.0551729113601254,2.0688660912720587,2.081970405021293,2.0945573935423134,2.1066474795292702,2.1182602794399004,2.1294146353237053,2.1401286453936366,2.150419693390881,2.1603044767904054,2.1697990338930122,2.1789187698478742,2.1876784816477608,2.1960923821375182,2.2041741230747558,2.2119368172801512,2.2193930599133229,2.2265549489087819,2.2334341046051209,2.2400416885992991,2.2463884218566026,2.2524846021056693,2.2583401205468054,2.2639644779006969,2.2693667998235583,2.2745558517137332,2.2795400529337653]
[null,null,null,null,null,null,null,null,null,null,null,"Commercial","Healthcare","Cooling","Commercial-Healthcare-Cool","Healthcare Cooling",0,0.15743072494786395,0.32563684462690035,0.47130510089910294,0.60640656034329576,0.74173167423358055,0.83366360096739711,0.92188308260034024,1.0053834104360022,1.08278748843329,1.1572400099662525,1.228992634458451,1.2979740602519396,1.3650355047050131,1.4297959364695039,1.4918849974872617,1.5523107540819823,1.6106142459481712,1.6674795452142956,1.7216757632178361,1.7734987864336602,1.8230562161618658,1.8704505719333175,1.9157795423372057,1.9591362229138063,2.0006093418066468,2.0402834738297373,2.0782392435692092,2.1145535181044091,2.1492995899012075,2.1825473503997737,2.2143634547903277,2.244811478443248,2.2739520654343282,2.3018430695818197,2.3285396883891321,2.3540945902655368,2.3785580353769626,2.4019779904597898,2.4244002379124949,2.4458684794629302,2.4664244346929092,2.4861079346865624,2.5049570110545747,2.5230079805728436,2.5402955256612998,2.5568527709165334,2.5727563779237692,2.5880321506710908,2.6027048744702657,2.6167983561715196,2.6303354627907236,2.6433381586116869,2.6558275408237342,2.6678238737524134,2.6793466217388495,2.6904144807211146,2.7010454085688385,2.7112566542202874,2.7210647856691872,2.7304857168466912,2.7395347334421229,2.7482265177043761,2.7565751722642196,2.7645942430161585,2.7722967410969757,2.7796951639966174,2.7868015158356747,2.7936273268423566,2.8001836720605704,2.8064811893194448]
[null,null,null,null,null,null,null,null,null,null,null,"Commercial","Healthcare","Exterior Lights","Commercial-Healthcare-ExtLight","Healthcare Exterior Lights",0,0.12851595774710053,0.26666183003110683,0.38845956902406109,0.50157396568356183,0.61200881151174835,0.69185951252696565,0.7683331183371459,0.84110810234990807,0.90892871533627151,0.9740656285644167,1.0369434380657232,1.0968690245159041,1.1554335438470209,1.2122031638663175,1.2669939723262376,1.3201335875627407,1.3717457091088119,1.4213920037982628,1.4688598351655071,1.5142303243187241,1.5575994989294688,1.599058805890442,1.6386953395806567,1.6765920582600762,1.7128279892351781,1.7474784234011096,1.7806150997323609,1.8123063802620618,1.8426174160600144,1.8716103046912822,1.8993442396104796,1.9258756519217484,1.9512583449106722,1.9755436217319988,1.9987804066159223,2.0210153599357561,2.0422929874610354,2.0626557441023476,2.0821441324374543,2.1007967962924883,2.1186506096370792,2.135740761038222,2.1521008339043952,2.1677628827389213,2.1827575056097035,2.1971139130313264,2.210903565727151,2.2241488377431193,2.2368712198543172,2.2490913544342788,2.2608290689477371,2.2721034081211675,2.2829326648433175,2.2933344098458628,2.3033255202123457,2.3129222067616522,2.3221400403504586,2.3309939771373251,2.3394983828494245,2.3476670560912827,2.3555132507333525,2.3630496974167352,2.3702886242089574,2.3772417764443068,2.3839204357809214,2.3903354385055535,2.3964971931157084,2.4024156972076831,2.4081005536979094,2.4135609864039189]
[null,null,null,null,null,null,null,null,null,null,null,"Commercial","Healthcare","Heating","Commercial-Healthcare-Heat","Healthcare Heating",0,0.12841709511586952,0.26000329677343798,0.37421262083194551,0.47869064788670745,0.58005428556852989,0.65131491999970559,0.71954541456295507,0.78427202143418162,0.84435335213546381,0.90200061009771593,0.95781929526317167,1.0109913488590951,1.0630244365537302,1.1134125318826245,1.1621876613424711,1.2096034387538228,1.2557844824140607,1.300384842152936,1.3430024800922027,1.3837097342087215,1.4225955152237508,1.4597444184505421,1.4952369425128584,1.5291496965140765,1.5615555962890098,1.5925240503349674,1.6221211359849921,1.6504097663545767,1.677449848563346,1.7032984337050778,1.7280098590129518,1.7516358826419336,1.774225811466664,1.7958266222710237,1.8164830766846183,1.8362378302016911,1.8551315355993656,1.8732029410545716,1.8904889832424543,1.9070248756834569,1.9228441925915447,1.9379789484621448,1.9524596736252684,1.9663154859769285,1.9795741590902873,1.9922621868969672,2.0044493233936347,2.0161553425048315,2.0273992375304748,2.038199251962943,2.0485729090875888,2.0585370404146905,2.0681078129889885,2.0773007556211067,2.0861307840834238,2.0946122253112756,2.1027588406487574,2.1105838481768346,2.1180999441600039,2.1253193236462873,2.1322537002539934,2.1389143251773497,2.145312005441836,2.1514571214388445,2.1573596437681202,2.1630291494152969,2.1684748372907912,2.1737055431552554,2.1787297539558166,2.1835556215963523]
[null,null,null,null,null,null,null,null,null,null,null,"Commercial","Healthcare","Hot Water","Commercial-Healthcare-HotWater","Healthcare Hot Water",0,0.13393963335104225,0.27026102763881249,0.38774711233723486,0.49491244691905351,0.59933414462655599,0.67061765613302804,0.73890976677986953,0.80347595919282544,0.86321897100521294,0.92057273955535801,0.9760879919197849,1.029141217209681,1.0810372920406155,1.1311987608233058,1.1796655801159766,1.2268584002511511,1.2727242700762869,1.3172960339396056,1.3598177278110162,1.4004322378836764,1.439228408194239,1.476290765395126,1.5116997378716244,1.5455318632726833,1.5778599850903607,1.6087534388870484,1.6382782287358462,1.6664971944076492,1.6934701698085306,1.7192541331427518,1.7439033492500939,1.7674695045411095,1.7900018349302207,1.8115472471442888,1.8321504337632422,1.8518539823295206,1.8706984788443917,1.8887226059515652,1.9059632360918972,1.9224555198972935,1.938232970077129,1.953327541036542,1.9677697044528015,1.9815885210235253,1.9948117085888066,2.0074657068182549,2.0196201571395003,2.0312947804429724,2.0425085190881287,2.0532795676378899,2.0636254023797598,2.0735628096815275,2.0831079132275536,2.0922762001798407,2.1010825463063294,2.1095412401171911,2.1176660060482848,2.1254700267293858,2.1329659643733208,2.1401659813207177,2.1470817597736969,2.1537245207505289,2.1601050422920056,2.1662336769490773,2.1721203685801131,2.1777746684850556,2.1832057509026357,2.1884224278957967,2.1934331636494817,2.1982460882039767]
[null,null,null,null,null,null,null,null,null,null,null,"Commercial","Healthcare","Interior Lights","C-Hos-Lgt-LPD Int-All-All-C","Healthcare Interior Lights",0,0.13577636476022809,0.27262057784826871,0.39033669592994424,0.49792852670780369,0.60335522805956654,0.67442923726323456,0.74255511734098478,0.80695461651304268,0.86643629004335332,0.9235553287431213,0.9788364316529633,1.031702025800064,1.0833739359596781,1.1333363196196751,1.1815615609292185,1.2285692794704706,1.2741911479938233,1.318597822556401,1.3609446249482657,1.4013886122909052,1.4400186136811528,1.4769191317055741,1.5121705625142248,1.5458494042338482,1.5780284543606242,1.6087769967364176,1.6381609786783971,1.6662431787997984,1.6930833660293367,1.7187384503082643,1.7432626254171943,1.7667075043594773,1.7891222477040425,1.8105536852681019,1.8310464314989048,1.8506429948937118,1.8693838817783057,1.8873076947465608,1.9044512260468258,1.9208495461850541,1.9365360879996949,1.9515427264492942,1.9658998543404718,1.9796364542114278,1.9927801665743119,2.0053573547086505,2.0174380272034531,2.0290417852428364,2.0401874562056483,2.0508931242133444,2.0611761594719131,2.0710532464554583,2.0805404109771612,2.0896530461915526,2.0984059375702784,2.1068132868918861,2.1148887352845551,2.1226453853591583,2.1300958224685642,2.1372521351276808,2.1441259346273607,2.1507283738740033,2.157070165485417,2.1631615991722999,2.1690125584335456,2.1746325365924597,2.1800306521999078,2.1852156638293843,2.1901959842880112,2.1949796942665216]
[null,null,null,null,null,null,null,null,null,null,null,"Commercial","Healthcare","Other","Commercial-Healthcare-Misc","Healthcare Other",0,0.13523571291670727,0.27084565061249916,0.38734442850708584,0.49373970384146082,0.59800600195050024,0.66794393061970003,0.73498008337585652,0.79832835246101408,0.85679762369263968,0.91294291569714714,0.96729179049944702,1.0192637583087973,1.070075866047002,1.1192092900489892,1.1666397819516152,1.2128866425215017,1.2577769365255909,1.3014877369020303,1.3431652304072961,1.3829661860276523,1.4209784043082565,1.4572853993549411,1.4919666173584514,1.5250976435173302,1.5567503979973405,1.5869933215292356,1.6158915512126923,1.6435070870621913,1.6698989498004382,1.695123330376481,1.7192337316588662,1.7422811027289102,1.7643139661753526,1.7853785387692032,1.8055188458764353,1.8247768299462335,1.8431924533936845,1.8608037961780788,1.8776471483612536,1.893757097914653,1.909166614028899,1.9239071261656471,1.9380085990782652,1.951499604015404,1.9644073863097453,1.9767579295431137,1.988620904505527,2.0000155591615769,2.0109603816147987,2.021473130105071,2.0315708618217858,2.0412699605795561,2.0505861634013511,2.0595345860521963,2.0681297475648708,2.0763855937973883,2.0843155200604921,2.0919323928518709,2.0992485707323612,2.1062759243780147,2.1130258558405584,2.1195093170474966,2.1257368275718824,2.1317184917005787,2.1374640148287094,2.1429827192068962,2.1482835590668392,2.1533751351497741,2.1582657086613817,2.1629632146757971]
[null,null,null,null,null,null,null,null,null,null,null,"Commercial","Healthcare","Motors","Commercial-Healthcare-Motors","Healthcare Motors",0,0.13477464528637212,0.26967680951280559,0.3855831092249663,0.49144859094094595,0.59518262930086785,0.66473037091118681,0.73139209757018442,0.794389817475322,0.85253106310514837,0.90836063564974023,0.96240338155502059,1.0140773182145624,1.0646064316233683,1.113470873452683,1.1606454170312457,1.2066410226105542,1.2512928812349626,1.2947637444977929,1.3362123227167559,1.3757935555820731,1.4135948709225608,1.4496994254534359,1.4841863226577237,1.5171308190940125,1.5486045197672131,1.5786755631629517,1.6074087965122896,1.6348659418214813,1.6611057531713422,1.6861841657624077,1.7101544371552935,1.7330672811304502,1.7549709945677261,1.7759115777237469,1.7959328482639925,1.8150765493865386,1.8333824523556568,1.8508884537457586,1.8676306676794883,1.8836435133280114,1.8989597979267232,1.913610795545583,1.9276263218400851,1.9410348049964239,1.9538633530726512,1.9661378179265512,1.9779277178918764,1.9892521823672626,2.0001295855709769,2.0105775763535276,2.0206131068333577,2.0302524599020639,2.0395112756437856,2.048404576711619,2.056946792702238,2.0651517835682633,2.0730328621063721,2.0806028155576346,2.0878739263551198,2.0948579920524457,2.1015663444655908,2.1080098680590447,2.1141990176061145,2.1201438351520467,2.1258539663074898,2.1313386758987325,2.1366068630001092,2.1416670753729616,2.1465275233345911,2.1511960930796969]
[null,null,null,null,null,null,null,null,null,null,null,"Commercial","Healthcare","Office Eqpmt","Commercial-Healthcare-OffEquip","Healthcare Office Eqpmt",0,0.13518529377302557,0.27098532827173483,0.38771327736411437,0.49435588777786305,0.59885281456212758,0.66906884653222409,0.73636969573067346,0.79997683724510127,0.85869926489427251,0.91508874674174223,0.96966892894261192,1.0218603283418242,1.0728856533500122,1.1222267095003877,1.1698561178125222,1.216290565554033,1.2613621805237438,1.3052389488795764,1.3470771428022263,1.3870326806311983,1.4251935907361912,1.4616436068860255,1.496462387044512,1.5297257205573154,1.5615057243678203,1.5918710288639339,1.6208869539237638,1.6486156756960926,1.6751163846213761,1.7004454351705649,1.7246564877522317,1.7478006432132283,1.769926570334285,1.7910806266995112,1.8113069732976022,1.8306476831926028,1.8491428445832732,1.8668306585523633,1.8837475317903833,1.8999281645626847,1.9154056341737944,1.9302114741689158,1.9443757494992844,1.9579271278655739,1.970892947441788,1.983299281170952,1.9952158441612158,2.0066619713250464,2.0176562342813718,2.0282164714884852,2.0383598171873745,2.0481027292024439,2.0574610156447353,2.0664498605609691,2.0750838485700309,2.0833769885268669,2.0913427362521921,2.0989940163648853,2.1063432432524976,2.1134023412138965,2.1201827638067297,2.1266955124311018,2.1329511541796098,2.1389598389827102,2.1447313160772259,2.1502749498247202,2.1555997349053984,2.1607143109121969,2.1656269763687317,2.1703457021938544]
[null,null,null,null,null,null,null,null,null,null,null,"Commercial","Healthcare","Process","Commercial-Healthcare-Process","Healthcare Process",0,0.13551022468400609,0.27205131598262289,0.38952216873953477,0.49688152467881708,0.60205062441722568,0.67295689865790675,0.74092153066602995,0.80516665809091326,0.86450605560317417,0.92148677601514672,0.97663330615771848,1.0293684083678092,1.0809177909796834,1.1307617764882076,1.1788756288215798,1.225772739484414,1.2712889732776984,1.3155928032866131,1.3578410063748387,1.3981903642127804,1.4367295444436721,1.4735428948635692,1.5087106632144198,1.5423092053287304,1.5744111822653932,1.6050857470401036,1.634398721519746,1.6624127640180419,1.6891875280995241,1.7147798130703957,1.73924370660799,1.762630719955222,1.7849899160825777,1.8063680311976764,1.8268095899612586,1.8463570147484429,1.8650507292752601,1.8829292568926932,1.9000293138336926,1.9163858976828363,1.9320323713233878,1.9470005426024579,1.961320739941703,1.9750218841084848,1.9881315563506228,2.0006760630867126,2.0127253443623729,2.0242989504287072,2.0354156597422541,2.0460935094334918,2.0563498245725151,2.0662012462793857,2.0756637587247524,2.0847527150645533,2.0934828623508861,2.1018683654594561,2.1099228300724326,2.1176593247539972,2.125090402154405,2.1322281193769657,2.1390840575409853,2.1456693405724128,2.151994653252681,2.1580702585550235,2.1639060142963955,2.1695113891320235,2.1748954779185254,2.1800670164705402,2.1850343957347942,2.1898056754046182]
[null,null,null,null,null,null,null,null,null,null,null,"Commercial","Healthcare","Refrigeration","Commercial-Healthcare-Refrig","Healthcare Refrigeration",0,0.13160301643562405,0.26322865255896127,0.37654338453842495,0.48031463481593467,0.58205868409466854,0.6502399182527705,0.71556773527156226,0.77734740339475461,0.8343652502000023,0.88912950067752483,0.94211390541937912,0.99273797287804588,1.0422837273091312,1.0902453260501801,1.1365394751538525,1.1816535170138955,1.2254664794950296,1.2680290840075077,1.3086203615481646,1.3473808277250841,1.3843963049929806,1.4197484179675737,1.4535148078132278,1.4857693352313763,1.5165822726772851,1.5460204863971716,1.5741476088442319,1.6010242020005765,1.6267079121023678,1.6512536162374367,1.6747135612582709,1.6971374954283867,1.7185727931966603,1.7390645734720935,1.758655811750657,1.7773874464262214,1.7952984795990783,1.812426072678089,1.8288056370560513,1.844470920122357,1.8594540868623672,1.8737857972791498,1.8874952798601876,1.900610401299403,1.9131577326732545,1.9251626122587371,1.9366935695015406,1.9477693136594536,1.9584078153959947,1.9686263359382494,1.9784414550836291,1.9878690981009948,1.9969245615697928,2.0056225381991255,2.0139771406670275,2.0220019245186283,2.0297099101603546,2.0371136039858526,2.0442250186679178,2.0510556926493462,2.0576167088643387,2.0639187127208292,2.0699719293729189,2.0757861803114355,2.0813708992995408,2.0867351476792408,2.0918876290736317,2.096836703508739,2.1015904009778659,2.1061564344704471]
[null,null,null,null,null,null,null,null,null,null,null,"Commercial","Healthcare","Ventilation","Commercial-Healthcare-Vent","Healthcare Ventilation",0,0.13217243030338499,0.26469301608766088,0.37882798457865735,0.48339768552930112,0.58597747809964562,0.65484749646652829,0.72083523559656337,0.78324832031547342,0.84087085551184337,0.89621782177557552,0.94975906736257287,1.0009193013822966,1.0509791254014613,1.0994363418074073,1.1462014446399251,1.1917680410646172,1.2360167335680319,1.2789963408249503,1.3199874862885943,1.3591319723410946,1.3965162511307641,1.432222551850858,1.4663290961348285,1.4989103020115899,1.5300369770500157,1.5597765012862925,1.5881930004942091,1.6153475103268622,1.6412981318284716,1.6661001787869398,1.68980631737134,1.712466698473587,1.7341290831500589,1.754838961536777,1.7746396655908914,1.7935724759915241,1.8116767235144757,1.8289898851778006,1.8455476754387665,1.8613841327071461,1.8765317014251346,1.8910213099503332,1.9048824444652046,1.9181432191240824,1.9308304426372158,1.9429696814803692,1.9546296938165075,1.9658293982984385,1.9765869667183127,1.9869198534917967,1.9968448239782859,2.0063779816831069,2.0155347943858457,2.0243301192371934,2.0327782268650374,2.0408928245288962,2.0486870783602855,2.0561736347250812,2.0633646407425585,2.0702717639943855,2.076906211455559,2.0832787476779902,2.0893997122562546,2.0952790366038334,2.1009262600670735,2.1063505454030067,2.1115606936461471,2.1165651583883811,2.121372059495128,2.1259891962800159]
[null,null,null,null,null,null,null,null,null,null,null,"Commercial","Lodging","Compressed Air","Commercial-Lodging-AirComp","Lodging Compressed Air",0,0.13869560624280716,0.27993513574654716,0.40171192457475574,0.51309605614238341,0.62216023186271385,0.69656614831873853,0.76789900970509284,0.83536038116168843,0.89776648708217177,0.95769145131712274,1.015679496924379,1.0711531916619978,1.1253216869686562,1.1776711949093801,1.2281917743658974,1.2774166748839959,1.325163227934161,1.3716409261405087,1.4159725657486035,1.4583223248949737,1.4987821970539925,1.5374397216506674,1.5743782093283996,1.6096769553414667,1.6434114417214072,1.6756535288299206,1.7064716368764568,1.7359309179461959,1.7640934190535222,1.7910182367072509,1.8167616634466814,1.8413773267819196,1.8649163209477433,1.8874273318575112,1.9089567556221292,1.9295488109788337,1.9492456459554501,1.9680874390777727,1.986112495410713,2.00335733770785,2.0198567929288842,2.0356440743702486,2.0507508596406625,2.0652073647007261,2.0790424141736707,2.0922835081230824,2.1050018771072452,2.1172181569882969,2.1289521689766278,2.140222951791277,2.1510487925507134,2.1614472564441303,2.1714352152313907,2.181028874617867,2.1902438005485902,2.1990949444643748,2.2075966675608925,2.2157627640900612,2.2236064837415537,2.2311405531407398,2.2383771964979449,2.2453281554425275,2.2520047080739585,2.2584176872608097,2.2645774982173474,2.2704941353862433,2.2761771986548016,2.2816359089310079,2.2868791231046761,2.2919153484179682]
[null,null,null,null,null,null,null,null,null,null,null,"Commercial","Lodging","Cooking","Commercial-Lodging-Cook","Lodging Cooking",0,0.142656571725328,0.28858641837343901,0.41422367050668557,0.5289945727178591,0.64149679152902683,0.71828662039865943,0.79193290556692952,0.86155306794618158,0.92596514867251178,0.98781005562002444,1.047669833279397,1.1049837807303255,1.1608880755296309,1.2148721452327305,1.266957420530721,1.3177283856016608,1.3669390585099743,1.4149309629718259,1.4606992960617413,1.5044262140522071,1.5462062331271287,1.5861293053009635,1.6242810486758406,1.6607429655873236,1.6955926492996896,1.7289039798744377,1.7607473098007183,1.7911896399433624,1.8202947863330803,1.8481235382940595,1.8747338083765619,1.9001807745360317,1.9245170149756683,1.9477926360462359,1.9700553935750338,1.9913508079753481,2.0117222734682652,2.0312111617304085,2.0498569202638661,2.0676971657682626,2.0847677727795597,2.101102957825641,2.1167353593350429,2.1316961135222763,2.1460149264609902,2.159720142544705,2.17288431129287,2.1855287918885531,2.1976741003081885,2.2093399426092506,2.2205452469038063,2.2313081940698378,2.2416462472501588,2.2515761801867842,2.2611141044367362,2.2702754955134363,2.2790752179960991,2.2875275496478737,2.2956462045818613,2.3034443555125956,2.3109346551290919,2.3181292566241423,2.3250398334131632,2.3316775980745992,2.3380533205426004,2.3441773455815027,2.3500596095704589,2.355709656625455,2.3611366540848691,2.366349407383701]
[null,null,null,null,null,null,null,null,null,null,null,"Commercial","Lodging","Cooling","Commercial-Lodging-Cool","Lodging Cooling",0,0.16023467005656969,0.33320054876785082,0.48336959372092037,0.62285886537118162,0.76266824439577685,0.85860310302659193,0.95065987332364643,1.0378577118056713,1.1187958984289401,1.196646526128414,1.271651723658314,1.3437472366665737,1.4137990827209421,1.481446254687409,1.5462859317763977,1.6093557598969879,1.6702013268506264,1.7294888676291305,1.7860112969660997,1.8400681949866471,1.8917708385262759,1.9412252757189632,1.9885325827360818,2.0337891073504419,2.0770867000295397,2.1185129332231409,2.1581513094736162,2.1960814589427744,2.2323793269162744,2.2671173518158536,2.3003646342205335,2.3321870973705061,2.3626476396015241,2.3918062791331591,2.419720291611251,2.4464443407830867,2.4720306026633119,2.4965288835291743,2.5199867320653939,2.5424495459616625,2.5639606732494546,2.5845615086494091,2.604291585185996,2.6231886613124158,2.6412888037757085,2.6586264664397627,2.6752796819464901,2.6912754705419442,2.7066397857810705,2.721397556637978,2.7355727279538051,2.7491882992878045,2.762266362234687,2.7748281362687686,2.7868940031730833,2.7984835401093182,2.8096155513822367,2.8203080989501155,2.8305785317307115,2.8404435137503024,2.8499190511814723,2.8590205183135153,2.8677626824975921,2.8761597281071181,2.8842252795522492,2.8919724233858202,2.8994137295365943,2.9065612717042764,2.913426646949385,2.9200209945097622]
[null,null,null,null,null,null,null,null,null,null,null,"Commercial","Lodging","Exterior Lights","Commercial-Lodging-ExtLight","Lodging Exterior Lights",0,0.12891261236883444,0.26825833162300139,0.39127617101358209,0.50562271909520318,0.61723339159044777,0.69829213862281536,0.77592143443039241,0.84981529416483292,0.91871540944009222,0.98489254639934143,1.0487657578445124,1.1096432536677201,1.1691252413074247,1.2267825434102337,1.2824231955026519,1.3363752973822736,1.388766997952555,1.4391462020179333,1.4873210824037346,1.5333713532477991,1.5773940797902186,1.6194817078809345,1.6597222936269389,1.69819972112301,1.7349939089087278,1.7701810057587102,1.8038335763792384,1.8360207775526161,1.8668085252405744,1.8962596531297307,1.9244340630754062,1.9513888678749238,1.97717852677775,2.0018549741174394,2.0254677414291948,2.0480640733969158,2.0696890379547765,2.0903856308506343,2.1101948749617851,2.1291559146377859,2.1473061053301223,2.1646810987544089,2.1813149238175087,2.1972400635293932,2.2124875281077099,2.2270869244718168,2.2411099735200413,2.2545794279895679,2.2675171423969518,2.2799441084975984,2.291880489345401,2.3033456520077791,2.3143581989892206,2.3249359984142917,2.3350962130191051,2.3448553279982742,2.3542291777525426,2.3632329715804832,2.371881318355952,2.3801882502313423,2.3881672454050915,2.3958312499903851,2.4031926990205394,2.4102635366251444,2.4170552354097041,2.4235788150702162,2.4298448602728984,2.4358635378280633,2.4416446131860163,2.4471974662817355]
[null,null,null,null,null,null,null,null,null,null,null,"Commercial","Lodging","Heating","Commercial-Lodging-Heat","Lodging Heating",0,0.13586616357632308,0.28261148718784401,0.41053650739020286,0.52742839020547894,0.64116906911822247,0.72655371702338789,0.80820091204594735,0.88606211321228912,0.95905159476049107,1.0289931351376036,1.0968263727839416,1.1612136220719591,1.2239199468752811,1.2846470881104395,1.3435845997359477,1.400691125686625,1.4566045616141496,1.5101243413669563,1.5614187526644361,1.6104513303007537,1.6573253372972736,1.7021391282422529,1.7449863929196896,1.7859563873186399,1.8251341527024758,1.8626007233797646,1.8984333237828113,1.9327055554262935,1.9654875742867297,1.9968462591136247,2.0268453711549483,2.0555457057530044,2.0830052362416573,2.1092792505522278,2.1344204809130192,2.1584792270063864,2.1815034729273561,2.2035389982690625,2.2246294836425395,2.2448166109216996,2.2641401584885568,2.2826380917388414,2.3003466490941147,2.3173004237531818,2.3335324414030971,2.3490742340981896,2.3640024760490999,2.3783413886904499,2.392114237255766,2.4053433685258803,2.4180502470871272,2.4302554901581552,2.4419789010418627,2.4532395012567387,2.4640555613997375,2.474444630790765,2.4844235659468765,2.4940085579323839,2.5032151586292493,2.512058305970394,2.5205523481768535,2.528711067038115,2.536547700273406,2.5440749630102144,2.5513050684148904,2.5582497475088064,2.564920268202223,2.571327453576747,2.5774816994460421,2.5833929912232927]
[null,null,null,null,null,null,null,null,null,null,null,"Commercial","Lodging","Hot Water","Commercial-Lodging-HotWater","Lodging Hot Water",0,0.13409377032834607,0.2700953770215439,0.38733885725738998,0.49427341556040244,0.59837785821824574,0.66935288636244017,0.73735230956567877,0.80162767886957487,0.86106891675153696,0.91813995799553538,0.97337313923677182,1.0261700133061031,1.0778249968613134,1.1277418284816294,1.1759674126088462,1.2229323266431287,1.2685569147366902,1.3129167415687406,1.3552291529351967,1.3956437099902572,1.4342488270561349,1.4711286216249022,1.5063631324517928,1.5400285261152897,1.572197292676095,1.602938431031407,1.6323176245273361,1.6603974073606076,1.6872373222708683,1.7128940699967725,1.7374216509425162,1.7608714994764991,1.7832926112602283,1.8047316639833724,1.8252331318599344,1.8448393942207733,1.863590838519076,1.8815259580478436,1.898681444651882,1.9150922767011898,1.9307918025778963,1.9458118199150156,1.9601826508121802,1.9739332132411471,1.9870910888422137,1.999682587301663,2.0117770051860635,2.0233939659817608,2.0345523184893941,2.0452701674065334,2.0555649027029883,2.0654532278364579,2.0749511868542938,2.0840741904253592,2.0928370408442101,2.1012539560481778,2.109338592686318,2.1171040682776541,2.124562982494671,2.1317274376065876,2.138609058115585,2.1452190096178394,2.1515680169199758,2.1576663814403263,2.163523997923229,2.1691503704934942,2.1745546280770744,2.179745539212969,2.1847315262803924,2.1895206791642874]
[null,null,null,null,null,null,null,null,null,null,null,"Commercial","Lodging","Interior Lights","C-Lod-Lgt-LPD Int-All-All-C","Lodging Interior Lights",0,0.13700067007254291,0.27681856677245315,0.39762017588724824,0.50833453211810165,0.616756690066533,0.6909842747744297,0.76213102576314495,0.82946210982551327,0.89177916999173046,0.9516260665469426,1.0095180551071898,1.0648730781734026,1.118944174680419,1.1712299433972957,1.2216846094144669,1.2708216561312589,1.3184924350549851,1.3648225836978893,1.4090249198985356,1.4512521812980612,1.4915959886484604,1.5301435297185337,1.5669777833427516,1.6021777316665522,1.6358185612329779,1.6679718535192596,1.6987057654977462,1.7280852007633403,1.7561719717392099,1.7830249534439009,1.8087002292759826,1.8332512292468934,1.8567288610686643,1.8791816344805683,1.9006557791774101,1.9211953566820503,1.940842366485791,1.9596368467623493,1.9776169699442741,1.9948191334347438,2.0112780457126562,2.0270268080747682,2.0420969922452614,2.0565187140705179,2.0703207035049638,2.0835303710826327,2.0962185543288809,2.108405840128754,2.1201120026490439,2.1313560354223502,2.1421561821645527,2.1525299663756776,2.162494219772205,2.1720651095969359,2.1812581648507363,2.1900883014887151,2.1985698466217278,2.2067165617624558,2.2145416651538001,2.2220578532157957,2.2292773211458661,2.2362117827058223,2.2428724892277279,2.249270247869458,2.255415439149576,2.2613180337899732,2.266987608893611,2.2724333634836,2.2776641334288397,2.2826884057804295]
[null,null,null,null,null,null,null,null,null,null,null,"Commercial","Lodging","Other","Commercial-Lodging-Misc","Lodging Other",0,0.13651063003404754,0.27527982796326711,0.39497498386948504,0.50458701215841706,0.61200454782190294,0.68508870158857182,0.7551390359556891,0.82140655183464395,0.88269301063194305,0.94155033596030135,0.99849162491480303,1.052941030463356,1.1061390738655938,1.1575826040553947,1.2072240761900801,1.2555832697033948,1.3025052709651261,1.3481298484046877,1.3916511296645901,1.4332239294450597,1.4729388370954188,1.5108820485527088,1.5471355888991312,1.5817775231704556,1.6148821560584161,1.6465202211138699,1.6767590600233511,1.7056627924994578,1.7332924772951861,1.7597062648237227,1.784959541838274,1.8091050686010888,1.8321931089468988,1.8542715536234118,1.875386037270206,1.8955800493773096,1.9148950395458066,1.9333705173549749,1.9510441471236122,1.9679518378373431,1.9841278284987047,1.9996047691426984,2.0144137977471432,2.0285846132546164,2.0421455449108774,2.0551236181134849,2.0675893497459961,2.0795629657603185,2.0910638936388342,2.1021107939159598,2.1127215904553176,2.1229134995316392,2.1327030577645862,2.1421061489498201,2.151138029830844,2.1598133548534393,2.1681461999428593,2.1761500853423597,2.1838379975501216,2.1912224103901576,2.1983153052513966,2.2051281905277769,2.2116721202908929,2.2179577122254965,2.2239951648569476,2.2297942740985679,2.2353644491457492,2.2407147277425996,2.2458537908459051,2.250789976710188]
[null,null,null,null,null,null,null,null,null,null,null,"Commercial","Lodging","Motors","Commercial-Lodging-Motors","Lodging Motors",0,0.14015091367600049,0.28379925215891588,0.40782329846337689,0.5213504494410014,0.63252479232131453,0.7088375737319873,0.78200292456741483,0.85122077002463148,0.91530672290613846,0.97684558626273166,1.0363844594415121,1.0933508237288521,1.1489494715388842,1.2026725972666452,1.2545096818495325,1.305002719318864,1.3539658026920591,1.4016178668182691,1.4470764225636119,1.4905083894628151,1.5320075394609241,1.5716631194200055,1.6095600792413796,1.6457792879968312,1.6803977387227258,1.7134887424942102,1.7451221123620295,1.7753643377018498,1.8042787494951968,1.8319256770321162,1.8583625964983055,1.8836442718836921,1.9078228886251136,1.9309481803728443,1.9530675492490854,1.974226179946162,1.994467147992937,2.013831522499828,2.0323584636756982,2.0500853153937681,2.0670476930684676,2.08327956709079,2.0988133420561526,2.1136799320059896,2.1279088318922339,2.1415281854624491,2.1546098813324086,2.1671751448709351,2.1792443635228675,2.1908371198881849,2.2019722234952517,2.2126677413197324,2.2229410270986976,2.232808749487484,2.2422869191049908,2.2513909145112985,2.2601355071597546,2.2685348853640153,2.276602677318929,2.2843519732126123,2.291795346465598,2.2989448741315144,2.305812156492399,2.312408335880435,2.3187441147566581,2.3248297730759577,2.3306751849665543,2.3362898347510099,2.3416828323347727,2.3468629279872197]
[null,null,null,null,null,null,null,null,null,null,null,"Commercial","Lodging","Office Eqpmt","Commercial-Lodging-OffEquip","Lodging Office Eqpmt",0,0.13542687535860815,0.27181463802044775,0.38914099422214771,0.4964024906065132,0.60152788311762451,0.67236808839599316,0.74026734190666199,0.80445821852115873,0.86374253717290772,0.92067338344229088,0.97577209501960216,1.0284564912394631,1.0799546713873478,1.1297566019480405,1.1778263792766714,1.2246830002297746,1.2701603123218619,1.3144156449579176,1.3566194102271871,1.3969261980696819,1.4354245951498272,1.4721988719359447,1.5073292023209972,1.540891871603471,1.5729594734675154,1.6036010965653493,1.6328825012709156,1.6608662871417037,1.6876120515954447,1.713176540279906,1.7376137895871793,1.7609752617385568,1.7833099728422479,1.8046646143037131,1.8250836679472002,1.8446095151870952,1.8632825405688576,1.8811412299815589,1.8982222638272832,1.9145606054168665,1.9301895848465453,1.9451409785960392,1.9594450850753407,1.9731307963349818,1.9862256661427442,1.998755974618672,2.0107916181456416,2.0223521248471776,2.0334562519257831,2.0441220160969533,2.0543667228217353,2.0642069943852563,2.0736587968667868,2.082737466045089,2.0914577322810914,2.0998337444182562,2.1078790927394211,2.1156068310173626,2.1230294976948589,2.1301591362286181,2.1370073146300772,2.1435851442347826,2.1499032977308019,2.1559720264754176,2.1618011771282037,2.1674002076274701,2.1727782025359961,2.177943887780954,2.1829056448119384,2.1876715242000713]
[null,null,null,null,null,null,null,null,null,null,null,"Commercial","Lodging","Process","Commercial-Lodging-Misc","Lodging Process",0,0.13651063003404754,0.27527982796326711,0.39497498386948504,0.50458701215841706,0.61200454782190294,0.68508870158857182,0.7551390359556891,0.82140655183464395,0.88269301063194305,0.94155033596030135,0.99849162491480303,1.052941030463356,1.1061390738655938,1.1575826040553947,1.2072240761900801,1.2555832697033948,1.3025052709651261,1.3481298484046877,1.3916511296645901,1.4332239294450597,1.4729388370954188,1.5108820485527088,1.5471355888991312,1.5817775231704556,1.6148821560584161,1.6465202211138699,1.6767590600233511,1.7056627924994578,1.7332924772951861,1.7597062648237227,1.784959541838274,1.8091050686010888,1.8321931089468988,1.8542715536234118,1.875386037270206,1.8955800493773096,1.9148950395458066,1.9333705173549749,1.9510441471236122,1.9679518378373431,1.9841278284987047,1.9996047691426984,2.0144137977471432,2.0285846132546164,2.0421455449108774,2.0551236181134849,2.0675893497459961,2.0795629657603185,2.0910638936388342,2.1021107939159598,2.1127215904553176,2.1229134995316392,2.1327030577645862,2.1421061489498201,2.151138029830844,2.1598133548534393,2.1681461999428593,2.1761500853423597,2.1838379975501216,2.1912224103901576,2.1983153052513966,2.2051281905277769,2.2116721202908929,2.2179577122254965,2.2239951648569476,2.2297942740985679,2.2353644491457492,2.2407147277425996,2.2458537908459051,2.250789976710188]
[null,null,null,null,null,null,null,null,null,null,null,"Commercial","Lodging","Refrigeration","Commercial-Lodging-Refrig","Lodging Refrigeration",0,0.13182946440345816,0.26382641658442058,0.37748473633728141,0.48156702944507007,0.58359367762751946,0.6520706909709324,0.71768292166354608,0.77973526569109641,0.83701550758579513,0.89203053748895478,0.94525900910102645,0.99611606889472659,1.0458845024100798,1.0940591318617232,1.1405605392936946,1.1858750339126556,1.2298815745557734,1.27263170592649,1.3134035860670863,1.3523374066476592,1.3895192830204883,1.4250311207434674,1.458950830462826,1.4913525313757203,1.5223067439011468,1.5518805721520732,1.5801378767681571,1.6071394386368549,1.6329431140009603,1.657603981422578,1.6811744810471134,1.7037045465859506,1.7252417304130243,1.7458313221483619,1.7655164610808147,1.7843382427625458,1.8023358200892885,1.81954649916293,1.8360058302164868,1.8517476938659991,1.8668043829392222,1.8812066801171667,1.8949839316115122,1.9081641170886114,1.9207739160392197,1.9328387707821268,1.9444273355145321,1.9555584129637738,1.9662500635729769,1.9765196348045622,1.9863837892869225,1.9958585318499424,2.0049592354932235,2.0137006663291479,2.0220970075412548,2.0301618823967988,2.0379083763508321,2.0453490582776723,2.0524960008642061,2.0593608001981161,2.0659545945828151,2.0722880826096124,2.0783715405164394,2.0842148388612927,2.0898274585374557,2.0952185061564772,2.1003967288238687,2.105370528331497,2.110147974789693,2.114736819721204]
[null,null,null,null,null,null,null,null,null,null,null,"Commercial","Lodging","Ventilation","Commercial-Lodging-Vent","Lodging Ventilation",0,0.13256296584953928,0.26575826623920656,0.38052743046052806,0.4857602352960857,0.5890898533662533,0.65854871855847419,0.72509954713064473,0.78805963503574428,0.84620255926682431,0.90205243492823139,0.95607092160827034,1.0076887097940022,1.0581867768280697,1.107072121507914,1.1542392808803892,1.2001907563130567,1.2448092256385519,1.2881341950935064,1.3294570935958128,1.3689202948384027,1.4066107624380644,1.4426112170472463,1.4770003525287392,1.5098530406602124,1.5412405249989802,1.5712306045017324,1.5998878074603802,1.6272735562835225,1.6534463236232193,1.6784617803186577,1.7023729356018107,1.7252302699852289,1.7470818612285735,1.7679735037583237,1.7879488218941839,1.8070493772160017,1.825314770386427,1.8427827377270207,1.8594892428289931,1.8754685634641781,1.8907533740471449,1.9053748238855004,1.9193626114423503,1.932745054822566,1.9455491586828619,1.9578006777547206,1.9695685377795582,1.9808718323956733,1.991728901472722,2.0021573608685999,2.0121741310116006,2.0217954643542195,2.0310369717431533,2.0399136477482767,2.0484398949916955,2.056629547516351,2.0644958932320896,2.072051695475619,2.0793092137193319,2.0862802234625968,2.0929760353377906,2.0994075134620767,2.1055850930646951,2.1115187974183773,2.1172182541023483,2.122692710623308,2.1279510494197345,2.1330018022738564,2.1378531641546767,2.1425130065145077]
[null,null,null,null,null,null,null,null,null,null,null,"Commercial","Large Office","Compressed Air","Commercial-large Office-AirComp","Large Office Compressed Air",0,0.13988028447360212,0.28120001210087325,0.40246743924807454,0.51299248501301553,0.62127356536664868,0.69420166083845558,0.76412868977369219,0.8301688885124372,0.89115501132345298,0.94970916437292241,1.0064032147032809,1.060675964650331,1.1136692909840391,1.1648486385770731,1.2142468177201764,1.262428270473906,1.3091580042542572,1.3547627760011594,1.3982390627661185,1.4397650701671409,1.4794316775765448,1.5173253461156058,1.5535283430095685,1.5881189540728662,1.6211716849753717,1.6527574519037609,1.6829437621974679,1.7117948855060801,1.7393720159842909,1.7657334260115567,1.7909346118962903,1.8150284319986953,1.8380652376820761,1.8600929974795901,1.8811574148418406,1.9013020398103815,1.9205683749430322,1.9389959757988249,1.9566225462733544,1.973484029059231,1.9896146914911601,2.0050472070208829,2.0198127325537003,2.0339409818655945,2.0474602953079293,2.0603977059953982,2.0728243803662254,2.084760481000965,2.0962253745123851,2.1072376629682683,2.1178152140737181,2.1279751901619415,2.1377340760405539,2.1471077057385775,2.1561112881975379,2.1647594319483403,2.1730661688139654,2.1810449766764428,2.1887088013450406,2.1960700775611568,2.2031407491739854,2.2099322885197048,2.2164557150356199,2.2227216131394671,2.2287401494028876,2.2345210890469378,2.2400738117863961,2.2454073270485786,2.250530288591353,2.2554510085440711]
[null,null,null,null,null,null,null,null,null,null,null,"Commercial","Large Office","Cooking","Commercial-large Office-Cook","Large Office Cooking",0,0.14574321055276768,0.29440996016085563,0.42188452870967891,0.53783379172755241,0.65136856030618584,0.72833859600020145,0.80217253426671808,0.87186613145674641,0.93628028783620121,0.99811602455240922,1.0580000454391121,1.1153952976043258,1.171352640651371,1.225319905405164,1.2774016538871835,1.3282148964590021,1.3774526033557395,1.4256170468198601,1.4715281718255007,1.5153894416745368,1.5572958783940589,1.5973379092836084,1.6356015990262014,1.6721688695752805,1.7071177084853317,1.7405223663163183,1.7724535437066744,1.8029785686762174,1.8321615646888803,1.8600636099755161,1.8867428885890618,1.9122548336380103,1.9366522631192824,1.9599855087481735,1.9823025381609585,2.0036490708449111,2.0240686881308498,2.043602937564799,2.0622914319578833,2.0801719433970822,2.097280492483939,2.1136514330536365,2.129317532613022,2.1443100487231015,2.1586588015392043,2.1723922427103877,2.1855835222908153,2.1982540434515379,2.210424364420438,2.2221142318384581,2.2333426127989995,2.2441277256224956,2.2544870694160752,2.2644374524662911,2.2739950195109704,2.2831752779344456,2.2919931229286581,2.3004628616609724,2.3085982364879003,2.3164124472524072,2.3239181727009774,2.3311275910551896,2.3380523997711746,2.3447038345190232,2.3510926874129319,2.357229324521672,2.3631237026877843,2.3687853856828021,2.3742235597246975,2.379447048382747]
[null,null,null,null,null,null,null,null,null,null,null,"Commercial","Large Office","Cooling","Commercial-large Office-Cool","Large Office Cooling",0,0.1591967923870391,0.32849335136037816,0.47469426842120743,0.60977748092188255,0.74468190024076109,0.83658873423296931,0.92477694089572837,1.0082045084397973,1.0855142388114924,1.1598497891406185,1.2315713325032227,1.3004907666309864,1.3674694543060508,1.4321195379165961,1.494146664746369,1.5545595400806993,1.6128540469985644,1.6697758001958309,1.7240359538295242,1.7759184221733659,1.825531095706787,1.872976765234533,1.9183533738027205,1.9617542556144509,2.0032683626431353,2.042980479602901,2.0809714278989024,2.1173182591458746,2.1520944388107588,2.1853700205045499,2.2172118114196007,2.2476835293813195,2.2768459519574513,2.3047570580438479,2.3314721623227186,2.3570440429677033,2.3815230629497299,2.4049572852783325,2.4273925824949378,2.4488727407174524,2.4694395585193014,2.4891329409107494,2.5079909886759095,2.526050083305198,2.543344967750119,2.5599088232150913,2.5758187794776721,2.5911006508277636,2.6057792324722664,2.6198783407659008,2.6334208518538218,2.6464287387887184,2.6589231071826256,2.6709242294512907,2.6824515777066598,2.6935238553508523,2.7041590274228846,2.7143743497473802,2.724186396932565,2.7336110892629697,2.7426637185304799,2.7513589728456367,2.7597109604694552,2.7677332327044168,2.7754388058817878,2.7828401824809346,2.7899493714148949,2.796777907515136,2.8033368702470933,2.8096369016868756]
[null,null,null,null,null,null,null,null,null,null,null,"Commercial","Large Office","Exterior Lights","Commercial-large Office-ExtLight","Large Office Exterior Lights",0,0.12879006743199214,0.26638566844963807,0.38747964617819269,0.49985144418368166,0.60960539908856437,0.68849359048675263,0.76404331328788111,0.83590634376542361,0.9028293263106314,0.96711004024080993,1.0291676040433357,1.0883226799831807,1.1461414004245802,1.2021869164211465,1.2562732640170373,1.3087471950073279,1.3597092946028808,1.4087593741687596,1.4556495956855242,1.5004654506016246,1.5433020514829878,1.5842499666344054,1.6233954469033705,1.6608206406720991,1.6966037976768278,1.7308194622577697,1.7635386566094706,1.7948290545695809,1.8247551464541405,1.8533783954192715,1.8807573858025755,1.9069479638724414,1.9320033713898186,1.9559743723646901,1.9789093733684278,2.0008545377433649,2.0218538940321711,2.0419494389319564,2.0611812350613339,2.0795875038129465,2.0972047135491017,2.1140676633841409,2.1302095627839353,2.1456621072004158,2.1604555499472382,2.1746187705115729,2.1882228628795826,2.2012899000210768,2.2138410835207352,2.2258967779781922,2.2374765440500939,2.2485991701877386,2.2592827031217935,2.2695444771435538,2.2794011422302511,2.2888686910600438,2.2979624849605269,2.3066972788328566,2.3150872450919384,2.3231459966615109,2.3308866090614462,2.3383216416230974,2.3454631578671195,2.3523227450768225,2.3589115330988215,2.3652402124014813,2.371319051420461,2.3771579132195,2.3827662714934785,2.3881532259397167]
[null,null,null,null,null,null,null,null,null,null,null,"Commercial","Large Office","Heating","Commercial-large Office-Heat","Large Office Heating",0,0.13685181796835966,0.28082839575887208,0.40588730259938594,0.51994607792127112,0.63048126058211096,0.70960677292229746,0.78542991559869679,0.85733970819626648,0.92426523685888928,0.98845031602017663,1.0506189976718054,1.1099503182468535,1.1678489496235822,1.2237820815935163,1.2779347352738877,1.3305734411997205,1.381791420843441,1.43140723444796,1.4788138766394909,1.5241146902100506,1.5674066851202615,1.6087822130596068,1.6483292010983133,1.6861313731156138,1.7222684596682882,1.7568163969261728,1.7898475152662876,1.8214307180841709,1.8516316513498667,1.8805128644066262,1.9081339624826992,1.9345517513604726,1.9598203746225833,1.9839914438714152,2.0071141622964794,2.0292354419435212,2.0504000150197035,2.0706505395508379,2.090027699689287,2.1085703009547885,2.1263153606750325,2.1432981938782185,2.159552494876102,2.1751104147630347,2.1900026350442645,2.2042584375951964,2.2179514570466727,2.2311039106548529,2.2437371385947049,2.2558716385849578,2.2675270991461458,2.2787224315457117,2.2894758004819962,2.2998046535569019,2.3097257495850507,2.3192551857853667,2.3284084238992042,2.3372003152773977,2.3456451249769401,2.3537565549063824,2.3615477660575133,2.369031399859387,2.3762195986893495,2.3831240255743387,2.3897558831144301,2.3961259316593262,2.4022445067672855,2.4081215359748152,2.4137665549043414,2.4191887227359872]
[null,null,null,null,null,null,null,null,null,null,null,"Commercial","Large Office","Hot Water","Commercial-large Office-HotWater","Large Office Hot Water",0,0.13419732157423681,0.2705555380414903,0.38804793496928353,0.49526291268939038,0.59983150206875646,0.67107614827818995,0.73933462377821324,0.80386710552660379,0.86356458278956461,0.92087767637430951,0.97634994337303527,1.0293664934205506,1.0812234159299208,1.1313508218317223,1.1797742966319227,1.2269310079478812,1.2727529610564374,1.3172897160612074,1.3597752575804831,1.4003547487679213,1.4391170075610458,1.4761465343773748,1.5115237313091041,1.545325109723982,1.5776234869078929,1.6084881723488116,1.6379851442279876,1.6661772166523856,1.6931241981323941,1.7188830417805236,1.7435079876801667,1.767050697848356,1.7895603841927696,1.8110839298409027,1.8316660041982695,1.8513491720726485,1.870173997182663,1.8881791403513462,1.9054014526686818,1.921876063891423,1.9376364663336794,1.9527145944877933,1.9671409006018534,1.9809444264277636,1.9941528713420518,2.0067926570305414,2.0189334558860685,2.0305949666492302,2.0417961104040674,2.052555061277987,2.0628892759297206,2.0728155218731774,2.0823499046831451,2.0915078941269716,2.1003043492646394,2.1087535425579524,2.1168691830279487,2.124664438498121,2.1321519569595289,2.139343887092473,2.1462518979780212,2.1528871980313764,2.1592605531878029,2.1653823043706151,2.1712623842695802,2.1769103334569446,2.1823353158672458,2.1875461336660176,2.1925512415315169,2.1973587603726457]
[null,null,null,null,null,null,null,null,null,null,null,"Commercial","Large Office","Interior Lights","C-LOff-Lgt-LPD Int-All-All-C","Large Office Interior Lights",0,0.14086722897924722,0.28509662776109357,0.40932900315854787,0.5228057457872457,0.63389864445708943,0.70973908086460014,0.7824550250819623,0.85119315187666178,0.91478770431263101,0.97585184640519729,1.0349453281822469,1.091512287741311,1.1467185097348456,1.200034074977995,1.2514822282051683,1.301620296104707,1.350235315967887,1.3976184647856771,1.4428080383245847,1.4859805214311739,1.5272293807974628,1.5666435657782234,1.6043077364718714,1.6403024797957815,1.674704514211512,1.7075868837185626,1.7390191417005236,1.7690675251747316,1.7977951199656605,1.8252620172931926,1.8515254622394612,1.8766399945321148,1.9006575820574514,1.923627747493895,1.9455976884345996,1.9666123913475264,1.9867147397020637,2.0059456165730687,2.0243440020160666,2.0419470654911631,2.0587902535979632,2.0749073733693928,2.0903306713587373,2.1050909087413818,2.1192174326406619,2.1327382438757994,2.1457252876133253,2.1581996356466799,2.1701815279080905,2.1816904053083506,2.1927449412801687,2.2033630720762671,2.2135620258713864,2.223358350715416,2.2327679413830075,2.2418060651632317,2.2504873866311255,2.2588259914413205,2.2668354091823586,2.274528635328779,2.2819181523265892,2.2890159498463376,2.2958335442366451,2.302381997209757,2.3086719337894444,2.3147135595503578,2.3205166771768235,2.3260907023679347,2.3314446791147514,2.3365872943743966]
[null,null,null,null,null,null,null,null,null,null,null,"Commercial","Large Office","Other","Commercial-large Office-Misc","Large Office Other",0,0.13589079548904201,0.27282321199918735,0.3905699270960612,0.49814957558111217,0.60355360680751158,0.67454802364087818,0.74259577090752082,0.80691172546840551,0.86630714346107929,0.92334375904415844,0.9785468496929266,1.0313407448350471,1.0829434089599912,1.1328342216288039,1.1809901682697517,1.227934649756748,1.2734935703418584,1.3178493560034481,1.3601458295695072,1.4005414205240869,1.4391248854032175,1.4759806568533922,1.5111890636173928,1.5448265388620555,1.576965817488045,1.6076761230255485,1.6370233446857196,1.6650702051055954,1.6918764192939548,1.7174988452570601,1.7419916267563611,1.7654063286248982,1.7877920650452643,1.8091956211694853,1.8296615684399433,1.8492323739504755,1.8679485041679105,1.8858485233165159,1.9029691867110654,1.9193455293084074,1.9350109497325096,1.9499972900138673,1.9643349112709116,1.9780527655485109,1.9911784640168644,2.0037383417229293,2.0158023871614703,2.027390174538803,2.0385205053209878,2.0492114387396652,2.0594803210935959,2.0693438138934526,2.0788179208955242,2.0879180140681983,2.0966588585333548,2.1050546365231315,2.1131189703909414,2.1208649447140706,2.1283051275237233,2.1354515906969556,2.1423159295435914,2.1489092816198916,2.1552423447995088,2.1613253946310502,2.1671683010104004,2.1727805441948687,2.178171230185137,2.1833491054999659,2.1883225713676335,2.1930996973571331]
[null,null,null,null,null,null,null,null,null,null,null,"Commercial","Large Office","Motors","Commercial-large Office-Motors","Large Office Motors",0,0.14177634463456756,0.28562894574400138,0.40905992266832619,0.52149508521866095,0.63162469026869461,0.70600864774535754,0.7773403557814792,0.84469855648101333,0.90692440693222398,0.9666671581053452,1.0245143860216033,1.0799125120749871,1.133976332011426,1.1861656374826541,1.2365345204204754,1.2856655956429555,1.3333012253485077,1.3798225690056081,1.4241719460959408,1.4665355676767868,1.5070057755963722,1.5456704319233314,1.5826131459624362,1.6179134892813616,1.6516471994048785,1.6838863727958464,1.7146996477075194,1.7441523774588084,1.7723067946531708,1.7992221668326125,1.8249549440307622,1.8495588986630525,1.8730852581675788,1.8955828307871663,1.9170981248614307,1.9376754619771357,1.9573570843058157,1.9761832564394175,1.9941923620175197,2.0114209954234892,2.0279040488116284,2.0436747947129623,2.0587649644536903,2.0732048226075004,2.0870232376908326,2.100247749298731,2.1129501905703649,2.1251511715247733,2.1368704885494663,2.1481271565205482,2.1589394396548118,2.1693248811438752,2.1793003316184336,2.1888819764888194,2.1980853622062204,2.2069254214871736,2.2154164975422632,2.2235723673483232,2.2314062640019205,2.2389308981903726,2.2461584788151465,2.2531007328010979,2.2597689241236907,2.2661738720850706,2.2723259688686457,2.2782351964006553,2.2839111425460876,2.2893630166652232,2.294599664556046,2.2996295828067645]
[null,null,null,null,null,null,null,null,null,null,null,"Commercial","Large Office","Office Eqpmt","Commercial-large Office-OffEquip","Large Office Office Eqpmt",0,0.13472600919416566,0.27022189433991117,0.38677181192470361,0.49331070420571527,0.59769297734080173,0.66793559739511743,0.73525594981470299,0.79889419482739543,0.85765772779478844,0.91408971048329635,0.96870282632576854,1.0209189491363155,1.07197485222624,1.1213518717096735,1.1690143550465688,1.2154721103077646,1.2605697069038835,1.3044501974867906,1.3462951988265226,1.38625785272332,1.4244261403215519,1.4608837521568361,1.495710306665051,1.5289815571015193,1.5607695875071408,1.5911429983222456,1.6201670822150314,1.6479039906594788,1.674412891767536,1.699750119851964,1.7239693171695039,1.7471215682688013,1.76925552734377,1.7904175389706676,1.8106517525860459,1.8300002310428263,1.8485030535629796,1.8661984133875928,1.8831227104084145,1.8993106390492314,1.9147952716505885,1.9296081375973586,1.9437792984154718,1.9573374190516459,1.9703098355382225,1.9827226192341121,1.9946453775626967,2.0060974554885296,2.017097434285795,2.0276631616868759,2.0378117808407334,2.0475597581280809,2.0569229098784865,2.065916428032752,2.0745549047922038,2.0828523562948953,2.090822245357129,2.0984775033172034,2.1058305510168234,2.1128933189542165,2.1196772666416561,2.1261934011987971,2.1324522952119955,2.1384641038885861,2.1442385815339522,2.149785097378123,2.1551126507775762,2.1602298858169124,2.1651451053340929,2.1698662843919934]
[null,null,null,null,null,null,null,null,null,null,null,"Commercial","Large Office","Process","Commercial-large Office-Process","Large Office Process",0,0.13469927367949755,0.27092971353850359,0.38833411645468413,0.49578906097479408,0.60104239164370887,0.67230244778293502,0.74059461612271027,0.80518244610581224,0.86487284996561864,0.92219653482862829,0.97765938569228839,1.0306807012880932,1.0825159281746353,1.1326530445969019,1.1810443382144531,1.2281927358881519,1.2739557835079391,1.3184488330450579,1.3608867805120417,1.4014196152016796,1.4401361776415913,1.4771209862265609,1.5124544568255496,1.546213110764459,1.578469771822238,1.6092937528419191,1.638751032524264,1.666904422939727,1.693813728264328,1.7195358952166386,1.7441251556463255,1.7676331616994798,1.7901091139621854,1.8115998829613658,1.832150124380826,1.8518023883304799,1.8705972229879726,1.8885732729141944,1.9057673723274822,1.9222146336055468,1.9379485312693123,1.953000981688835,1.9674024187382522,1.9811818656142395,1.9943670030206855,2.0069842339111972,2.0191033683752369,2.0307440700024002,2.0419252261134013,2.0526649784052093,2.0629807523863906,2.0728892856504202,2.0824066550328326,2.0915483026962778,2.1003290611858034,2.1087631774950202,2.1168643361821942,2.124645681573774,2.1321198390913803,2.1392989357368575,2.1461946197686288,2.1528180796012784,2.1591800619590247,2.1652908893125407,2.1711604766274157,2.1767983474514243,2.1822136493667146,2.1874151688319818,2.1924113454387126,2.1972102856046245]
[null,null,null,null,null,null,null,null,null,null,null,"Commercial","Large Office","Refrigeration","Commercial-large Office-Refrig","Large Office Refrigeration",0,0.13131252079649702,0.26261772393437094,0.37567409023844367,0.47921395488894275,0.58071135040036392,0.64875229067361762,0.71394287507834142,0.77559636674873278,0.8324999946146644,0.88715449222075748,0.94003212429618155,0.99054903554772855,1.0399946126891879,1.0878622753748848,1.1340681464093745,1.1790937142820694,1.2228250760072277,1.2652999798744009,1.3058089462894125,1.3444905187101523,1.3814303740913878,1.4167099979524043,1.4504068984711085,1.4825948091930103,1.5133438809819211,1.5427208638037215,1.5707892789011075,1.5976095818857168,1.6232393172443511,1.6477332647280363,1.671143578066292,1.6935199164241437,1.7149095689959841,1.7353575731083233,1.7549068261826561,1.7735981918900654,1.7914706008106818,1.8085611458936919,1.8249051729971457,1.8405363667713117,1.8554868321347133,1.8697871715781937,1.8834665585193522,1.8965528069174322,1.9090724373471764,1.9210507397192407,1.932556168949924,1.9436073928771962,1.954222342379907,1.9644182404710713,1.9742116302426245,1.9836184017069924,1.9926538175790198,2.001332538040097,2.0096686445246585,2.0176756625676533,2.0253665837500514,2.0327538867780008,2.0398495577298301,2.0466651095037509,2.0532116004978156,2.0594996525524358,2.0655394681845753,2.0713408471415815,2.0769132023015144,2.0822655749457684,2.0874066494287709,2.0923447672685582,2.0970879406810905,2.1016438655802667]
[null,null,null,null,null,null,null,null,null,null,null,"Commercial","Large Office","Ventilation","Commercial-large Office-Vent","Large Office Ventilation",0,0.1393298833014702,0.2810740096035268,0.40308418542080476,0.51468141232838249,0.62424120676803074,0.69846492544709515,0.76961540799500572,0.83688191128479605,0.89906959765090511,0.95879503918468467,1.0165772935214741,1.0718714279870249,1.1258634067213122,1.1780393772222186,1.2283676468909244,1.2774149592776138,1.3249854713936771,1.3713109201618736,1.4154883314032591,1.4576896456652022,1.4980066495702493,1.536526682432658,1.5733328613515882,1.6085042944301429,1.6421162827697462,1.6742405118527566,1.7049452328917334,1.7342954346912798,1.762353006537756,1.7891768926032894,1.8148232383233014,1.8393455291811118,1.8627947223090044,1.8852193712923406,1.9066657445418029,1.9271779375785865,1.9467979795582424,1.9655659343408436,1.983519996398148,2.0006965818323983,2.0171304147662634,2.0328546093491648,2.0479007476117643,2.0622989533876899,2.0760779625095855,2.0892651894752685,2.1019318180082456,2.1140984000205183,2.12578467608648,2.1370096074724771,2.1477914069019239,2.1581475681058877,2.1680948942070923,2.1776495249833911,2.1868269630549491,2.1956420990376189,2.2041092357033278,2.2122421111866721,2.2200539212753703,2.2275573408207534,2.2347645443030153,2.2416872255846041,2.2483366168837962,2.2547235069992433,2.2608582588150603,2.2667508261148557,2.2724107697319869,2.2778472730622443,2.2830691569641348,2.2880848940709351]
[null,null,null,null,null,null,null,null,null,null,null,"Commercial","Other","Compressed Air","Commercial-Misc. Com-AirComp","Other Compressed Air",0,0.14154144204979222,0.28485946817482427,0.4078400152493149,0.51988100582958063,0.62963488982328286,0.7036892592023184,0.77470783130707244,0.84176747853992329,0.90371223326741978,0.96318212015546212,1.0207641058169916,1.0759093050850408,1.1297325652653376,1.1816919096964276,1.2318400236980109,1.2807542760022073,1.328180347099454,1.374497700136615,1.4186503938849826,1.4608251945534168,1.5011141280222942,1.5396047531899639,1.5763803884641914,1.6115203262864697,1.645100036344658,1.6771913580924369,1.7078626831592354,1.7371791282014644,1.7652026987149525,1.7919924442993196,1.8176046058375444,1.8420927550280706,1.8655079266823853,1.8878987441779607,1.9093115384347656,1.9297904607630678,1.9493775899109558,1.9681130336218104,1.986035024994788,2.0031800139251885,2.0195827538863167,2.0352763843000368,2.0502925087296311,2.0646612691157618,2.0784114162642253,2.0915703767827929,2.1042098547566357,2.116350358045314,2.1280115849098595,2.1392124559736816,2.1499711449217385,2.1603051079877815,2.170231112277516,2.1797652629736399,2.1889230294668911,2.1977192704555102,2.2061682580538378,2.214283700949168,2.2220787666444228,2.2295661028227483,2.2367578578686858,2.2436657005792204,2.250300839096687,2.2566740390942539,2.2627956412434873,2.2686755779923424,2.2743233896808022,2.2797482400203082,2.2849589309621061,2.2899639169786252]
[null,null,null,null,null,null,null,null,null,null,null,"Commercial","Other","Cooking","Commercial-Misc. Com-Cook","Other Cooking",0,0.13958831664990645,0.28128823955497617,0.40308186068711604,0.51421618452359386,0.62308634049103573,0.69679183945140943,0.7674617925488415,0.83423735039281255,0.89594878177946879,0.9552001452951715,1.0125599358044888,1.0674560839066134,1.1210548577676274,1.1728292657201935,1.2227979681240011,1.2715156239369865,1.318768900756262,1.3648425231608143,1.4087738656504176,1.4507375382922987,1.4908250712416053,1.5291235529197504,1.5657158551607426,1.6006808464647972,1.6340935940104475,1.6660255550396497,1.6965447581957862,1.7257159753618516,1.7536008845153863,1.7802582240877483,1.8057439392880192,1.8301113208261053,1.8534111364453247,1.8756917556519159,1.896999268007322,1.9173775953287815,1.9368685981245841,1.9555121765722603,1.9733463663309303,1.9904074294629523,2.0067299407248349,2.0223468694730764,2.0372896574170878,2.0515882924386206,2.0652713786851051,2.0783662031329619,2.0909440769662697,2.1030254080903767,2.1146297987580427,2.1257760773745691,2.1364823290473449,2.1467659249293694,2.1566435504043713,2.1661312321592474,2.1752443641877526,2.1839977327676245,2.192405540451682,2.2004814291118082,2.2082385020732205,2.215689345374932,2.2228460481909074,2.2297202224450383,2.236323021651772,2.2426651590129607,2.2487569248002903,2.2546082030514953,2.2602284876074505,2.265626897516158,2.270812191828623,2.2757927838106276]
[null,null,null,null,null,null,null,null,null,null,null,"Commercial","Other","Cooling","Commercial-Misc. Com-Cool","Other Cooling",0,0.17284428779190739,0.36123317234076674,0.52426699369994378,0.67582398571007707,0.82875366522565652,0.93331505570737627,1.0336780325769719,1.1286956035049402,1.216920309852539,1.3017993543226993,1.3835489948293149,1.4622634879814049,1.5385887009690749,1.6122538303662888,1.6827432935861997,1.7513180267747455,1.8173751752657665,1.8818759454998146,1.9433600562325664,2.0021797421706897,2.058454330331728,2.1122975885611566,2.1638179961127633,2.2131190004583376,2.2602992610573245,2.305452880776909,2.3486696256150856,2.3900351333435128,2.4296311116531912,2.4675355263541756,2.5038227801504673,2.538563882482876,2.5718266109058709,2.6036756644391752,2.6341728093109924,2.663377017487238,2.6913445983598954,2.7181293239475144,2.7437825479419216,2.768353318917304,2.7918884880009052,2.8144328112885955,2.8360290472734859,2.8567180495414886,2.8765388549742532,2.8955287676871686,2.9137690065815254,2.9312891668873147,2.9481176754895522,2.9642818370515895,2.9798078783175939,2.9947209906660759,3.0090453709835114,3.0228042609243775,3.0360199846212996,3.0487139849065001,3.0609068581033116,3.0726183874442121,3.0838675751695992,3.0946726733593861,3.1050512135474437,3.1150200351669399,3.1245953128727288,3.1337925827851181,3.1426267676976041,3.1511122012894646,3.1592626513825013,3.1670913422796647,3.174610976221806,3.1818337539973713]
[null,null,null,null,null,null,null,null,null,null,null,"Commercial","Other","Exterior Lights","Commercial-Misc. Com-ExtLight","Other Exterior Lights",0,0.13659619786549365,0.28757129280353416,0.42101717168491815,0.54497192169530817,0.66590076069961013,0.75499276552784234,0.84035306610174121,0.92159259497785839,0.99747249411427341,1.0703528255060917,1.140699100891452,1.2078351861118084,1.2732954755265666,1.3366571190198608,1.3977715976485761,1.4570318304896965,1.5144990247033001,1.5698712033065758,1.6228245105228316,1.6734622391337872,1.7218891368895017,1.7682050200573074,1.8125050159283376,1.8548797928670491,1.89541577856983,1.9341953671619281,1.9712971157271832,2.0067959308322534,2.0407632455761107,2.0732671876663935,2.1043727389966906,2.1341418871728628,2.1626337694119888,2.1899048092144193,2.2160088461875822,2.2409972593795979,2.2649190844613121,2.2878211250770075,2.3097480586667265,2.3307425370467829,2.3508452820195873,2.3700951762693347,2.3885293497863187,2.4061832620496335,2.4230907801857349,2.4392842533087178,2.4548384489892316,2.4697786042870069,2.4841289599663607,2.4979127998274246,2.5111524884846754,2.5238695076540645,2.5360844910076223,2.5478172576520923,2.5590868442859125,2.5699115360867193,2.5803088963794933,2.5902957951334784,2.5998884363341173,2.6091023842744101,2.6179525888083579,2.6264534096074623,2.6346186394596423,2.6424615266483658,2.6499947964483113,2.6572306717724352,2.6641808930039441,2.6708567370453511,2.6772690356155242,2.6834281928244121]
[null,null,null,null,null,null,null,null,null,null,null,"Commercial","Other","Heating","Commercial-Misc. Com-Heat","Other Heating",0,0.14783367419337404,0.31833388683821479,0.46854785380348984,0.60568876566222885,0.73820240400887815,0.84161169327328222,0.94060438116953771,1.0350318792051674,1.1239513200319209,1.2091300229458806,1.2915818357013098,1.3701245462142901,1.4464699021724361,1.5201414264342832,1.5916067565977754,1.6606976333332737,1.7281895897626345,1.7929984244435528,1.8550954249493645,1.9144997098236021,1.9713318201946066,2.0257066904076035,2.077733920209285,2.1275180331256238,2.1751587217629194,2.2207510807220294,2.2643858277780247,2.3061495139418491,2.3461247229869637,2.384390260992213,2.421021336422212,2.4560897312382628,2.489663963506147,2.5218094419419086,2.552588612812988,2.5820610995895619,2.6102838357197649,2.6373111908823978,2.6631950910518256,2.687985132691876,2.7117286913786587,2.7344710251362749,2.7562553727543055,2.7771230473417061,2.7971135253582848,2.8162645313522097,2.8346595039714826,2.8523282895053144,2.8692995559867596,2.8856008397072905,2.9012585898951024,2.9162982116296252,2.9307441070618823,2.9446197150075717,2.9579475489771125,2.9707492337043639,2.9830455402332765,2.9948564196194192,3.0062010353010464,3.0170977941922459,3.0275643765485993,3.0376177646538274,3.0472742703739581,3.0565495616237235,3.0654586877881318,3.0740161041404592,3.0822356952962831,3.0901307977416037,3.0977142214716205,3.1049982707752579]
[null,null,null,null,null,null,null,null,null,null,null,"Commercial","Other","Hot Water","Commercial-Misc. Com-HotWater","Other Hot Water",0,0.13626988544200502,0.27605971755288494,0.39655271579972717,0.50640351587901133,0.61342780706245159,0.68681754598409217,0.75714090239353804,0.8236172128416267,0.88516458638219864,0.94425018855620779,1.0014437510616583,1.0561281363247441,1.1095757548078915,1.1612090229362897,1.2110887392211074,1.2596592897081731,1.3068417987454051,1.3527327611639532,1.3965125815904624,1.4383344726227978,1.478289347856123,1.5164637177431672,1.5529399123447212,1.5877962923352709,1.621107448905909,1.6529443931704857,1.683374735646894,1.7124628563532598,1.7402700660285464,1.7668547589585377,1.7922725578612837,1.8165764512607272,1.8398169237533304,1.8620420795499917,1.8832977596542784,1.9036276530179836,1.9230734019961011,1.9416747024055094,1.9594693984748317,1.9764935729571049,1.992781632661917,2.0083663896495798,2.0232791383165849,2.0375497285890374,2.0512066354289118,2.0642770248467888,2.0768314282834202,2.0888902155628664,2.1004729523599521,2.1115984319460495,2.122284705681615,2.1325491123049609,2.1424083060647785,2.1518782837420596,2.1609744106052635,2.1697114453408353,2.1781035639995343,2.1861643829974202,2.1939069812088179,2.2013439211871075,2.2084872695477742,2.2153486165467817,2.2219390948860451,2.2282693977765105,2.2343497962881473,2.2401901560150108,2.245799953082404,2.2511882895221245,2.2563639080407305,2.2613352062047936]
[null,null,null,null,null,null,null,null,null,null,null,"Commercial","Other","Interior Lights","C-Oth-Lgt-LPD Int-All-All-C","Other Interior Lights",0,0.14052547418437897,0.28367124131977722,0.40674169210188743,0.51902353200113982,0.62898089437022797,0.70362083503413708,0.77519016156841103,0.84281469770574979,0.90532796385065062,0.96534809027187418,1.0234515958315098,1.0790687243633164,1.1333554478860854,1.185781536776213,1.2363773018552857,1.2857071087221947,1.3335422246276682,1.3801973977263742,1.4246845872328904,1.4671817122655348,1.5077812147516574,1.5465710571963942,1.5836349494202717,1.6190525633349668,1.6528997364115512,1.6852486644586888,1.7161680842935099,1.7457234468551457,1.773977081280059,1.8009883504292086,1.8268137983296819,1.8515072899675824,1.8751201438445919,1.897701257687664,1.9192972276796412,1.9399524615581711,1.9597092859110352,1.9786080479778476,1.9966872122509423,2.0139834521521269,2.0305317370467262,2.0463654148419694,2.0615162904032109,2.076014700008681,2.0898895820513776,2.1031685441853321,2.1159232864137008,2.1281745036150919,2.1399420736865462,2.1512450897959057,2.1621018913609427,2.1725300938055079,2.1825466171409853,2.1921677134194186,2.2014089931028624,2.2102854503917335,2.2188114875532658,2.227000938289537,2.2348670901829881,2.2424227062558444,2.2496800456784323,2.2566508836599786,2.2633465305541733,2.2697778502104935,2.2759552776010614,2.2818888357516403,2.287588152004238,2.2930624736377001,2.2983206828716467,2.3033713112780889]
[null,null,null,null,null,null,null,null,null,null,null,"Commercial","Other","Other","Commercial-Misc. Com-Misc","Other Other",0,0.13982931719673,0.28196956818880797,0.40416973961759017,0.51568932742029305,0.62493793792041086,0.69901302877662153,0.77003681130228141,0.83715374831508527,0.89919169461002935,0.958756112026805,1.0164175699970595,1.0716012158791546,1.1254734487752278,1.1775119155656477,1.2277353215240514,1.2767007548572427,1.3241915712982428,1.3704929892162603,1.4146443878576742,1.4568191775890371,1.4971092561518295,1.5356020641742398,1.5723808109763855,1.6075246884537058,1.6411090736910692,1.6732057209233737,1.7038829434237475,1.7332057858677918,1.7612361876915292,1.7880331379316929,1.8136528220096544,1.8381487608944913,1.8615719430564046,1.8839709495987684,1.9053920729355014,1.9258794293600672,1.945475065833207,1.9642190612983945,1.9821496228169087,1.9993031767983152,2.0157144555869393,2.031416579650581,2.0464411356041912,2.0608182502884662,2.0745766611112741,2.0877437828484737,2.1003910998566373,2.1125391327143488,2.1242075918995491,2.1354154097702631,2.1461807712828107,2.1565211434973417,2.1664533039185603,2.1759933677176369,2.1851568138794626,2.1939585103176777,2.2024127379982223,2.2105332141105505,2.2183331143241016,2.2258250941661446,2.2330213095556779,2.2399334365267021,2.2465726901728686,2.252949842844242,2.2590752416256974,2.2649588251253183,2.2706101396000289,2.2760383544446263,2.2812522770693477,2.2862603671901058]
[null,null,null,null,null,null,null,null,null,null,null,"Commercial","Other","Motors","Commercial-Misc. Com-Motors","Other Motors",0,0.13911689799307925,0.28004930177013609,0.4011649800843356,0.51174873824801514,0.62017014240100554,0.69326323371358733,0.76334722276731359,0.82955770207777524,0.89072434469128736,0.94945818213526501,1.006305244835441,1.060724854322495,1.1138701535788893,1.1652116316280674,1.2147532832933898,1.2630554836934496,1.3099005577720297,1.3555820444765192,1.3991338613510724,1.4407336011272247,1.4804721441383413,1.5184359566040659,1.5547073145714869,1.5893645160179415,1.6224820817641301,1.6541309458096121,1.6843786356682735,1.7132894432488635,1.7409245867950718,1.7673423643707571,1.7925982993487246,1.8167452783358209,1.8398336819429251,1.8619115087856364,1.8830244930799669,1.9032162161770896,1.9225282123620955,1.9410000692236868,1.9586695228847588,1.9755725483677908,1.9917434453538598,2.0072149195798272,2.0220181601048144,2.0361829126643771,2.0497375493188392,2.0627091345909303,2.0751686344200451,2.0871362646468388,2.0986314430416075,2.1096728208100917,2.1202783128555085,2.13046512684592,2.1402497911340874,2.1496481815751283,2.158675547285474,2.1673465353849322,2.1756752147619927,2.1836750989009426,2.1913591678078199,2.1987398890707892,2.2058292380891058,2.2126387175034909,2.2191793758594467,2.2254618255337864,2.2314962599534773,2.2372924701347188,2.2428598605691072,2.2482074644826491,2.2533439584923909,2.2582776766844388]
[null,null,null,null,null,null,null,null,null,null,null,"Commercial","Other","Office Eqpmt","Commercial-Misc. Com-OffEquip","Other Office Eqpmt",0,0.14015539920295036,0.282627612603705,0.40504373394289234,0.51669060859940863,0.62602900250623927,0.70005792492301844,0.77104021243358389,0.83809840717374173,0.90006723288030488,0.95956497326473866,1.0171656147290313,1.0723035337743134,1.1261292326199863,1.1781110153288559,1.2282808710894229,1.2772017286086601,1.324643697813181,1.3709239433076641,1.4150507169688218,1.4572016716545908,1.4974686861050228,1.5359391819108534,1.5726963493698116,1.6078193614159819,1.6413835762751665,1.6734607294623836,1.704119115702954,1.7334237613259342,1.7614365876478506,1.7882165658356488,1.8138198637104046,1.838299984927539,1.8617079009449629,1.8840921761676392,1.9054990866354402,1.9259727326007832,1.9455551453233084,1.9642863883907429,1.9822046538579807,1.9993463534803024,2.0157462053014381,2.0314373158428283,2.0464512581269081,2.0608181457544692,2.0745667032440926,2.0877243328302977,2.1003625324136279,2.1125018077794238,2.1241618551963826,2.1353615933742316,2.1461191941597946,2.1564521120212512,2.1663771123684383,2.1759102987551331,2.1850671390074567,2.1938624903208019,2.2023106233659897,2.2104252454437807,2.2182195227253012,2.225706101614477,2.232897129267128,2.2398042733000274,2.2464387407218878,2.2528112961170095,2.2589322791110744,2.2648116211474445,2.2704588616011665,2.2758831632568408,2.2810933271754594,2.2860978069743445]
[null,null,null,null,null,null,null,null,null,null,null,"Commercial","Other","Process","Commercial-Misc. Com-Process","Other Process",0,0.1350762752021418,0.27118042912275186,0.3883181557334261,0.49542635172325689,0.60036268621722055,0.67113285844928083,0.73895983682224153,0.80308549993156686,0.86231682980036994,0.91919787093402794,0.9742419378987075,1.0268719335183796,1.0783253947837823,1.1280843085719976,1.1761136901854672,1.2229239176125122,1.2683594805026432,1.3125639364913397,1.3547201485305833,1.3949817032919212,1.433437069309391,1.4701704051818358,1.5052617788500202,1.5387873752532859,1.5708196930037508,1.6014277306800011,1.6306771633082731,1.658630509567101,1.6853472902212647,1.7108841782624287,1.7352951412070936,1.7586315759772138,1.7809424367650462,1.8022743562613561,1.8226717606049498,1.8421769783915682,1.8608303440613734,1.8786702959665249,1.8957334694036307,1.91205478488009,1.9276675318684715,1.9426034482890497,1.956892795947391,1.9705644321413953,1.9836458776404409,1.9961633812281456,2.008186725371556,2.0197354182381493,2.0308281978621943,2.0414830625476661,2.0517173000709321,2.0615475157305867,2.0709896592899506,2.0800590508559527,2.0887704057363692,2.0971378583157718,2.105174984988909,2.1128948261887337,2.1203099075448226,2.1274322602065161,2.1342734403637471,2.1408445479972418,2.1471562448885058,2.1532187719188234,2.1590419656853372,2.1646352744611645,2.1700077735254495,2.175168179888225,2.1801248664339701,2.1848858755068208]
[null,null,null,null,null,null,null,null,null,null,null,"Commercial","Other","Refrigeration","Commercial-Misc. Com-Refrig","Other Refrigeration",0,0.13181645882802542,0.26383702024269007,0.37752360490314452,0.48171080990509491,0.58393860422963273,0.65238737491089904,0.71797329894147033,0.77999644447581418,0.83723803302034228,0.89222335831315869,0.94541049265264543,0.99623902384026009,1.0459813606016732,1.0941345278169012,1.1406001567875903,1.1858789799458875,1.2298412625243855,1.2725512812781765,1.3132810122515031,1.3521748172529784,1.3893187014328641,1.4247944659706921,1.4586799226428697,1.4910490969875965,1.5219724206945595,1.5515169138113771,1.5797463573252795,1.6067214566470076,1.6324999964941933,1.6571369876434898,1.6806848059943418,1.7031933243624202,1.7247100373973072,1.7452801799969309,1.764946839570424,1.7837510624814532,1.8017319549855542,1.8189267789575632,1.8353710426887799,1.8510985870179868,1.8661416670458073,1.8805310296681048,1.8942959871510927,1.9074644869585593,1.9200631780300297,1.9321174736977602,1.9436958962006228,1.9548172318099428,1.9654995251624734,1.9757601085382595,1.9856156299826797,1.995082080318306,2.004174819090399,2.0129085994881448,2.0212975922820609,2.0293554088164143,2.0370951230939611,2.0445292929888286,2.0516699806219738,2.058528771932266,2.0651167954749541,2.0714447404780159,2.0775228741856919,2.0833610585173377,2.0889687660686258,2.0943550954810624,2.0995287862047549,2.1044982326783819,2.1092714979493712,2.1138563267563919]
[null,null,null,null,null,null,null,null,null,null,null,"Commercial","Other","Ventilation","Commercial-Misc. Com-Vent","Other Ventilation",0,0.14092919206622248,0.28478590177522783,0.4085774285213673,0.52195355743016214,0.63361673084259185,0.70915227649524848,0.78156491047113397,0.85003857379587033,0.9133565937528112,0.97417557997204007,1.0330002351246588,1.0893112663573037,1.1442639811125133,1.1973767737692171,1.2485764501701,1.2984675042317215,1.3468437316999406,1.3939476189061855,1.4388671125899744,1.4817807169859147,1.5227814267669402,1.5619577395951747,1.5993938833024692,1.6351700311066524,1.6693625055170154,1.7020439715457776,1.7332836198076125,1.7631473400566549,1.7916978856796169,1.8189950296346185,1.8450957122979836,1.8700541816554563,1.8939221262499835,1.9167488012752785,1.9385811481827666,1.9594639081491252,1.9794397297324118,1.9985492710266377,2.0168312966075481,2.0343227695462356,2.0510589387519977,2.0670734218915006,2.0823982841177502,2.0970641128296137,2.1111000886705567,2.1245340529638872,2.1374376782576445,2.1498319009968214,2.1617368311084122,2.173171784630255,2.1841553150517736,2.1947052434174625,2.2048386872419643,2.2145720882836528,2.223921239221784,2.2329013092805017,2.2415268688412717,2.2498119130836791,2.2577698846929457,2.2654136956710134,2.2727557482865812,2.2798079551980863,2.286581758782281,2.2930881496997668,2.2993376847276084,2.3053405038879595,2.3111063469004955,2.3166445689853443,2.3219641560421582,2.3270737392299536]
[null,null,null,null,null,null,null,null,null,null,null,"Commercial","Restaurant","Compressed Air","Commercial-Resturant-AirComp","Restaurant Compressed Air",0,0.1414765469710606,0.28656140680734615,0.41149320017577778,0.52559012413714867,0.63732785505303369,0.71364178518133692,0.78681828824623967,0.85598936068494413,0.91998681439598862,0.98143215796400385,1.0409082779891456,1.0978415063153948,1.1533892437296662,1.207033011993605,1.2587967988862754,1.3092512784443193,1.3581613517543329,1.4058441973672349,1.4513206141554584,1.494768154540443,1.5362807779210172,1.5759479052679735,1.6138546481361475,1.6500820256282127,1.6847071699677241,1.7178035213019749,1.7494410123203721,1.7796862432411977,1.8086026476886556,1.8362506499529245,1.8626878140984253,1.8879689853595705,1.9121464242388164,1.9352699336987751,1.9573869798184083,1.978542806262813,1.9987805428967824,2.0181413088540832,2.0366643103571884,2.0543869335659792,2.0713448327186232,2.0875720138133946,2.1031009140665655,2.1179624773686592,2.1321862259492055,2.1458003284486908,2.1588769805469381,2.1714373994291276,2.1835019646795257,2.1950902513478554,2.2062210617102891,2.2169124557765976,2.2271817805929537,2.2370456983879361,2.2465202136073987,2.2556206988820722,2.2643619199700304,2.2727580597144916,2.2808227410558239,2.2885690491350981,2.2960095525250455,2.303156323622872,2.3100209582380162,2.3166145944066301,2.3229479304633149,2.3290312423994251,2.3348744005361173,2.3404868855391836,2.3458778038016619,2.3510559022191804]
[null,null,null,null,null,null,null,null,null,null,null,"Commercial","Restaurant","Cooking","Commercial-Resturant-Cook","Restaurant Cooking",0,0.14214008594548919,0.2882272805043905,0.41401153414512382,0.52886792231156299,0.64134951936400497,0.71825093733574386,0.79199381786425227,0.8616973911130793,0.92619553064854354,0.98812328267741922,1.0480681064659794,1.1054549595892116,1.161432970421131,1.2154854557038792,1.2676400589239303,1.3184766220204454,1.3677532650007058,1.4158039670277078,1.4616308180989821,1.5054145804242267,1.547249797598421,1.5872264503138938,1.6254301864246889,1.6619425389158577,1.6968411324373827,1.7301998790253557,1.7620891635980795,1.7925760197818255,1.8217242965899232,1.8495948164495997,1.8762455250433807,1.90173163340586,1.9261057526921195,1.9494180220109447,1.9717162296941837,1.9930459283530282,2.0134505440525974,2.0329714799179124,2.0516482144670971,2.0695183949513578,2.0866179259659443,2.102981053581797,2.1186404452339258,2.1336272655896571,2.1479712486077189,2.1617007659876406,2.1748882766781805,2.1875551777352737,2.1997220215130988,2.2114085490107698,2.2226337219025867,2.233415753303813,2.2437721373218964,2.2537196774410813,2.2632745137864703,2.27245214931177,2.2812674749532067,2.2897347937904331,2.2978678442536222,2.3056798224144037,2.3131834033968079,2.3203907619429653,2.3273135921669184,2.3339631265286056,2.3403501540588025,2.3464850378645812,2.3523777319437085,2.3580377973352431,2.3634744176325579,2.3686964138839417]
[null,null,null,null,null,null,null,null,null,null,null,"Commercial","Restaurant","Cooling","Commercial-Resturant-Cool","Restaurant Cooling",0,0.16388057594168615,0.3417702244606643,0.49602727914931993,0.63911920909765663,0.78227571744915048,0.88072772805410871,0.97521127817651254,1.0646496493664317,1.1476711614842543,1.2275261601118848,1.3045007286121064,1.3785344578084315,1.4504137370771337,1.5197848307919855,1.5862786450029038,1.6509832882059596,1.7133563329601813,1.7742277190458842,1.8322601154885987,1.8877676325941859,1.9408638791182089,1.9916571435224464,2.0402506543096157,2.0867428270421366,2.1312274987545563,2.1737941504300786,2.2145281181747158,2.2535107936877181,2.2908198145940699,2.3265292451738282,2.3607097479938077,2.3934287469195028,2.4247505819590773,2.4547366563666633,2.483445576408982,2.5109332841774008,2.5372531838068491,2.5624562614434847,2.5865911992845598,2.6097044839965373,2.6318405098010418,2.6530416765027289,2.6733484827184562,2.6927996145533153,2.7114320299559718,2.7292810389734017,2.7464254141702411,2.7628929727110529,2.778710433608961,2.7939034610778961,2.8084967061734054,2.8225138467895894,2.8359776260770588,2.848909889344247,2.8613316195019527,2.8732629711086246,2.8847233030716177,2.895731210057491,2.9063045526623061,2.9164604863908776,2.9262154894919932,2.9355853896947743,2.9445853898895504,2.9532300927949153,2.9615335246509962,2.9695091579773627,2.9771699334325228,2.9845282808104496,2.9915961392082275,2.9983849763975257]
[null,null,null,null,null,null,null,null,null,null,null,"Commercial","Restaurant","Exterior Lights","Commercial-Resturant-ExtLight","Restaurant Exterior Lights",0,0.1342570009850626,0.28122882744235594,0.41099542876020961,0.53151310657489881,0.6491416581052557,0.73517436371603084,0.81759372003685493,0.89601981119810259,0.96921217181934793,1.0395129651334718,1.1073686457668552,1.1721118200812366,1.2352823729358158,1.2964513726519802,1.3554569605216662,1.4126785101065911,1.4681902346992166,1.5216635692058766,1.5727945528893985,1.6216826596190401,1.6684297216630026,1.713132757627871,1.7558842101496186,1.796772171327639,1.8358805965593947,1.8732895073967946,1.9090751840110103,1.9433103478199949,1.9760643348023605,2.0074032599924161,2.0373901736239262,2.0660852093644779,2.0935457250580884,2.1198264363708432,2.1449795437127528,2.1690548527886779,2.1920998891119292,2.2141600067960354,2.2352784919230344,2.2554966607704854,2.2748539531641452,2.2933880212088362,2.31113481363644,2.3281286559970908,2.3444023269075296,2.3599871305590967,2.3749566855024904,2.389335280203666,2.4031462442812521,2.4164119863594258,2.429154030426445,2.4413930507578439,2.4531489054609446,2.4644406686951212,2.4752866616200819,2.4857044821223977,2.4957110333684982,2.5053225512304715,2.5145546306291591,2.5234222508372923,2.5319397997837272,2.5401210973982069,2.5479794180345339,2.555527512008529,2.5627776262857318,2.569741524352394,2.5764305053020267,2.5828554221684494,2.5890266995351028,2.5949543504491874]
[null,null,null,null,null,null,null,null,null,null,null,"Commercial","Restaurant","Heating","Commercial-Resturant-Heat","Restaurant Heating",0,0.15166980536588362,0.33740219297793661,0.50209665634654999,0.65266625964099489,0.79760562803498469,0.91417455402898395,1.0258263019502516,1.1324233326372459,1.2331003188457339,1.3295528620959858,1.4229261520066119,1.5118571884484584,1.5981797537822562,1.6814342928857979,1.7621566951159633,1.8401974417855964,1.9163515613007276,1.9894754020062955,2.0595800003589688,2.1266693907758807,2.1908772133209795,2.2523309626120334,2.3111522825472663,2.3674572462590513,2.4213566220673743,2.4729561261637958,2.5223566627170331,2.5696545520538541,2.6149417475336922,2.6583060417020143,2.6998312622760099,2.7395974584864269,2.777681078271288,2.8141551367907089,2.8490893767069694,2.8825504206503232,2.9146019162686563,2.945304674237986,2.9747167995907979,3.0028938167003627,3.029888788241327,3.0557524284300004,3.080533210831832,3.1042774710084826,3.1270295042626599,3.1488316587253822,3.1697731191640743,3.1898878636061951,3.2092085287124492,3.2277664627305587,3.2455917763585576,3.2627133916001276,3.2791590886912529,3.2949555511743243,3.3101284091928345,3.3247022810769091,3.3387008132871432,3.3521467187815568,3.3650618138679209,3.3774670536012454,3.3893825657838641,3.4008276836232829,3.4118209771007764,3.422380283101635,3.4325227343559419,3.442264787236843,3.451622248461415,3.4606103007374416,3.4692435273977305,3.4775359360619209]
[null,null,null,null,null,null,null,null,null,null,null,"Commercial","Restaurant","Hot Water","Commercial-Resturant-HotWater","Restaurant Hot Water",0,0.13960795967686207,0.28342801473950002,0.4072419476461242,0.51999926438772148,0.62995205131667664,0.70535211905092721,0.77762953633292053,0.84592437885296934,0.90915217758153621,0.96984814413842468,1.0286143659536522,1.0848477560059522,1.1397537865462073,1.1927561038907262,1.2439447988106049,1.2938164979631681,1.3422248804762777,1.3893955438956664,1.4343871300029785,1.477370309263877,1.518438149720825,1.5576792213391077,1.5951778231080089,1.6310141981886379,1.6652647377610006,1.698002174186209,1.7292957640651154,1.7592114617420516,1.7878120837716251,1.8151574648375446,1.8413046055851419,1.8663078128035082,1.8902188323688882,1.9130869753380901,1.9349592375590827,1.9558804131456067,1.9758932021434226,1.9950383126977291,2.0133545580141994,2.0308789483899838,2.0476467785758299,2.063691710716141,2.0790458531002614,2.0937398349455294,2.1078028774205726,2.1212628611059885,2.1341914786119105,2.1466097069338028,2.1585376949482993,2.1699947961052453,2.1809995998291392,2.1915699616809245,2.2017230323290713,2.2114752853769502,2.2208425440916546,2.2298400070776352,2.2384822729368041,2.24678336395512,2.2547567488540889,2.2624153646440885,2.2697716376149843,2.2768375034980846,2.2836244268321546,2.2901434195649086,2.2964050589201617,2.3024195045596323,2.3081965150672401,2.3137454637826451,2.3190753540097173,2.3241948336246172]
[null,null,null,null,null,null,null,null,null,null,null,"Commercial","Restaurant","Interior Lights","C-Res-Lgt-LPD Int-All-All-C","Restaurant Interior Lights",0,0.14194688591858823,0.28838053222204763,0.41463736903478493,0.53005741473554646,0.6430918837581342,0.72066954936338912,0.79505493597447785,0.86539443856824549,0.93051387611543834,0.99304324230422569,1.0535573356745911,1.111480329973058,1.167978990872693,1.2225447082392271,1.2751880002516134,1.3264862708880183,1.3762075396542335,1.4246560052635175,1.4708700907333225,1.5150265484285634,1.5572204503936997,1.5975422876774297,1.63607820094293,1.6729101989717101,1.708116365720618,1.7417710565544782,1.7739450842419493,1.8047058952692754,1.8341177369955886,1.8622418161441898,1.8891364490966567,1.91485720443065,1.9394570381177789,1.9629864217747806,1.9854934643394753,2.0070240275224198,2.0276218353657809,2.0473285782226891,2.0661840114530703,2.0842260491156961,2.1014908529208394,2.1180129166934387,2.133825146583018,2.1489589372436968,2.1634442441954764,2.1773096525664828,2.1906276896148027,2.2034199641785528,2.2157072320334659,2.2275094295696425,2.2388457061388252,2.2497344551246887,2.26019334378655,2.2702393419249245,2.2798887494154383,2.2891572226557746,2.2980597999685557,2.3066109260013872,2.31482447516365,2.3227137741380637,2.3302916235035562,2.3375703185045098,2.3445616690000941,2.3512770186260519,2.3577272632000197,2.363922868400258,2.3698738867464666,2.3755899739102437,2.3810804043816467,2.3863540865172754]
[null,null,null,null,null,null,null,null,null,null,null,"Commercial","Restaurant","Other","Commercial-Resturant-Misc","Restaurant Other",0,0.13905539050010168,0.28188168914674472,0.40514712250642043,0.51799301404249487,0.62852150752285041,0.70425204661438556,0.77684737538932103,0.84552214416907556,0.90908798838544336,0.9701330726602958,1.0291951065969649,1.0856942245464134,1.1408460022702593,1.1941499695816067,1.245577892740332,1.2956767229708732,1.3442583023506838,1.391527253281462,1.4366217589697601,1.4797048182708641,1.5208695589166896,1.5602046117931407,1.5977943377778001,1.6337190426476025,1.6680551807073871,1.7008755477536297,1.7322494639531618,1.762242947184183,1.7909188773562221,1.8183371521968283,1.844554834965537,1.869626294529992,1.8936033382148945,1.916535337811639,1.9384693491149636,1.959450225332662,1.9795207246952582,1.9987216125744915,2.0170917584024419,2.0346682276670554,2.0514863692446794,2.0675798983159268,2.0829809750976893,2.0977202796114072,2.1118270826956747,2.1253293134599369,2.1382985102366758,2.1507557158622048,2.1627211424547799,2.1742142042092456,2.1852535488970433,2.195857088122668,2.2060420263856821,2.2158248889954359,2.2252215488837783,2.2342472523592782,2.2429166438447257,2.2512437896380675,2.2592422007353119,2.2669248547524523,2.2743042169819598,2.2813922606180252,2.2882004861833551,2.2947399401890509,2.3010212330578401,2.3070545563397427,2.3128496992481113,2.3184160645428653,2.3237626837866983,2.328898231999005]
[null,null,null,null,null,null,null,null,null,null,null,"Commercial","Restaurant","Motors","Commercial-Resturant-Motors","Restaurant Motors",0,0.14085529831653093,0.28492708005619327,0.40888576361719087,0.52211198592245467,0.63312820158606664,0.70860260082381343,0.78097356344876168,0.84937454285185787,0.9126317401260422,0.97337146787678175,1.0321561930993353,1.088429796883037,1.1433440484648223,1.1963873409900432,1.2475637766628478,1.2974465890887685,1.3458100281803458,1.3929611398711659,1.4379252783524634,1.4808808671476332,1.5219210578527627,1.5611344958136066,1.5986055478514392,1.6344145179922991,1.6686378518550771,1.7013483303169947,1.7326152530402645,1.7625046124109418,1.7910792584101065,1.8183990549083928,1.8445210278474442,1.8694995057460042,1.8933862529439593,1.9162305959746571,1.9380795434341385,1.9589778996954754,1.9789683727971248,1.9980916768160217,2.0163866290189856,2.0338902420698299,2.0506378115543078,2.0666629990706222,2.0819979111196569,2.0966731740162436,2.1107180050307157,2.1241602799585544,2.1370718878039479,2.1494737779637725,2.1613860728055982,2.1728281003167171,2.183818425464271,2.1943748803173633,2.2045145929800198,2.214254015381957,2.2236089499722338,2.2325945753591103,2.2412254709377062,2.2495156405454244,2.2574785351835178,2.265127074841661,2.2724736694609513,2.279530239069337,2.2863082331221518,2.2928186490791354,2.2990720502480748,2.305078582924033,2.310847992851953,2.3163896410393705,2.3217125189448722,2.3268252630669557]
[null,null,null,null,null,null,null,null,null,null,null,"Commercial","Restaurant","Office Eqpmt","Commercial-Resturant-OffEquip","Restaurant Office Eqpmt",0,0.14109409964653308,0.28583009460985437,0.41043196617045286,0.52424278584491868,0.63572732050909775,0.711788234335615,0.7847188022062811,0.85365738449974027,0.91742849194128773,0.97866273933537518,1.0379336557870347,1.0946652590092527,1.1500181507412284,1.2034807473326412,1.2550652211697899,1.3053482167640007,1.3540940821081864,1.401612428178254,1.4469319579718736,1.4902289719806241,1.5315971684569221,1.5711257181405553,1.6088994928032023,1.6449992817653398,1.6795019970421314,1.7124808677379491,1.7440056242743738,1.7741426730037229,1.8029552617292204,1.8305036366237872,1.8568451910119521,1.8820346064534728,1.9061239865428476,1.9291629838158613,1.9511989201325977,1.9722769008858818,1.9924399233647976,2.0117289795847166,2.0301831538780961,2.0478397155241028,2.0647342066798275,2.0809005258614341,2.0963710072099877,2.1111764957638539,2.1253464189474611,2.1389088544747619,2.1519358792824663,2.1644486300342716,2.1764674089717468,2.1880117168552111,2.1991002846041927,2.2097511036887969,2.2199814553213053,2.2298079384953593,2.2392464969182337,2.2483124448798844,2.2570204921007573,2.2653847675986656,2.2734188426134661,2.2811357526267217,2.2885480185120888,2.2956676668507372,2.3025062494447712,2.3090748620603061,2.3153841624306213,2.3214443875485884,2.3272653702764403,2.3328565552998306,2.3382270144520647,2.3433854614333671]
[null,null,null,null,null,null,null,null,null,null,null,"Commercial","Restaurant","Process","Commercial-Resturant-Process","Restaurant Process",0,0.15466273336109926,0.31646080232311136,0.45508499924417345,0.58097245490525962,0.70417752821109103,0.78877641886208427,0.86997400574226813,0.94657777598976989,1.0174852226789368,1.0855469477031794,1.1514794493931548,1.214771375056684,1.2763116278441065,1.3355726827876515,1.3927349520408758,1.4485307771962774,1.5025077186671485,1.5554630987391898,1.605945326182312,1.6541918204060275,1.7003052732787391,1.7443834588906761,1.7865194796538546,1.8268019995504401,1.8653154652266024,1.9021403155899383,1.9373531805317497,1.9710270693608072,2.0032315495025252,2.0340329159866695,2.0634943522176412,2.0916760824939988,2.1186355167180242,2.1444273877117612,2.1691038815329917,2.192714761162903,2.2153074839167677,2.2369273129096503,2.2576174228909558,2.2774190007444504,2.2963713409341815,2.3145119361614284,2.3318765634833736,2.3484993661305604,2.3644129312473403,2.379648363767378,2.3942823398696138,2.4083386035351944,2.4218399613928261,2.4348083197230843,2.447264720001884,2.459229373040785,2.4707216917795232,2.4817603227839786,2.4923631765006777,2.502547456316929,2.5123296864737354,2.5217257388767771,2.530750858848962,2.539419689866333,2.5477462973174618,2.5557441913248859,2.5634263486656068,2.5708052338262255,2.5778928192268777,2.5847006046467724,2.591239635882864,2.5975205226719247,2.6035534559051015,2.609348224162884]
[null,null,null,null,null,null,null,null,null,null,null,"Commercial","Restaurant","Refrigeration","Commercial-Resturant-Refrig","Restaurant Refrigeration",0,0.13185755263297538,0.26398737099927144,0.3777781548588578,0.48203588777781764,0.58429724359607582,0.65287075408941164,0.71857587655352995,0.78071635817754448,0.83807378841296221,0.89316745926083008,0.94646416195275807,0.99739164933473268,1.0472283288663311,1.0954712074206558,1.1420286217969693,1.1873972430955366,1.2314492851589289,1.2742438106016039,1.3150563745939041,1.3540294786354745,1.3912492822052482,1.4267977338686892,1.4607527861690972,1.4931885991005103,1.5241757327904744,1.5537813299853955,1.5820692888976839,1.6091004269423412,1.6349326358608987,1.659621028702579,1.683218079106152,1.7057737533010475,1.7273356352228348,1.7479490451160558,1.7676571519765505,1.7865010801657639,1.8045200105109882,1.8217512761880268,1.838230453666293,1.8539914489808214,1.8690665795810226,1.8834866519921953,1.897281035512776,1.9104777321580209,1.9231034430492149,1.9351836314365665,1.9467869244798395,1.9579321488034138,1.9686373878040617,1.9789200109916973,1.9887967021718296,1.9982834865154397,2.0073957565602099,2.0161482971852891,2.0245553096001188,2.0326304343862387,2.0403867736294625,2.0478369121783278,2.0549929380633198,2.0618664621099936,2.0684686367778196,2.0748101742553202,2.0809013638408556,2.0867520886372586,2.0923718415874104,2.0977697408767697,2.1029545447278495,2.1079346656106464,2.1127181838920763,2.117312860946567]
[null,null,null,null,null,null,null,null,null,null,null,"Commercial","Restaurant","Ventilation","Commercial-Resturant-Vent","Restaurant Ventilation",0,0.13850660790764291,0.27991159520211767,0.40181174825245081,0.51353924140226415,0.62332431916024178,0.69765301850213612,0.76891174486986436,0.83629363829752346,0.89859004817166355,0.95843249538809749,1.0163044452223298,1.0716955505297767,1.1257850896944255,1.1780710811093504,1.2284824806239356,1.2776025081818423,1.3252232387165415,1.3715825456520889,1.4157891400157006,1.4580196354165356,1.4983657524197096,1.5369147707552018,1.5737497539268859,1.6089497619801574,1.6425900530755406,1.6747422744791887,1.7054746435468464,1.7348521192454578,1.7629365647260837,1.7897869014330365,1.8154592552070132,1.8400070948144589,1.8634813633112848,1.8859306026263551,1.9074010717287224,1.9279368587224055,1.9475799871934401,1.9663705171159775,1.9843466406072598,2.001544772805314,2.017999638128134,2.0337443521589011,2.0488104993883685,2.0632282070328727,2.0770262151345071,2.0902319431386913,2.1029163423358712,2.1150999934713814,2.1268026648146821,2.1380433442338549,2.1488402700038796,2.1592109603986782,2.1691722421149384,2.178740277573838,2.1879305911449642,2.1967580943349807,2.2052371099819084,2.2133813954942778,2.2212041651728573,2.2287181116511787,2.2359354264896387,2.2428678199566066,2.2495265400286146,2.2559223906404755,2.2620657492149263,2.2679665835002503,2.2736344677431894,2.2790785982233923,2.2843078081746002,2.2893305821167851]
[null,null,null,null,null,null,null,null,null,null,null,"Commercial","Retail","Compressed Air","Commercial-Retail-AirComp","Retail Compressed Air",0,0.14356682675088622,0.289705499888264,0.41506178826365875,0.5291697309040847,0.64092086675746984,0.71654441202047436,0.78908029628917298,0.85755912305293858,0.92083943354573594,0.9815853820368301,1.040413792192165,1.0967731897582322,1.1517460458240598,1.2047906539547724,1.2559857502509095,1.3059273097618196,1.3543326653721564,1.4016478579986367,1.4467511362071293,1.489837598112973,1.5310008909625585,1.5703301258640305,1.6079101073216568,1.6438215506639327,1.6781412880275222,1.7109424635218404,1.7422947181639403,1.7722643651402306,1.8009145559203434,1.8283054377190366,1.8544943027742788,1.8795357298835236,1.9034817186155151,1.9263818165917446,1.9482832402097463,1.9692309891597708,1.9892679550668813,2.0084350245721474,2.0267711771492771,2.044313577936677,2.0610976658495161,2.077157237221825,2.0925245252149232,2.1072302752155361,2.1213038164347329,2.1347731299072987,2.1477107088839253,2.1601375449002798,2.1720738007991889,2.1835388434453411,2.1945512751484939,2.205128963846172,2.2152890720948304,2.2250480849165175,2.2344218365462236,2.2434255361233113,2.2520737923687131,2.2603806372879349,2.2683595489383257,2.2760234732975522,2.283384845268762,2.2904556088565151,2.2972472365462213,2.3037707479185259,2.3100367275288463,2.3160553420810701,2.3218363569232792,2.3273891518922629,2.3327227365325318,2.3378457647145208]
[null,null,null,null,null,null,null,null,null,null,null,"Commercial","Retail","Cooking","Commercial-Retail-Cook","Retail Cooking",0,0.14321978048042261,0.28896063862831084,0.41399935213709232,0.52786868096608663,0.6394326568509543,0.71492626635427081,0.78733471647596676,0.85570504112907864,0.91888335874214322,0.97953445540935524,1.0382705800768943,1.0945310336968128,1.1494099218141915,1.2023737031507977,1.2534871697316528,1.3033487039125624,1.3516782969494006,1.3989022347311804,1.4439207745941263,1.4869261087055534,1.5280117251397944,1.5672665831489601,1.6047753423448707,1.6406185797925414,1.6748729956763746,1.707611608162984,1.7389039380494571,1.7688161837528038,1.7974113871651447,1.8247495908698208,1.8508879871858972,1.8758810594824307,1.8997807161792477,1.9226364178277744,1.9444952976435794,1.9654022758416494,1.9854001681059692,2.0045297885066189,2.0228300471603,2.0403380429138762,2.0570891513151093,2.0731171081202651,2.0884540885745251,2.1031307826882544,2.1171764667199264,2.1306190710650359,2.1435309953231374,2.1559331894044949,2.1678457761697985,2.1792880840799929,2.1902786785571755,2.2008353921074426,2.2109753532545624,2.2207150143314234,2.2300701781743402,2.2390560237635411,2.2476871308514297,2.2559775036185878,2.2639405933958994,2.2715893204896567,2.2789360951450766,2.2859928376822198,2.2927709978370014,2.2992815733386647,2.3055351277538634,2.3115418076263046,2.3173113589397625,2.3228531429311738,2.3281761512794703,2.3332890206947967]
[null,null,null,null,null,null,null,null,null,null,null,"Commercial","Retail","Cooling","Commercial-Retail-Cool","Retail Cooling",0,0.17342888775955789,0.36330722440768148,0.52771774089669043,0.68051003757132922,0.8344105283859965,0.9400381394411863,1.0414279770004036,1.1374130134396074,1.2265441630541174,1.3122926810436095,1.3949042357806403,1.4744446772441673,1.5515518308219829,1.6259564295922697,1.6971682818066398,1.766460438556978,1.8331820809647317,1.8983538084504878,1.9604830487716716,2.0199227301856695,2.0767931518007363,2.1312090163951032,2.1832797023905028,2.2331095220044821,2.2807979663138735,2.3264399379215668,2.3701259718807601,2.4119424454950535,2.4519717775789553,2.4902926177314844,2.5269800261454374,2.5621056444465111,2.5957378580296249,2.6279419503344994,2.6587802494786392,2.6883122676433109,2.716594833586794,2.7436822186390795,2.7696262565131775,2.7944764572502527,2.8182801155988586,2.841082414112527,2.862926521234836,2.8838536846267897,2.9039033199778315,2.9231130955290507,2.941564517631845,2.9592875241660823,2.9763108711397037,2.9926621793460444,3.008367979179241,3.0234537536804384,3.037943979884643,3.0518621685353051,3.0652309022310713,3.0780718720665976,3.0904059128268764,3.102253036792181,3.1136324662084758,3.1245626644759765,3.1350613661064641,3.1451456054979614,3.1548317445734555,3.1641354993285167,3.1730719653308808,3.1816556422133742,3.1899004571999212,3.1978197877027994,3.2054264830278192,3.2127328852226325]
[null,null,null,null,null,null,null,null,null,null,null,"Commercial","Retail","Exterior Lights","Commercial-Retail-ExtLight","Retail Exterior Lights",0,0.13504170457729417,0.28375908188332882,0.41519441703453852,0.53735329461665182,0.65657595229223131,0.74403440532592713,0.82781813602764864,0.90755075304698807,0.98199270354319967,1.0535018796202678,1.1225116671211104,1.1883709266076465,1.2526156785510461,1.3148189439117868,1.3748087373895725,1.4329750640679451,1.489388308160454,1.543724595459026,1.5956844328691377,1.6453695997324596,1.6928831292662414,1.738323196819209,1.7817833591167,1.8233527811989367,1.8631164517113021,1.9011553871690041,1.9375468257840966,1.9723644114103658,2.0056783681309724,2.0375556659848635,2.0680601783007178,2.0972528310814837,2.1251917448583124,2.1519323694098067,2.177527611720897,2.2020279575352864,2.2254815868361537,2.247934483571647,2.2694305399245627,2.2900116554094092,2.3097178310647752,2.3285872589945011,2.3466564074975054,2.3639601020132721,2.3805316020978329,2.3964026746335922,2.4116471972882456,2.4262899046695274,2.4403545549252978,2.4538639682917083,2.4668400641195927,2.4793038964391436,2.4912756881205871,2.5027748636862812,2.5138200808274718,2.5244292606768526,2.5346196168860367,2.544407683555121,2.5538093420596684,2.5628398468186226,2.5715138500449739,2.5798454255193293,2.5878480914249629,2.5955348322813974,2.6029181200121001,2.6100099341804825,2.6168217814270314,2.6233647141391137,2.6296493483837415,2.6356858811323995]
[null,null,null,null,null,null,null,null,null,null,null,"Commercial","Retail","Heating","Commercial-Retail-Heat","Retail Heating",0,0.15218633293837752,0.33081128078283795,0.48875590661655105,0.63312973449596954,0.7725538380913195,0.88328607874778375,0.98938458841038923,1.0907022154720547,1.1862952568293719,1.2778175250162949,1.3664770149200292,1.4509366386407734,1.532922633439332,1.6120243066692612,1.688801411559758,1.7630442971961049,1.8355434827263797,1.9051498384512979,1.9718782860751558,2.035722883711621,2.0968121986039545,2.1552688461187559,2.2112097772309194,2.2647465514974976,2.3159855962842997,2.3650284529673335,2.4119720107918279,2.4569087290344411,2.4999268480791725,2.5411105899844006,2.5805403490872285,2.6182928731617978,2.6544414356203849,2.6890559992197858,2.7222033717106493,2.7539473538439578,2.7843488801266871,2.8134661526977487,2.8413547686755343,2.8680678413096947,2.8936561152521283,2.9181680762454687,2.9416500555115914,2.9641463291077463,2.985699212503846,3.0063491506211006,3.0261838813071584,3.0452355868936127,3.0635351792348429,3.0811123498632451,3.0979956181644672,3.1142123776508011,3.129788940407821,3.1447505797863826,3.1591215714092447,3.1729252325588577,3.1861839600102191,3.1989192663701864,3.2111518149822,3.2229014534530607,3.2341872458561549,3.2450275036633718,3.2554398154559157,3.265441075462201,3.2750475109691508,3.284274708651362,3.2931376398608623,3.3016506849184939,3.3098276564463314,3.3176818217789963]
[null,null,null,null,null,null,null,null,null,null,null,"Commercial","Retail","Hot Water","Commercial-Retail-HotWater","Retail Hot Water",0,0.13801020970305364,0.2795508049757584,0.40137704550705927,0.51230086390900875,0.6203992466717827,0.69436544725966975,0.76525850579679666,0.83224273499106782,0.89424045243241324,0.95375418240261001,1.0113766292877209,1.0664987143149622,1.1203491473519953,1.1723454033715883,1.2225745608056471,1.271506894137189,1.3190258105747581,1.3653077861860081,1.4094517305450518,1.4516215635604328,1.4919089480315981,1.5304011073071493,1.5671810498788274,1.6023277821328938,1.635916509906417,1.6680188294595064,1.6987029084401717,1.7280336573860975,1.7560728922770978,1.7828794886232429,1.8085095275465302,1.8330164342884046,1.8564511095513254,1.8788620540598588,1.9002954867053397,1.9207954566179486,1.9404039494909913,1.9591609884641967,1.9771047298559112,1.9942715540180658,2.0106961515727275,2.0264116052748125,2.0414494677321193,2.0558398352011746,2.0696114176654432,2.0827916053911686,2.095451472575613,2.107611560160326,2.1192915981823344,2.1305105377866069,2.1412865819747471,2.1516372151398033,2.1615792314351219,2.171128762023268,2.1803013012492269,2.1891117317803563,2.1975743487538741,2.2057028829710656,2.2135105231758407,2.2210099374537919,2.22821329378647,2.2351322797942292,2.2417781216996748,2.2481616025424809,2.254293079675135,2.2601825015679928,2.2658394239509128,2.271273025317659,2.2764921218182317,2.2815051815632832]
[null,null,null,null,null,null,null,null,null,null,null,"Commercial","Retail","Interior Lights","C-Ret-Lgt-LPD Int-All-All-C","Retail Interior Lights",0,0.13986689699979851,0.28210125287354992,0.40434734674000317,0.51590054662657614,0.62519145897078787,0.69921707388336118,0.77019583715171613,0.83726255055937704,0.89924218010036683,0.95875227420059728,1.0163653367859657,1.071506178092352,1.1253330817718274,1.1773274904749533,1.2275063064283553,1.2764351084375098,1.3238827731922282,1.370154062398899,1.4142754006517917,1.4564213384889941,1.496683725145955,1.5351499546865837,1.5719031917310737,1.6070225852649582,1.6405834711818288,1.6726575641753718,1.7033131395617258,1.732615205580492,1.7606256666919566,1.7874034783590693,1.8130047937753688,1.8374831029742791,1.8608893647308868,1.883272131644409,1.9046776687679472,1.9251500661317711,1.9447313454871509,1.9634615615796571,1.9813788982437612,1.9985197595944522,2.014918856576398,2.0306092891168306,2.0456226241148245,2.0599889694868634,2.0737370444765575,2.0868942464250146,2.0995320352526559,2.1116709160783604,2.1233305845306756,2.1345299587044479,2.1452872098558964,2.1556197918859108,2.1655444696594333,2.1750773462068573,2.1842338888515824,2.1930289543061265,2.2014768127774968,2.2095911711209513,2.217385195079701,2.2248715306466491,2.2320623245828206,2.2389692441257765,2.24560349591999,2.2519758441999,2.2580966282551391,2.263975779206286,2.2696228361183475,2.2750469614781221,2.2802569560605583,2.285261273208226]
[null,null,null,null,null,null,null,null,null,null,null,"Commercial","Retail","Other","Commercial-Retail-Misc","Retail Other",0,0.1399466119509247,0.28239850589005994,0.40486277434166623,0.51663987946923529,0.62616710720752833,0.70040655511860306,0.77158960922516273,0.83885476179629737,0.90102660308250349,0.96072178692678045,1.0185099905793613,1.0738191881372285,1.1278089052647429,1.1799609086094318,1.2302892850242193,1.2793594852525967,1.3269450144225599,1.3733442642218605,1.4175884416526876,1.4598524029657414,1.5002281855448503,1.5388033642905932,1.5756612776298669,1.6108812415959748,1.6445387526320676,1.6767056797339788,1.7074504465138185,1.7368382037330237,1.7649309928227621,1.7917879008805668,1.8174652076047126,1.8420165246020634,1.8654929274808023,1.8879430811165319,1.9094133584586257,1.9299479532233303,1.9495889868008986,1.9683766096859183,1.9863490977229035,2.0035429434430974,2.019992942753229,2.0357322772226238,2.0507925922015309,2.0652040709907649,2.0789955052707176,2.0921943619864156,2.1048721611562335,2.1170494728168028,2.1287460549516299,2.1399808855489093,2.1507721933937654,2.1611374876448992,2.1710935862436256,2.1806566432013876,2.189842174810035,2.1986650848173799,2.2071396886088936,2.2152797364347641,2.223098435720011,2.2306084724938531,2.2378220319730979,2.2447508183329532,2.251406073697332,2.2577985963794753,2.2639387584024728,2.2698365223281267,2.2755014574214445,2.280942755177009,2.2861692442323971,2.2911894046928598]
[null,null,null,null,null,null,null,null,null,null,null,"Commercial","Retail","Motors","Commercial-Retail-Motors","Retail Motors",0,0.14164186668973977,0.28625949602698619,0.41051574337891994,0.52382314283531062,0.63480747378006153,0.71013975225992942,0.7823811674684702,0.85062735993234162,0.91371512763003948,0.97428529750651127,1.0329304197059088,1.0890811809622283,1.1438664080712608,1.1967630539111538,1.2478109660835497,1.2975920385883131,1.3458514598835201,1.3929511281187241,1.437860979883427,1.4807632857992445,1.5217512264951554,1.5609134710539099,1.5983344051982302,1.6340943474469971,1.6682697538991105,1.7009334122656772,1.7321546257362739,1.7619993872321371,1.7905305445681305,1.8178079570161163,1.8438886437348085,1.8688269245052236,1.8926745531863518,1.9154808442826046,1.937292792992819,1.9581551890900806,1.9781107249622769,1.9972000981250404,2.0154621085015223,2.0329337507472047,2.0496503018826466,2.0656454044825989,2.080951145656305,2.0955981320409287,2.1096155610179257,2.1230312883507154,2.1359173966330993,2.1482947938882946,2.1601835627435393,2.1716029930146417,2.1825716130041743,2.1931072195640944,2.2032269069715671,2.212947094664846,2.2222835538842092,2.2312514332611788,2.2398652833975441,2.2481390804740644,2.2560862489271623,2.2637196832303972,2.2710517688160614,2.278094402170844,2.2848590101381694,2.2913565684585282,2.2975976195778816,2.3035922897530359,2.3093503054817406,2.3148810092841656,2.3201933748613675,2.3252960216553373]
[null,null,null,null,null,null,null,null,null,null,null,"Commercial","Retail","Office Eqpmt","Commercial-Retail-OffEquip","Retail Office Eqpmt",0,0.13987886840924527,0.28208850718019013,0.40425331899125233,0.51568684089134864,0.62486473367912265,0.69870375708410515,0.76950342859799781,0.8363889247141596,0.89819227136325774,0.9575319017750632,1.014981506111408,1.0699709778254465,1.1236526011595784,1.1755023796264508,1.2255418821302884,1.2743373971754448,1.3216574730691739,1.3678156077777754,1.4118260449305085,1.4538653769048984,1.4940252889288195,1.532393017173963,1.5690515742649611,1.6040799628769575,1.637553378073864,1.6695433990027557,1.7001181705252217,1.7293425753338101,1.7572783970709422,1.783984474938654,1.8095168502601826,1.833928905428635,1.8572714956536849,1.8795930738943334,1.9009398093441672,1.9213556998151879,1.9408826783470841,1.9595607143507014,1.9774279095773961,1.9945205891898428,2.0108733881946765,2.0265193334830132,2.0414899217113787,2.0558151932428093,2.069523802355862,2.0826430839179055,2.0952444493602678,2.1073483447040027,2.1189744088128633,2.1301415052578356,2.1408677529237394,2.1511705554075582,2.1610666292561977,2.1705720310894892,2.1797021836524433,2.1884719008390285,2.1968954117280743,2.2049863836702941,2.2127579444638972,2.2202227036547559,2.2273927729957022,2.2342797860981376,2.2408949173078541,2.247248899835677,2.2533520431723622,2.2592142498159942,2.2648450313390294,2.2702535238210535,2.2754485026722917,2.2804383968719248]
[null,null,null,null,null,null,null,null,null,null,null,"Commercial","Retail","Process","Commercial-Retail-Process","Retail Process",0,0.1398689840571071,0.28295885591873904,0.40605439430081069,0.51838716321384481,0.62834120481978417,0.70320334289253283,0.77497992637993585,0.84281735413262149,0.90554577523403168,0.96577282121676944,1.0240796772059362,1.0798767496693424,1.1343334391435809,1.1869347686823561,1.2377055907613148,1.2872007009127435,1.33519846214104,1.3819878169474447,1.4266110500474882,1.4692393029684163,1.5099651822607667,1.5488768104165878,1.5860580526738302,1.6215887318634483,1.6555448319529185,1.6879986909030706,1.7190191834204351,1.7486718941546127,1.7770192818593638,1.8041208350070577,1.8300332193187558,1.8548104176463787,1.8785038626190862,1.9011625624430488,1.922833220222163,1.9435603471468572,1.9633863698789125,1.9823517324420701,2.0004949929110887,2.017852915175784,2.0344605560413505,2.0503513479119109,2.0655571772906809,2.0801084593173611,2.0940342085513031,2.107362106197602,2.1201638520878126,2.1324602173651259,2.1442711531804304,2.1556158230635392,2.166512634016482,2.1769792663793126,2.1870327025168881,2.1966892543731711,2.2059645899377491,2.2148737586675336,2.2234312159048639,2.2316508463316533,2.239545986497621,2.2471294464591689,2.2544135305640083,2.2614100574152611,2.2681303790474319,2.2745853993453578,2.2807855917360271,2.2867410161819683,2.2924613355037828,2.2979558310583066,2.3032334177978355,2.3083026587348532]
[null,null,null,null,null,null,null,null,null,null,null,"Commercial","Retail","Refrigeration","Commercial-Retail-Refrig","Retail Refrigeration",0,0.13171334341192975,0.26363005618280511,0.37722528982040016,0.48132864378106988,0.58345356841109719,0.65179450443362152,0.71727651823783833,0.77919346360174857,0.83633491564790041,0.89122393887513163,0.9443180770682742,0.99505980642108793,1.0447223204027083,1.0927974232670699,1.139186248650909,1.1843896937263378,1.2282764335110088,1.2709161777667703,1.3115776668278969,1.3504063483267232,1.3874880795275273,1.4229045210265137,1.4567333509438161,1.4890484677328772,1.5199201822335662,1.5494153995599542,1.5775977913802561,1.6045279591149888,1.6302635885497259,1.6548595963308996,1.6783682687867507,1.7008393934907144,1.7223203839611363,1.7428563978691576,1.7624904491058229,1.7812635140398763,1.799214632279222,1.816381002231624,1.832798071743784,1.8484996240824556,1.8635178595066448,1.8778834726661724,1.8916257260488876,1.9047725196865581,1.9173504573179143,1.9293849091964062,1.9409442712927387,1.9520472989522648,1.9627120071066457,1.9729556995035156,1.98279499678223,1.9922458634412583,2.0013236337409688,2.0100430365838369,2.0184182194124496,2.0264627711640704,2.0341897443190224,2.041611676078654,2.0487406087072504,2.0555881090709005,2.0621652874050187,2.0684828153409689,2.0745509432210478,2.0803795167299124,2.085977992869442,2.091355455302955,2.0965206290936691,2.1014818948613323,2.106247302379979,2.1108245836388853]
[null,null,null,null,null,null,null,null,null,null,null,"Commercial","Retail","Ventilation","Commercial-Retail-Vent","Retail Ventilation",0,0.14063547893644629,0.28432824062557904,0.40799999537524523,0.52115080953027126,0.63232924900802401,0.70761189679426617,0.77979594741857938,0.84802698882435235,0.91110751999779582,0.97169293667880885,1.0303062144982966,1.0864244240173515,1.1411917639187912,1.1941071366539056,1.2451326509344345,1.2948675811111521,1.3430774944699753,1.3900638776315648,1.4348660334889027,1.4776666826110658,1.5185586624788006,1.5576303187793963,1.5949657324424191,1.6306449347131116,1.6647441109171355,1.6973357935335327,1.728489045158103,1.7582696319067173,1.7867401877772722,1.8139603704599641,1.8399870090581867,1.8648742441565513,1.8886736606482075,1.9114344137107029,1.9332033482979929,1.9540251124958259,1.9739422650684897,1.9929953775067701,2.0112231308698707,2.0286624076979001,2.0453483792563119,2.0613145883593353,2.076593028005862,2.0912142160484959,2.1052072661044017,2.1185999549051902,2.1314639341586616,2.1438200759831463,2.1556884285184306,2.1670882484543492,2.1780380322752291,2.1885555462708881,2.1986578553628662,2.2083613507926789,2.2176817767170021,2.2266342557529479,2.2352333135148781,2.2434929021825667,2.2514264231389483,2.2590467487141872,2.2663662430713467,2.2733967822675427,2.2801497735231337,2.2866361737302139,2.2928665072304351,2.2988508828910064,2.3045990105065783,2.3101202165536168,2.3154234593228398,2.3205173434542621]
[null,null,null,null,null,null,null,null,null,null,null,"Commercial","School","Compressed Air","Commercial-School-AirComp","School Compressed Air",0,0.13985828173077786,0.28191792553992484,0.40426205090493256,0.51563026435481152,0.624191715486484,0.69830885200667858,0.76935758244967312,0.83646907133764326,0.89852607965715026,0.95807678962027853,1.0157787893090477,1.0709680466160558,1.1248796540926971,1.1769031591627874,1.2271628842854634,1.2761822791267303,1.3237269926147786,1.3700875792005196,1.4142970539240007,1.4565281630267737,1.496872838862445,1.5354185575052821,1.572248564385109,1.6074420880155993,1.6410745424673885,1.6732177192007327,1.7039399688378447,1.7333063734224459,1.761378909683339,1.788216603789863,1.8138756780597767,1.8384096900544067,1.8618696644716177,1.884304218224311,1.9057596790705769,1.9262801981413094,1.9459078566919048,1.9646827673865952,1.9826431704069007,1.9998255246596168,2.0162645943445607,2.0319935311280037,2.0470439521542034,2.0614460141147157,2.0752284835831358,2.0884188038115883,2.1010884034931294,2.1132578393605206,2.1249468566186045,2.1361744209813782,2.146958749444325,2.1573173398419301,2.1672669992383429,2.1768238711972447,2.1860034619751736,2.1948206656808011,2.2032897884409852,2.2114245716128074,2.2192382140792586,2.2267433936647461,2.2339522877051721,2.240876592805956,2.2475275438200599,2.2539159320768114,2.2600521228910959,2.2659460723813316,2.2716073436235136,2.2770451221675363,2.282268230940971,2.2872851445644793]
[null,null,null,null,null,null,null,null,null,null,null,"Commercial","School","Cooking","Commercial-School-Cook","School Cooking",0,0.14564334015893293,0.29522227293422965,0.42418664736439954,0.54123068531039253,0.65450289459925337,0.73334838787444467,0.80895748161402881,0.88035407371453789,0.94644832508251864,1.0098730432120784,1.0713650630819394,1.1302253655632939,1.1876216561822386,1.2429128132984177,1.2963523757594131,1.3484992842832153,1.3990316226300268,1.4484247653159441,1.4955302246667987,1.5405394561934411,1.5835492589234317,1.6246517705338219,1.6639347018668642,1.7014815591408765,1.7373718545262993,1.7716813057193765,1.8044820251104325,1.8358426991103016,1.8658287581669628,1.8945025379747369,1.9219234323504057,1.9481480382242162,1.9732302931688424,1.9972216058659047,2.0201709798875216,2.0421251311494846,2.0631285993729596,2.0832238538730641,2.102451393975119,2.1208498443428878,2.1384560454874828,2.1553051397109417,2.1714306527245686,2.1868645711690529,2.2016374162509975,2.2157783136988338,2.2293609642106356,2.2424074059662802,2.2549388071339345,2.2669755002159193,2.2785370150386877,2.2896421104404445,2.3003088047078117,2.310554404810941,2.3203955344844873,2.329848161200025,2.3389276220736566,2.3476486487508552,2.3560253913089175,2.3640714412158066,2.371799853382639,2.3792231673455939,2.3863534276116156,2.3932022032009166,2.3997806064179956,2.4060993108816198,2.4121685688430299,2.4179982278204672,2.4235977465770104,2.4289762104676491]
[null,null,null,null,null,null,null,null,null,null,null,"Commercial","School","Cooling","Commercial-School-Cool","School Cooling",0,0.17309948633320443,0.35743745183402637,0.51530302132209338,0.66118919523784547,0.80833012302792751,0.90648786010580173,1.0006751629524486,1.0896312382223563,1.1718320390177794,1.2509115914353426,1.3272790448449916,1.4008087954366837,1.4720975045470353,1.5408557635220967,1.6066236449452727,1.6708501232455655,1.7326198201107095,1.7931896452375948,1.8508990840904753,1.9060916706373687,1.9588809949276611,2.0093753088722415,2.0576777884311732,2.1038867823416685,2.1480960481059754,2.1903949759189674,2.2308688011776687,2.2695988061795247,2.3066625115828026,2.3421338581710036,2.376083379433414,2.408578365445865,2.4396830185093163,2.4694586009788679,2.4979635756922431,2.5252537393845431,2.5513823494550443,2.5764002444320093,2.6003559584627531,2.623295830138531,2.6452641059471458,2.6663030386303928,2.6864529807086073,2.7057524734205027,2.7242383313132268,2.7419457227050272,2.758954070982619,2.7752909726035884,2.7909829345870381,2.8060554175218662,2.8205328768771905,2.8344388026819396,2.8477957576379946,2.8606254137287213,2.8729485873822864,2.8847852732468193,2.8961546766322126,2.9070752446712032,2.9175646962502935,2.9276400507590723,2.9373176557045908,2.9466132132355853,2.955541805619597,2.9641179197143157,2.9723554704728583,2.9802678235211175,2.987867816843814,2.995167781614438,3.0021795622028766,3.0089145353931932]
[null,null,null,null,null,null,null,null,null,null,null,"Commercial","School","Exterior Lights","Commercial-School-ExtLight","School Exterior Lights",0,0.13183929477426654,0.27565539364771446,0.4027327757262929,0.52086121753143821,0.6361046382980059,0.72038775021752621,0.80111915059177496,0.87796930753547087,0.94968215613772233,1.018562102189736,1.0850471026258344,1.1484472323513863,1.2103422380764608,1.2703048310650382,1.3281593123227777,1.384255856341994,1.4386955165853408,1.4910793576650896,1.5411759361762223,1.5890717522048701,1.6348668958508294,1.6786567172438926,1.7205320610237393,1.7605794887081077,1.7988814895999703,1.8355166808483094,1.8705599972429925,1.9040828712921178,1.9361534040998847,1.9668365275344541,1.996194158148292,2.0242853432880556,2.051166399807077,2.0768910457708532,2.1015105255245925,2.1250737284716998,2.1476273018930563,2.1692157581189955,2.1898815763489261,2.2096652993975519,2.2286056256315359,2.2467394963462017,2.2641021788183848,2.2807273452588572,2.296647147875718,2.3118922902488221,2.3265355928836358,2.3406008148938304,2.3541107774432444,2.367087400773773,2.3795517397714958,2.3915240181287354,2.4030236611574938,2.4140693273074869,2.4246789384399365,2.4348697089062217,2.4446581734785826,2.4540602141781904,2.4630910860441082,2.4717654418849673,2.4800973560534998,2.4881003472825189,2.4957874006193932,2.5031709884945963,2.5102630909585315,2.5170752151194526,2.5236184138140274,2.5299033035408303,2.5359400816858719,2.5417385430681039]
[null,null,null,null,null,null,null,null,null,null,null,"Commercial","School","Heating","Commercial-School-Heat","School Heating",0,0.15486743532752195,0.33557125886927008,0.49533560030521362,0.64070894722491301,0.78024151826673316,0.89153194795956192,0.99817406140665588,1.099879033704861,1.1958333513606283,1.2876949904705834,1.3766666600925406,1.4614592585146433,1.5438006895178253,1.623155152921457,1.7001879444895232,1.7746943788530665,1.847426030082274,1.9174138120572182,1.9844776456220561,2.0486430640704616,2.1100392962034915,2.1687895873191243,2.2250114882908729,2.2788171300509976,2.3303134842467808,2.379602610796363,2.4267818930310132,2.4719442610733231,2.5151784040655407,2.5565689718289231,2.5961967665035637,2.6341389246884561,2.6704690905735071,2.7052575805287766,2.7385715395911805,2.7704750902653261,2.8010294740328145,2.8302931859433027,2.8583221026407113,2.8851696041591506,2.9108866898053929,2.9355220884279061,2.9591223633566202,2.9817320122825808,3.0033935623324837,3.0241476605796698,3.0440824394166559,3.0632302435055871,3.0816221406229927,3.0992879720680078,3.1162564010806055,3.132554959348397,3.148210091677464,3.1632471988996969,3.177690679086262,3.1915639671340625,3.2048895727894275,3.2176891171707211,3.2299833678491328,3.2417922725445614,3.2531349914912804,3.2640299285258774,3.2744947609479285,3.2845464682018428,3.2942013594264274,3.303475099916855,3.31238273654199,3.3209387221582944,3.3291569390599411,3.3370507215031715]
[null,null,null,null,null,null,null,null,null,null,null,"Commercial","School","Hot Water","Commercial-School-HotWater","School Hot Water",0,0.14189572651037882,0.28847232126874178,0.41459928965452031,0.52915019368440275,0.64051516381458218,0.71722631334843368,0.79077625238543769,0.86024164599635966,0.92459384244383347,0.98635052246160237,1.0461612793694923,1.1034369624168632,1.1593463494281486,1.2132545823422189,1.2653458174673997,1.3161030925824966,1.3653822237357016,1.4134679343484546,1.4593263414342139,1.5031397441210126,1.5450027993077811,1.5850055943522279,1.6232338775238084,1.659769276338793,1.6946895044384962,1.728068557634548,1.7599768997100742,1.7904816385326376,1.8196466930036723,1.8475329513398171,1.8741984211538991,1.8996983717772511,1.9240854692404652,1.9474099043065127,1.969719513928309,1.9910598964821811,2.0114745211092773,2.0310048314786093,2.0496903442681407,2.0675687426440028,2.0846759650025617,2.1010462892255095,2.1167124126844801,2.1317055282187423,2.1460553962973439,2.1597904135655521,2.1729832070226727,2.185655182296057,2.1978268999729225,2.2095181089604021,2.2207477785286285,2.2315341290888302,2.2418946617563948,2.2518461867468518,2.2614048506508539,2.270586162632414,2.2794050195928985,2.2878757303416113,2.296012038812183,2.3038271463624391,2.3113337331939214,2.3185439789258226,2.325469582356714,2.3321217804461307,2.3385113665468098,2.3446487079171665,2.3505437625424257,2.3562060952916895,2.3616448934371745,2.3668689815607791]
[null,null,null,null,null,null,null,null,null,null,null,"Commercial","School","Interior Lights","C-K12-Lgt-LPD Int-All-All-C","School Interior Lights",0,0.14250379447029846,0.28925870122906244,0.41588325491098832,0.53117152310130489,0.64314801555676282,0.72070805393774973,0.79507056671776777,0.86533762963672833,0.93038050070373923,0.99281352286861579,1.0533053776477093,1.1111897412412821,1.1676658329203782,1.2221309307451529,1.2747419914851883,1.3260524499433912,1.375775540848905,1.4242957494166857,1.4705756366039875,1.5147947915193696,1.5570484374213134,1.5974272089492676,1.6360173831317437,1.6729010982665815,1.7081565613340992,1.7418582445667468,1.7740770717638952,1.8048805949074398,1.8343331616028189,1.8624960738407597,1.8894277385474409,1.9151838103647354,1.9398173270776375,1.9633788380828388,1.9859165262705758,2.0074763236712991,2.0281020211992846,2.0478353728069987,2.0667161943467458,2.0847824574198421,2.1020703784781678,2.1186145034284478,2.1344477879759229,2.1496016739311568,2.1641061616915218,2.1779898790974088,2.1913255023861291,2.2041346689299011,2.2164381619121039,2.228255944048501,2.2396071899772276,2.2505103173701069,2.2609830168157696,2.2710422805230621,2.2807044298913195,2.2899851419922297,2.2988994750062632,2.3074618926549357,2.3156862876685489,2.3235860043274803,2.3311738601136014,2.338462166506956,2.3454627489614319,2.3521869660918475,2.3586457281035811,2.364849514494642,2.3708083910589113,2.3765320262181366,2.3820297067091802,2.3873103526519746]
[null,null,null,null,null,null,null,null,null,null,null,"Commercial","School","Other","Commercial-School-Misc","School Other",0,0.13985313766532126,0.2826753738843541,0.40582102258641634,0.5178166282246518,0.62634203448963854,0.70128928787278177,0.77313206632286557,0.84099198077233617,0.90375314981457677,0.9639923295895404,1.0223869690521004,1.0782231703784884,1.1327416353752333,1.1853362823601179,1.2361650773806767,1.2857559716264906,1.333830960318847,1.3807338329989682,1.4254708122372537,1.4682091911813158,1.5090416639544257,1.548056440628458,1.5853374738132917,1.6209646733106327,1.6550141094842905,1.6875582059622611,1.7186659222513665,1.7484029268126209,1.776831761114763,1.8040119951544424,1.8300003749042444,1.8548509621240092,1.8786152669466354,1.9013423736266859,1.923079059818543,1.9438699097305188,1.963757421482152,1.982782108973818,2.0009825985607366,2.0183957208073449,2.0350565975828419,2.0509987247443635,2.0662540506407625,2.0808530506571858,2.094824798008633,2.1081970309793108,2.1210413619472082,2.1333786311508365,2.1452288561086967,2.1566112640981885,2.1675443233523355,2.1780457730249378,2.1881326519727842,2.197821326401606,2.2071275164206452,2.2160663215489125,2.2246522452145232,2.2328992182868608,2.2408206216797506,2.2484293080623168,2.2557376227127501,2.262757423548821,2.2695001003676385,2.2759765933258729,2.2821974106904239,2.2881726458883405,2.2939119938836501,2.2994247669076722,2.3047199095683411,2.3098060133630471]
[null,null,null,null,null,null,null,null,null,null,null,"Commercial","School","Motors","Commercial-School-Motors","School Motors",0,0.14023989147059301,0.28325660955584098,0.4065418538835654,0.51878475510187561,0.62799140858744351,0.70304673029718889,0.77499221388434303,0.84297090699525457,0.9058423675458841,0.96618728289096245,1.0246587919201,1.0805718344368302,1.1351761577072257,1.1878616404999653,1.2387512880474016,1.2883913658660771,1.336523602772568,1.3834588152551113,1.4282214529688475,1.4709835656375791,1.5118379794724985,1.5508730279805607,1.5881727791056441,1.6238172503995232,1.6578826128768434,1.690441384171453,1.7215626115767453,1.7513120455199469,1.7797523039894607,1.8069430284053147,1.8329410313953605,1.8578004369140617,1.8815728131163461,1.9043072983760509,1.9260507208168458,1.9468477117031044,1.9667408130189534,1.9857705795455682,2.0039756757296705,2.021392967620034,2.0380576101335621,2.0540031298981396,2.0692615039058992,2.0838632341977439,2.0978374187879041,2.1112118190259044,2.1240582317028815,2.1363975004349696,2.1482496459849534,2.1596338987464399,2.1705687299456393,2.181071881611377,2.1911603953619654,2.2008506400556436,2.2101583383494465,2.2190985922095972,2.2276859074148136,2.2359342170922858,2.2438569043245136,2.2514668238636815,2.2587763229888069,2.2657972615394986,2.2725410311588359,2.2790185737765838,2.2852403993627401,2.291216602980219,2.2969568811643302,2.3024705476556484,2.3077665485117795,2.3128534766225575]
[null,null,null,null,null,null,null,null,null,null,null,"Commercial","School","Office Eqpmt","Commercial-School-OffEquip","School Office Eqpmt",0,0.13860244168421626,0.27998585751336169,0.40181065514723208,0.51275817270911483,0.62059052332377507,0.69455705583922267,0.76545716911859785,0.83244117656736749,0.8943667919549213,0.95380901191498035,1.0114171571795703,1.0665020006695991,1.1203067103297042,1.1722363785418548,1.2224036854017248,1.2713459251355537,1.3187976805482253,1.3650676758650089,1.4091980434487577,1.4513542654947218,1.491628041352659,1.5301066273164796,1.566873061492901,1.6020063768085691,1.6355818028044025,1.6676709568293535,1.6983420252113606,1.7276599349507915,1.7556865164511004,1.7824806577725809,1.8080984508679208,1.8325933302326454,1.8560162043793769,1.8784155805220755,1.899837682834941,1.9203265646304233,1.9399242147816851,1.9586706586968627,1.9766040541354828,1.9937607821413796,2.010175533351346,2.0258813899244967,2.0409099033238749,2.0552911681691524,2.0690538923672883,2.0822254637167315,2.0948770546776796,2.1070291927633082,2.1187015951123898,2.1299132004808286,2.1406821999702519,2.1510260665435141,2.1609615833750024,2.1705048710817434,2.1796714138794968,2.1884760847062701,2.1969331693540202,2.2050563896477007,2.2128589257092508,2.2203534373426681,2.2275520845748424,2.2344665473854994,2.2411080446582461,2.2474873523834851,2.2536148211427203,2.2595003929026229,2.265153617146118,2.2705836663666497,2.2757993509507735,2.2808091334732241]
[null,null,null,null,null,null,null,null,null,null,null,"Commercial","School","Process","Commercial-School-Process","School Process",0,0.15032596243870272,0.30617921563337869,0.44094730470382104,0.56246146053868873,0.67933718640536533,0.76297347094519308,0.84315217582825852,0.91900869274058916,0.98924775532227527,1.0566371347451853,1.122065577795313,1.1845584858288463,1.2454336297244732,1.30395770748,1.3606032562515651,1.4159764244526976,1.4696405508603587,1.5220923965468793,1.5721425198836447,1.6199691038430415,1.6656746209624937,1.7093566201120161,1.7511079736542881,1.7910171116632958,1.8291682439050043,1.8656415702440776,1.9005134801034977,1.9338567415688943,1.9657406806963622,1.9962313515514036,2.0253916974772688,2.0532817040632847,2.0799585442576567,2.1054767160446053,2.1298881730824819,2.1532424486776125,2.1755867734479555,2.1969661870111783,2.217423644013377,2.2370001147973095,2.2557346809926599,2.2736646262954063,2.2908255226887921,2.307251312344639,2.3229743854307832,2.3380256540381308,2.352482736554073,2.3663690899456227,2.3797072451579457,2.3925188436713674,2.4048246726151974,2.4166446984953533,2.4279980995904982,2.4389032970692659,2.4493779848790518,2.4594391584548712,2.469103142294867,2.478385616447202,2.487301641951317,2.4958656852748358,2.5040916417857559,2.5119928582980222,2.5195821547270545,2.5268718448903749,2.533873756487071,2.5405992502885275,2.5470592385715509,2.5532642028238071,2.5592242107502852,2.5649489326083947]
[null,null,null,null,null,null,null,null,null,null,null,"Commercial","School","Refrigeration","Commercial-School-Refrig","School Refrigeration",0,0.13127222710627948,0.26250134497682226,0.37548740786461943,0.47895802464638976,0.58037957256092465,0.64833801700374583,0.71344891404826638,0.77502366587097582,0.83184945645216646,0.88642997202440299,0.93923658619589867,0.98968620435617161,1.0390677860110453,1.0868723610946174,1.1330166905387018,1.1779843920189554,1.2216582361312491,1.2640798847038024,1.3045369844089896,1.3431688247894238,1.3800609936298793,1.4152948910813741,1.4489479435887422,1.4810938064406349,1.511802555568428,1.5411408691850501,1.5691721998213202,1.5959569372858897,1.6215525630452146,1.6460137964920212,1.6693927335443761,1.6917389779926388,1.7130997659881708,1.7335200840456095,1.7530427809097215,1.7717086736182479,1.7895566480736664,1.8066237544193759,1.8229452974993772,1.8385549226650295,1.8534846971778556,1.8677651874435877,1.8814255322996551,1.8944935125660509,1.9069956170579603,1.9189571052476224,1.9304463840773813,1.9414820951807901,1.9520821442667653,1.9622637301720336,1.9720433727666629,1.9814369397579505,1.9904596724361634,1.9991262104039025,2.0074506153292111,2.0154463937609748,2.023126519043621,2.0305034523666898,2.0375891629834109,2.0443951476311115,2.0509324491849492,2.057211674575246,2.0632430119974883,2.0690362474429236,2.0746007805765663,2.0799456399883831,2.0850794978423997,2.0900106839474968,2.0947471992727271,2.0992967289290809]
[null,null,null,null,null,null,null,null,null,null,null,"Commercial","School","Ventilation","Commercial-School-Vent","School Ventilation",0,0.14966007000093445,0.30433332315115363,0.4372229447064197,0.55812610084668535,0.67644571060494518,0.75807024627669617,0.83632489700561596,0.91026575345830063,0.9787457401761307,1.0444800841197532,1.1081729229535129,1.1691597313854638,1.2285495560067907,1.2858115207965202,1.3410692372115101,1.3949688802034872,1.4472023231897475,1.4982027257694921,1.5468503698591196,1.5933396034875678,1.6377697594776426,1.6802354044768713,1.7208265779028669,1.7596290183912644,1.7967243784249494,1.8321904277852745,1.8661012464301285,1.898527407369917,1.9295361500806834,1.9591915449635444,1.9875546493313239,2.0146836553765461,2.0406340305497932,2.0654586507536745,2.0892079267352646,2.1119299240387499,2.1336704768600963,2.154473296126751,2.174380072107668,2.1934305718422107,2.2116627316607058,2.2291127450545098,2.2458151461394182,2.2618028889429511,2.2771074227335424,2.2917587635978371,2.3058317065085041,2.3193490851567287,2.3323328318172076,2.3448040129337948,2.3567828633003178,2.3682888188920219,2.3793405484009105,2.3899559835261517,2.4001523480686946,2.4099461858773035,2.4193533876913547,2.4283892169239469,2.4370683344271566,2.4454048222796305,2.4534122066350941,2.4611034796688696,2.4684911206579923,2.4755871162291405,2.4824029798072296,2.4889497702962209,2.4952381100224637,2.5012782019696762,2.507079846333534,2.5126524564227259]
[null,null,null,null,null,null,null,null,null,null,null,"Commercial","Small Office","Compressed Air","Commercial-Small Office-AirComp","Small Office Compressed Air",0,0.14305909805503716,0.28820599539032049,0.41254146575724587,0.52564671977351962,0.63646043457653323,0.71108272815471218,0.7826484878019444,0.85019255089989432,0.91256351128030622,0.97244294503158335,1.0304374940961554,1.0859955634502683,1.1401981207686225,1.192502166624591,1.2429798288270546,1.2922364539850517,1.3399826920311455,1.3866639097746785,1.4311582286544262,1.4736600726759537,1.5142621105029388,1.5530525143378755,1.5901151878276889,1.6255299819311313,1.6593728994071499,1.691716288546248,1.7226290267318354,1.752176694385563,1.780421739819515,1.8074236354888271,1.8332390261106541,1.85792186908936,1.8815235676632514,1.904093097165015,1.9256771247661979,1.9463201230554836,1.9660644777811085,1.9849505900694633,2.0030169734146619,2.0203003457175748,2.0368357166374844,2.052656470505009,2.0677944450313044,2.0822800060356332,2.0961421184012541,2.1094084134580755,2.1221509886735417,2.1343905191849872,2.1461468639275152,2.1574390978555988,2.1682855428926593,2.1787037976588302,2.1887107660251455,2.1983226845404804,2.2075551487757461,2.2164231386280808,2.2249410426260967,2.233122681275618,2.240981329483783,2.2485297380979077,2.2557801545940412,2.2627443429487943,2.2694336027266768,2.2758587874139136,2.2820303220284912,2.2879582200350015,2.2936520995917302,2.2991211991563527,2.3043743924755562,2.3094202029829072]
[null,null,null,null,null,null,null,null,null,null,null,"Commercial","Small Office","Cooking","Commercial-Small Office-Cook","Small Office Cooking",0,0.14938055067735773,0.30284255352346934,0.43420305136249104,0.55351134911840449,0.67044073313277297,0.74970576478075679,0.82575042895282014,0.89749400707855986,0.96380646701968842,1.0274674154575481,1.089125499148685,1.1482663892877645,1.2058729982636771,1.2613902496540592,1.3149476793903865,1.3672204947622781,1.4178451472000173,1.4674431382220894,1.5147140277041247,1.5598791743477658,1.6030359429993506,1.6442770028949105,1.6836905642680138,1.7213606025245936,1.7573670706626594,1.7917861005766933,1.824690193850629,1.856148402609465,1.8862265009676709,1.9149871475824645,1.9424900397917,1.9687920597893747,1.993947413266562,2.0180077609218245,2.0410223432227488,2.0630380987791117,2.084099776668273,2.1042500430345692,2.123529582266785,2.1419771930410203,2.1596298795005184,2.17652293782912,2.1926900384609675,2.2081633041558195,2.2229733841568433,2.2371495246359263,2.2507660268730629,2.2638449839733772,2.2764076168619698,2.2884743087153869,2.3000646380338172,2.3111974104076811,2.3218906890301612,2.3321618240051682,2.3420274804983081,2.3515036657765132,2.3606057551802255,2.3693485170702577,2.3777461367898161,2.3858122396805648,2.3935599131900727,2.4010017281065146,2.4081497589550804,2.4150156035891848,2.4216104020082647,2.4279448544327003,2.4340292386651816,2.4398734267666904,2.4454869010741622,2.4508787695858052]
[null,null,null,null,null,null,null,null,null,null,null,"Commercial","Small Office","Cooling","Commercial-Small Office-Cool","Small Office Cooling",0,0.17790198354890238,0.3717252053879932,0.53874951951671979,0.69349600670628164,0.84961576045813658,0.95627843734864681,1.0586661046046131,1.1555287546611588,1.2454086480305997,1.3318572393571002,1.4152004588099469,1.4954551379262415,1.5732002290805842,1.6481948230004011,1.7199589773793849,1.7898442259721448,1.8571244758166907,1.9229526629740055,1.9857058988980065,2.0457410252886534,2.1031797028834389,2.1581379282260524,2.2107263091707625,2.2610503263746669,2.3092105815208379,2.3553030329745495,2.399419219536246,2.4416464729185461,2.4820681195402812,2.520763672198187,2.5578090121463242,2.5932765620844642,2.6272354505294726,2.6597516680180147,2.6908882155646725,2.7207052457766583,2.7492601970046811,2.7766079208891226,2.8028008036413854,2.827888881382068,2.8519199498404295,2.874939668703349,2.8969916608866333,2.9181176069870327,2.9383573351596133,2.9577489066521765,2.9763749478514496,2.9942656799610194,3.0114501311276411,3.0279561835401103,3.0438106186687905,3.0590391607191991,3.0736665183701537,3.0877164248642024,3.1012116765153879,3.1141741696968159,3.1266249363680565,3.1385841782000039,3.1500712993525806,3.1611049379584557,3.1717029963638685,3.1818826701756184,3.1916604761613545,3.2010522790484317,3.2100733172648157,3.2187382276638008,3.2270610692726622,3.2350553461037652,3.2427340290651552,3.2501095770061692]
[null,null,null,null,null,null,null,null,null,null,null,"Commercial","Small Office","Exterior Lights","Commercial-Small Office-ExtLight","Small Office Exterior Lights",0,0.12967192811670752,0.27017921666640687,0.39427762375574754,0.50963113640703506,0.62222779421535213,0.70419984786545886,0.78270552324952147,0.85743788800001708,0.92714253617317988,0.99409145167943147,1.0587080143761627,1.1202969765120303,1.1804598774764781,1.238771455802542,1.295041507894773,1.3495998110004115,1.4025758945275217,1.4535197194894884,1.5022364502435328,1.5488068306105998,1.5933288047905179,1.6358956616604521,1.6765962659146205,1.7155152772241686,1.7527333580627149,1.7883273708071576,1.8223705646894341,1.8549327531429907,1.8860804820575765,1.9158771894275719,1.9443833568522535,1.9716566533211255,1.9977520716935988,2.0227220582598053,2.0466166357481148,2.0694835201248885,2.0913682315131252,2.1123141995388104,2.1323628633969531,2.1515537669134286,2.1699246488637267,2.1875115287955835,2.2043487885890896,2.2204692499752654,2.2359042482221869,2.2506837021864898,2.2648797006153658,2.2785152768605643,2.2916125549752495,2.3041927856108124,2.3162763804965709,2.3278829455582928,2.3390313127292868,2.3497395705056716,2.3600250932953979,2.36990456960865,2.3793940291353546,2.3885088687537435,2.3972638775121613,2.4056732606246558,2.4137506625192806,2.4215091889765135,2.4289614283937002,2.4361194722100357,2.4429949345252164,2.4495989709436023,2.4559422966744497,2.4620352039176039,2.4678875785628391,2.4735089162299553]
[null,null,null,null,null,null,null,null,null,null,null,"Commercial","Small Office","Heating","Commercial-Small Office-Heat","Small Office Heating",0,0.16141736356572903,0.3520781878463104,0.52078233286604114,0.67501553255273261,0.82441984448763339,0.94381390217372796,1.0582138099663552,1.1675039979458885,1.2707294916294347,1.369585545141929,1.4652972163572224,1.5565385791988227,1.6450019812190499,1.7302812278334718,1.8130115400761986,1.8929816906417574,1.971068778155785,2.0460563532701039,2.1179383598287358,2.1867276604652193,2.2525613879941258,2.3155703660607312,2.3758794118811011,2.4336076237994919,2.4888686544576082,2.5417709703270575,2.5924180983155907,2.6409088601192581,2.6873375949562579,2.7317943712839785,2.7743651880683422,2.8151321661439743,2.854173730174832,2.8915647816976557,2.9273768637048252,2.9616783171988557,2.9945344301277763,3.0260075790888825,3.0561573641678361,3.0850407372606536,3.1127121242077949,3.139223541052214,3.1646247047168394,3.1889631383814563,3.2122842718243021,3.2346315369798324,3.256096588517178,3.2767142540030538,3.2965179860997553,3.3155399168429129,3.3338109097765005,3.3513606100296816,3.3682174924167545,3.3844089076382251,3.3999611266579834,3.4148993833285806,3.4292479153337641,3.443030003514711,3.4562680096437544,3.4689834127069021,3.4811968437540139,3.4929281193731776,3.5041962738436068,3.5150195900192185,3.5254156289930076,3.5354012585903454,3.5449926807374381,3.5542054577493416,3.563054537580197,3.5715542780766483]
[null,null,null,null,null,null,null,null,null,null,null,"Commercial","Small Office","Hot Water","Commercial-Small Office-HotWater","Small Office Hot Water",0,0.13387053443673091,0.27041566188803118,0.38811465085725888,0.49551511698283141,0.60019142639832779,0.67167557850013915,0.7401586515180516,0.80490728481534624,0.86482282102341956,0.92234569251285881,0.97802147492805747,1.0312273012515776,1.0832693011071106,1.1335761682508405,1.1821763893290334,1.2294988716769966,1.2754857847496677,1.3201715122172952,1.3628031710601896,1.4035234682003548,1.4424214031535338,1.4795816524687844,1.5150847890329771,1.5490074897835708,1.5814227324647077,1.6123999820258526,1.6420053672284545,1.6703018479942955,1.6973493739992156,1.7232050349876533,1.7479232032568031,1.7715556687340988,1.794151767048058,1.8157585009702222,1.8364206555848874,1.8561809075234936,1.8750799285818343,1.8931564840206225,1.9104475258333082,1.9269882812493619,1.9428123367264467,1.9579517176709353,1.972436964113077,1.9862972025506842,1.9995602141635005,2.0122524995893443,2.0244437256251175,2.0361536728307397,2.0474013408795555,2.0582049793857662,2.0685821175148709,2.0785495924251625,2.0881235765864261,2.0973196040201629,2.106152595503918,2.114636882780601,2.12278623181209,2.1306138651148361,2.1381324832137181,2.1453542852489518,2.1522909887694914,2.1589538487450364,2.1653536758274923,2.1715008538915166,2.1774053568826073,2.1830767650000702,2.1885242802411256,2.1937567413313719,2.1987826380658317,2.2036101250838511]
[null,null,null,null,null,null,null,null,null,null,null,"Commercial","Small Office","Interior Lights","C-SOff-Lgt-LPD Int-All-All-C","Small Office Interior Lights",0,0.14731477106418334,0.29997652892208115,0.43124548880441482,0.55084444944169253,0.6679290399095168,0.74824586133052717,0.82528421151176468,0.89805753659156573,0.96542493829155385,1.0301036857018973,1.09271595782979,1.1527266149901905,1.2111965921692474,1.2675825887770324,1.3219798949226897,1.37501892277115,1.4263952102675312,1.4766038503763868,1.5244803819419421,1.5702298164048683,1.6139502043054332,1.6557348831502396,1.695672714118087,1.7338483063649477,1.7703422296024887,1.8052312155867543,1.8385883491179589,1.8704832491187433,1.9009822403265577,1.9301485161059655,1.9580422928585079,1.9847209564812134,2.0102392012997954,2.0346491618789844,2.0580005380901549,2.0803407137954268,2.1017148694875978,2.122166089206587,2.141735462035439,2.1604621784623097,2.1783836218791635,2.1955354554731037,2.2119517047522943,2.2276648359352378,2.2427058304197307,2.2571042555360736,2.270934267174094,2.2842183048630962,2.2969779222764113,2.3092338222027537,2.3210058901369988,2.3323132265448798,2.3431741778539577,2.3536063662211442,2.363626718125079,2.3732514918297518,2.3824963037639302,2.3913761538591927,2.3999054498876844,2.4080980308390743,2.4159671893746517,2.4235256933949931,2.4307858067561896,2.4377593091682499,2.4444575153079682,2.4508912931772584,2.4570710817367534,2.4630069078432708,2.4687084025186303,2.4741848165762232]
[null,null,null,null,null,null,null,null,null,null,null,"Commercial","Small Office","Other","Commercial-Small Office-Misc","Small Office Other",0,0.14125010813209157,0.2852380847881173,0.40892224597415155,0.52171772564007757,0.63223390364625687,0.70709903054967704,0.77888539019650338,0.84669950729783139,0.90937212636591802,0.96954883370958789,1.0278053595803613,1.083584767141381,1.1380185009684294,1.1905785518030996,1.241296876876973,1.2907564297073026,1.3387083214890332,1.3855037228953928,1.4301213724046149,1.4727433103160266,1.5134622327869445,1.5523663445687914,1.5895395863380108,1.6250618500343321,1.6590091828623792,1.691453980575669,1.7224651706272081,1.7521083857380781,1.7804461284044673,1.807537926834438,1.8334404827782516,1.858207811690145,1.8818913756350417,1.9045402093306443,1.9262010396936469,1.946918399238327,1.9667347336564751,1.9856905038894122,2.003824282985665,2.0211728480216844,2.0377712673477046,2.0536529834064279,2.0688498913586302,2.083392413736942,2.0973095713369632,2.1106290505434435,2.1234227103325893,2.1357113087276969,2.1475147842776989,2.1588522884079477,2.1697422164938653,2.1802022377078867,2.1902493236881204,2.1998997760752435,2.2091692529623081,2.2180727943003782,2.2266248463012137,2.234839284876601,2.2427294381523546,2.2503081080935265,2.2575875912759025,2.2645796988374967,2.2712957756424093,2.2777467186881424,2.2839429947862437,2.289894657544961,2.2956113636814686,2.3011023886901198,2.3063766418921676,2.3114426808913486]
[null,null,null,null,null,null,null,null,null,null,null,"Commercial","Small Office","Motors","Commercial-Small Office-Motors","Small Office Motors",0,0.14067958923000576,0.28325543749496668,0.40565004633559393,0.51736463459846616,0.62699617487679193,0.7006034819153858,0.77118900819739,0.83783564556110723,0.89938427879428873,0.9584896362087898,1.0156957577991952,1.0704956824148832,1.1239967725919715,1.1756628087989711,1.2255025469656513,1.2741085861569192,1.3212287269343845,1.367226450505729,1.4110706010208691,1.4529509902880153,1.4929589726315975,1.5311814686119618,1.5677011898060873,1.6025968517126448,1.6359433754318,1.667812078733486,1.6982708570933072,1.727384355242666,1.7552141297490036,1.7818188031131195,1.8072542098432576,1.8315735349399469,1.854827445201346,1.8770642137360007,1.898329838048382,1.9186681520422608,1.9381209322678288,1.9567279987204109,1.974527310481591,1.9915550564774975,2.0078457416138549,2.0234322685331048,2.0383460152254269,2.0526169087127628,2.0662734950129362,2.0793430055796644,2.0918965648599714,2.1039545413082545,2.1155364992837447,2.1266612307941566,2.137346785986177,2.1476105024322627,2.1574690332612767,2.1669383741785886,2.1760338894194993,2.1847703366780822,2.1931618910519011,2.2012221680414492,2.2089642456416305,2.2164006855611205,2.223543553604046,2.2304044392470446,2.2369944744434704,2.2433243516852581,2.2494043413517533,2.2552443083736486,2.2608537282390744,2.2662417023678096,2.2714169728785536,2.2763879367732258]
[null,null,null,null,null,null,null,null,null,null,null,"Commercial","Small Office","Office Eqpmt","Commercial-Small Office-OffEquip","Small Office Office Eqpmt",0,0.13941600973884577,0.28095473157616757,0.40254861428222449,0.51347671888639557,0.62215119534614716,0.69558652282613787,0.76599030571727045,0.83250361501917036,0.89395508461138673,0.95296213779752481,1.0100817167185172,1.0647530149712179,1.1181358849017837,1.1697005445871711,1.2194631255668233,1.2679851079128921,1.3150463985586378,1.3609400183730522,1.4046980925634605,1.4464955810930191,1.4864237206617936,1.524569318616416,1.5610149775610749,1.5958393080996807,1.6291171303593162,1.660919664908415,1.6913147136485633,1.7203668312262608,1.74813748748029,1.7746852214114237,1.8000657871339409,1.8243322922427241,1.8475353290054874,1.8697230987668532,1.8909415299294563,1.9112343898569626,1.9306433910247363,1.9492082917258504,1.9669669916230978,1.9839556224216113,2.0002086339215537,2.0157588756960547,2.0306376746260848,2.0448749085112548,2.0584990759635247,2.07153736277948,2.0840609309438785,2.0960901002498034,2.1076443883161997,2.1187425422556831,2.1294025690921865,2.139641764977791,2.1494767432561552,2.1589234614180648,2.1679972469928508,2.1767128224176764,2.1850843289250488,2.1931253494873122,2.2008489308553494,2.2082676047272511,2.2153934080813018,2.2222379027062664,2.2288121939606746,2.2351269487915344,2.2411924130417122,2.2470184280740604,2.2526144467392686,2.2579895487133421,2.2631524552295978,2.2681115432290748]
[null,null,null,null,null,null,null,null,null,null,null,"Commercial","Small Office","Process","Commercial-Small Office-Process","Small Office Process",0,0.14898854164161662,0.30216173304619226,0.43348859965491604,0.55285695417606162,0.66970106567132592,0.74928295384288512,0.82562685824355575,0.89766778925399371,0.9642953113065813,1.0282520287040917,1.0901913262493359,1.1495899191999037,1.2074520152103083,1.2632232932947762,1.3170348055588819,1.369534712730105,1.4203823547521433,1.4701648094020978,1.5176184035282836,1.5629601627962275,1.6062876240963173,1.6476936260916419,1.68726654567479,1.7250905220130783,1.7612456688583282,1.7958082757593208,1.8288509987792958,1.860443041287112,1.8906503253588958,1.9195356542970385,1.9471588667451321,1.9735769828508005,1.9988443429032634,2.0230127388487702,2.046131539064727,2.068247806752245,2.0894064122869898,2.1096501398494687,2.1290197886382023,2.1475542689525553,2.1652906934162806,2.1822644635979591,2.1985093522705301,2.2140575815388828,2.2289398970519931,2.2431856385043334,2.2568689940439937,2.2700121652472021,2.2826364772279999,2.2947624132387556,2.3064096479047391,2.3175970791466796,2.3283428588430968,2.338664422282168,2.3485785164509045,2.3581012272075434,2.3672480053812426,2.3760336918414287,2.3844725415774639,2.3925782468277133,2.4003639592955355,2.4078423114882379,2.4150254372136262,2.4219249912674048,2.4285521683433613,2.4349177211970319,2.4410319780923064,2.4469048595592886,2.4525458944905938,2.4579642356022116]
[null,null,null,null,null,null,null,null,null,null,null,"Commercial","Small Office","Refrigeration","Commercial-Small Office-Refrig","Small Office Refrigeration",0,0.13107267456071531,0.26212476497119436,0.37496710302650876,0.47829930741520293,0.57956580360438725,0.64748211103255127,0.71255136904505012,0.77409268791157404,0.83089496906622418,0.88545077203048261,0.93823517935844325,0.98865780135123194,1.0380141560910903,1.0857972095886348,1.1319257383649355,1.1768749066839888,1.220536939092804,1.2629385960659087,1.3033791431397848,1.3419950347975962,1.3788718369085529,1.4140909285008825,1.4477297156606748,1.4798618340542071,1.5105573407001882,1.5398828955829016,1.5679019336637925,1.5946748278175678,1.6202590431891921,1.6447092834402162,1.6680776293265152,1.6904136700246866,1.711764627600951,1.7321754749943359,1.7516890478651357,1.7703461506400253,1.7881856570667385,1.8052446055737847,1.8215582897142586,1.8371603439573001,1.8520828250761561,1.8663562893680161,1.8800098659278019,1.8930713261858318,1.905567149907724,1.9175225878439908,1.929006055269086,1.9400361843874177,1.9506308718509964,1.9608073077971868,1.9705820037401223,1.9799708193610381,1.9889889882409884,1.9976511425776997,2.0059713369266681,2.0139630710050169,2.0216393115951123,2.0290125135834858,2.0360946401691868,2.0428971822743649,2.0494311771885694,2.0557072264770184,2.0617355131818971,2.0675258183445888,2.0730875368756543,2.078429692798299,2.0835609538900721,2.0884896457465438,2.093223765289788,2.0977709937435813]
[null,null,null,null,null,null,null,null,null,null,null,"Commercial","Small Office","Ventilation","Commercial-Small Office-Vent","Small Office Ventilation",0,0.14914784802924341,0.30313654239333709,0.43543477645365297,0.55639655323242687,0.6757745567146618,0.75702365226603763,0.83493942762925122,0.90859072268823537,0.97676543809143412,1.0422465733513913,1.1055915739071904,1.1663019472950524,1.2254234269757336,1.2824862179758967,1.3374642572852322,1.3910559479314728,1.4429728513545641,1.4936361100177069,1.541946011594028,1.5881115070824692,1.6322313446818735,1.6743995310554951,1.7147055692240374,1.7532346840070139,1.7900680356891265,1.8252829225504097,1.8589529728631469,1.8911483269248557,1.9219358096648727,1.9513790943321099,1.9795388577433144,2.0064729275445399,2.0322364219134146,2.056881882106131,2.0804593982307207,2.1030167286071442,2.1245994130548373,2.1452508804296118,2.1650125507141453,2.183923931949586,2.2020227122800806,2.2193448473671711,2.2359246434169808,2.2517948360499029,2.266986665229993,2.2815299464595005,2.2954990956569916,2.3089167781058348,2.3218047643212256,2.3341839653733731,2.3460744668162197,2.357495561276739,2.3684657797576909,2.379002921704624,2.3891240838859065,2.3988456881326479,2.4081835079835185,2.4171526942776982,2.4257677997374807,2.4340428025804188,2.4419911291993204,2.449625675946896,2.4569588300604064,2.464002489760253,2.4707680835551304,2.4772665887850578,2.4835085494323801,2.4895040932296353,2.4952629480920452,2.5007944579012955]
[null,null,null,null,null,null,null,null,null,null,null,"Commercial","Warehouse","Compressed Air","Commercial-not-refrig-warehouse-AirComp","Warehouse Compressed Air",0,0.14404364458607311,0.29197335957100412,0.41937612496375259,0.53570682639687872,0.64974504134879851,0.72776179511373273,0.80257924910279965,0.87330187988853469,0.93876337695779322,1.0016136804674505,1.062427710223774,1.1206774131831052,1.17748321340722,1.2323116954692999,1.2852088301055713,1.3367578909692597,1.3867229340441798,1.4354593887446896,1.4819356781161894,1.5263420331825497,1.568774131843637,1.6093230397417742,1.6480754425545496,1.6851138660874789,1.720516884831411,1.7543593196122282,1.7867124249251771,1.8176440665129885,1.8472188897156676,1.8754984790903524,1.9025415097718383,1.9284038910181645,1.9531389023609449,1.976797322756831,1.9994275531145171,2.0210757325509832,2.0417858487111227,2.0615998424664781,2.0805577072914057,2.0986975835986037,2.1160558483004501,2.1326671998480102,2.1485647389857774,2.1637800454472291,2.1783432508040037,2.1922831076699176,2.2056726541744935,2.2185336151816744,2.2308868579126133,2.2427524258032472,2.2541495710252573,2.2650967857231818,2.2756118320183747,2.2857117708284718,2.2954129895491495,2.3047312286430675,2.3136816071791517,2.3222786473636532,2.3305362981027766,2.3384679576351206,2.3460864952706446,2.3534042722714359,2.3604331619081584,2.3671845687247202,2.373669447042424,2.3798983187336198,2.3858812902936966,2.3916280692391165,2.3971479798580964,2.4024499783394906]
[null,null,null,null,null,null,null,null,null,null,null,"Commercial","Warehouse","Cooking","Commercial-not-refrig-warehouse-Cook","Warehouse Cooking",0,0.14766910535555502,0.29933184661405937,0.42955201902210038,0.54803796603372168,0.66399224242710653,0.74314198235709761,0.81907552335929901,0.89076573392466341,0.95708834183360003,1.0207511852360542,1.0823969071261832,1.1414975488115933,1.1990881221042098,1.2546114924862688,1.3081929651617932,1.3604544744711293,1.4110789846300196,1.4606047995251183,1.5078192929484728,1.5529318340112934,1.5960395408314278,1.6372348516415061,1.6766057604087621,1.7142360400833083,1.7502054541489642,1.7845899571128812,1.8174618845345063,1.8488901331608099,1.8789403317029749,1.9076750027598735,1.9351537163654666,1.9614332356107065,1.9865676547654592,2.0106085303023602,2.0336050052022294,2.0556039268996718,2.0766499592076801,2.0967856885413632,2.1160517247432975,2.1344867967963812,2.1521278436943621,2.1690101007254254,2.1851671814102538,2.2006311553227906,2.2154326220095011,2.2296007812111838,2.2432096172516052,2.2562812107972987,2.2688367708258199,2.2808966690378276,2.292480472910662,2.3036069774470502,2.3142942356704568,2.324559587916549,2.3344196899683136,2.3438905400804688,2.3529875049370199,2.3617253445840762,2.3701182363783868,2.378179797990442,2.3859231094994757,2.3933607346162118,2.4005047410677882,2.4073667201779374,2.4139578056741904,2.4202886917526203,2.4263696504294328,2.4322105482075638,2.4378208620853195,2.4432096949330342]
[null,null,null,null,null,null,null,null,null,null,null,"Commercial","Warehouse","Cooling","Commercial-not-refrig-warehouse-Cool","Warehouse Cooling",0,0.19355799778555935,0.40968371285813571,0.59681098620263717,0.77129069571377828,0.94887263498907981,1.0716090910889302,1.1894502037790284,1.3011212104732672,1.4050132390649919,1.504971808219199,1.6011823372614633,1.6939196958996541,1.7836007309155644,1.8700996798564291,1.9527138819029173,2.0330580692774682,2.1103350820335653,2.1858262295537751,2.2578078273779378,2.3267025310540403,2.3926468472625695,2.4557710143145157,2.5161993026331491,2.5740503001680852,2.6294371835306229,2.6824679755964023,2.7332457902809297,2.7818690651552789,2.8284317825331624,2.8730236796265007,2.9157304483344326,2.956633925200304,2.9958122720425036,3.033340147737881,3.0692888716109032,3.1037265788575055,3.1367183684097517,3.1683264436258383,3.198610246169562,3.2276265834241147,3.255429749766833,3.2820716420143281,3.3076018693311249,3.3320678578795717,3.3555149504742148,3.3779865014900876,3.3995709323957382,3.4203032644538021,3.4402171363758698,3.4593448589021083,3.4777174672262263,3.4953647713508227,3.5123154044548444,3.5285968693516088,3.5442355831127887,3.5592569199307502,3.5736852522887963,3.5875439905061106,3.6008556207215694,3.6136417413780468,3.625923098266413,3.6377196181860807,3.6490504412767226,3.6599339520736129,3.6703878093369786,3.6804289747037693,3.6900737402083226,3.6993377547165864,3.7082360493167821,3.7167830617077104]
[null,null,null,null,null,null,null,null,null,null,null,"Commercial","Warehouse","Exterior Lights","Commercial-not-refrig-warehouse-ExtLight","Warehouse Exterior Lights",0,0.12925726340795166,0.26909004899143141,0.3925226411658842,0.50719848424827219,0.61910632395484877,0.70052338506916589,0.77850350536564694,0.85273597170501125,0.92196036378835011,0.98844143546686136,1.0526197064911913,1.1137810234802172,1.1735284841257436,1.2314373768790392,1.2873302710601895,1.3415322393885087,1.394169101206113,1.4447944325292292,1.4932056665726752,1.5394816091115608,1.5837198264054544,1.6260132408385766,1.6664503618149609,1.7051155046709727,1.7420889982515673,1.7774473817606509,1.8112635914619515,1.8436071377747936,1.8745442732789688,1.9041381521144314,1.9324489812346868,1.9595341639474193,1.9854484361520088,2.0102439956610536,2.033970624971754,2.0566758078329497,2.0784048399346773,2.0992009340292594,2.1191053197760672,2.1381573385862134,2.1563945337283883,2.173852735942913,2.1905661447976716,2.2065674060069775,2.2218876849224829,2.2365567363940002,2.2506466907418221,2.2641804092586044,2.2771798507308758,2.289666107067704,2.3016594375228268,2.3131793015657838,2.3242443904553785,2.3348726575666978,2.3450813475208996,2.3548870241650279,2.364305597447256,2.3733523492311659,2.3820419580909391,2.3903885231277013,2.3984055868456555,2.4061061571251239,2.4135027283281478,2.4206073015708949,2.4274314041957599,2.433986108474758,2.4402820495745545,2.4463294428122806,2.4521381002301328,2.4577174465156504]
[null,null,null,null,null,null,null,null,null,null,null,"Commercial","Warehouse","Heating","Commercial-not-refrig-warehouse-Heat","Warehouse Heating",0,0.1805059814097551,0.4123955908359957,0.62004325316230424,0.8103573029868415,0.99382882267825445,1.1457944841151582,1.2915597076963434,1.4308572434053071,1.5630321961358791,1.6896249547237043,1.8119760534538754,1.9289207092749119,2.0421356809609983,2.1510415357998554,2.256598176941266,2.358448660471451,2.4577357054013005,2.5532313400880127,2.644776154098619,2.7324412724026916,2.8163955374739911,2.8968001923197257,2.9738092364769013,3.0475697645834701,3.1182222884158111,3.1859010432365569,3.2507342792518932,3.3128445389350158,3.3723489209323616,3.4293593312313164,3.4839827222323168,3.5363213203343946,3.5864728426112218,3.6345307031244474,3.6805842093925278,3.7247187495061724,3.7670159703559678,3.8075539474135209,3.8464073464845852,3.8836475778309612,3.9193429430374884,3.9535587749810404,3.9863575712400876,4.0177991212660391,4.0479406276211041,4.0768368215718898,4.1045922667268089,4.131251996968782,4.1568592683567109,4.1814556293094816,4.2050809880192794,4.2277736772036016,4.24957051630102,4.2705068712116132,4.2906167116789966,4.3099326664070574,4.3284860760008144,4.3463070438173137,4.3634244848090518,4.3798661724391907,4.3956587837446754,4.4108279426203687,4.4253982613944478,4.4393933807624988,4.452836008145125,4.4657479545312802,4.4781501698671313,4.4900627770478554,4.5015051045675198,4.5124957178800411]
[null,null,null,null,null,null,null,null,null,null,null,"Commercial","Warehouse","Hot Water","Commercial-not-refrig-warehouse-HotWater","Warehouse Hot Water",0,0.13923780046757833,0.28283559890988369,0.40671573805106898,0.51964393226352501,0.62965396394574236,0.70552413634035249,0.77824775963967052,0.84699739095215065,0.91070270372863815,0.97185045590855679,1.0310366799215327,1.087666885211833,1.1429766055090251,1.1963696378577493,1.2479422925652197,1.2981592181392323,1.3469147228600491,1.3943803418590746,1.4396608272776166,1.4829221073302326,1.5242576390889582,1.5637563684728473,1.6015029577259337,1.6375780009354715,1.6720582282427834,1.7050166993623854,1.7365229869904848,1.766643350651389,1.79544090149965,1.8229757585668322,1.8493051969145049,1.8744837881293419,1.8985635335719508,1.921593990768196,1.9436223933102057,1.9646937646139249,1.9848510258608938,2.0041350984338409,2.0225850011386197,2.0402379424889219,2.0571294083150091,2.0732932449433896,2.0887617381808385,2.1035656883234086,2.117734481399042,2.1312961568410311,2.144322451569673,2.1568345010640941,2.1688526064280564,2.1803962673289905,2.1914842136366786,2.2021344358129227,2.2123642141015067,2.2221901465658074,2.2316281760195591,2.2406936158944526,2.2494011750865508,2.2577649818218291,2.2657986065795646,2.2735150841107674,2.2809269345873813,2.2880461839165664,2.2948843832530228,2.3014526277410221,2.3077615745165474,2.3138214599987541,2.3196421164988084,2.3252329881730516,2.3306031463463714,2.3357613042306475]
[null,null,null,null,null,null,null,null,null,null,null,"Commercial","Warehouse","Interior Lights","C-War-Lgt-LPD Int-All-All-C","Warehouse Interior Lights",0,0.14325805917418971,0.29067318882218934,0.41775859179876895,0.53380429796588236,0.64734699279086139,0.72533779048638691,0.80013010243632754,0.87083662355742375,0.93630497634671039,0.99915882339307827,1.059982685663339,1.1182290071071983,1.1750403919412056,1.2298753365374249,1.2827922341232461,1.3343536879235103,1.3843335991825734,1.433073172519288,1.4795580450484556,1.5239732099173311,1.5664143007220728,1.6069723427399691,1.6457339849319848,1.6827817197648793,1.7181940915165099,1.7520458936906589,1.7844083561326038,1.8153493224035302,1.844933417940684,1.8732222095007347,1.9002743563560851,1.9261457536877107,1.9508896685934569,1.9745568691074673,1.9971957466044967,2.0188524319421735,2.0395709056747875,2.0593931026537735,2.0783590113127084,2.0965067679182807,2.1138727460532283,2.1304916415826933,2.1463965533416656,2.1616190597682379,2.1761892916951266,2.1901360015003726,2.2035321304075346,2.2163994139606631,2.2287587296393956,2.240630130733174,2.2520328788781923,2.2629854753098679,2.2735056908815481,2.2836105948981462,2.2933165828115047,2.3026394028224155,2.311594181432453,2.3201954479870954,2.3284571582499347,2.3363927170462455,2.3440150000126376,2.3513363744880884,2.3583687195802518,2.3651234454395964,2.3716115117726519,2.3778434456244004,2.3838293584586614,2.389578962564185,2.3951015868130789,2.4004061917971282]
[null,null,null,null,null,null,null,null,null,null,null,"Commercial","Warehouse","Other","Commercial-not-refrig-warehouse-Misc","Warehouse Other",0,0.14253598136191301,0.28943216861608395,0.41612766378578081,0.53191943870259195,0.64526195718347124,0.72314406882955784,0.79782405913412635,0.86843980115733765,0.93382697002861292,0.9966106043303129,1.0573599966497842,1.1155227712102804,1.172256015346222,1.2270329663914459,1.2798854429953044,1.3313805297030625,1.3812953097831178,1.429943648268561,1.4763462752035361,1.5206832226813345,1.5630499178729089,1.6035371906572138,1.6422315050136518,1.6792151782687965,1.7145665888589898,1.7483603732332558,1.7806676124859666,1.8115560092756764,1.8410900555554446,1.8693311916106274,1.8963379568724739,1.9221661329497921,1.946868879296372,1.970496861908668,1.9930983754263971,2.0147194589880835,2.0354040061741445,2.0551938693517759,2.0741289587185894,2.0922473363256402,2.1095853053450897,2.1261774948332057,2.1420569402257219,2.1572551597896084,2.1718022272431305,2.1857268407445267,2.1991017456541377,2.2119486430795638,2.2242883774234561,2.2361409702040649,2.2475256525406402,2.2584608963563886,2.2689644443496153,2.2790533387816843,2.2887439491284991,2.2980519986403758,2.3069925898533974,2.3155802290936447,2.3238288500140629,2.3317518362021508,2.3393620428951558,2.3466718178380095,2.3536930213178424,2.3604370454075867,2.3669148324498921,2.3731368928113419,2.3791133219357774,2.3848538167244007,2.3903676912692315,2.3956638919654472]
[null,null,null,null,null,null,null,null,null,null,null,"Commercial","Warehouse","Motors","Commercial-not-refrig-warehouse-Motors","Warehouse Motors",0,0.14117362811477033,0.28591454372707559,0.41065498655863225,0.52467283230549633,0.63641834990894608,0.71273519312504163,0.78590668891446758,0.85508479447827768,0.91910629315441306,0.98058093325203666,1.0400502341887317,1.0969835484627588,1.1525434453937509,1.2062042808679097,1.2579758454101726,1.3084151274619997,1.3573239764078364,1.4049792121451623,1.4504281768102008,1.493849633118556,1.5353374704587357,1.574981043475375,1.6128654008820829,1.6490715022370468,1.6836764233383117,1.7167535508587011,1.7483727668055322,1.7786006233574698,1.8075005085999232,1.8351328036512413,1.8615550316444771,1.8868219990035751,1.9109859294284102,1.934096590980074,1.9562014166360751,1.9773456186646448,1.9975722971480201,2.0169225429663555,2.0354355355367253,2.0531486355854822,2.0700974732169191,2.0863160315267861,2.1018367259955695,2.1166904798836113,2.1309067958380301,2.1445138239099442,2.1575836808611637,2.1701375728515768,2.1821958688754104,2.1937781338104152,2.2049031601623552,2.2155889985563042,2.2258529870242221,2.2357117791363317,2.2451813710219426,2.2542771273235576,2.2630138061263767,2.2714055829036499,2.2794660735167258,2.2872083563071159,2.2946449933164241,2.3017880506685597,2.3086491181473177,2.3152393280010863,2.3215693730051861,2.3276495238111603,2.3334896456111545,2.3390992141444316,2.3444873310719863,2.3496627387442119]
[null,null,null,null,null,null,null,null,null,null,null,"Commercial","Warehouse","Office Eqpmt","Commercial-not-refrig-warehouse-OffEquip","Warehouse Office Eqpmt",0,0.14316990997971826,0.2896993352541618,0.41573728559993772,0.53067511023609071,0.64317971880848679,0.71991058416530862,0.79349549977975231,0.86301974061526709,0.92733123767914338,0.98907555038962436,1.04884143453017,1.106084329835294,1.1619228035055729,1.2158138858020084,1.267820678242177,1.3185206966837464,1.3676662615709894,1.4156351728335719,1.4613749697942959,1.5050740922335888,1.5468270517219069,1.5867237942978119,1.6248499308747399,1.6612869555245946,1.6961124522998694,1.729400291218788,1.7612208140028736,1.7916410101233033,1.8207246836812441,1.848532611617993,1.8751226937230614,1.9005500948822358,1.9248673799830371,1.9481246418718032,1.9703696227347247,1.9916478292545494,2.0120026418751902,2.0314754184881347,2.0501055928372378,2.0679307679221397,2.0849868046651663,2.1013079060920172,2.1169266972628398,2.1318743011773531,2.1461804108654716,2.1598733578633458,2.1730257418782091,2.1856589029721132,2.1977933387553268,2.2094487376442071,2.2206440108061329,2.2313973228433301,2.2417261212653803,2.2516471647982308,2.2611765505756303,2.2703297402571203,2.2791215851149538,2.2875663501306418,2.2956777371402359,2.303468907065886,2.3109525012697563,2.3181406620649447,2.325045052416677,2.3316768748657526,2.3380468897049371,2.3441654324378014,2.3500424305483234,2.3556874196084725,2.3611095587499089,2.3663176455248935]
[null,null,null,null,null,null,null,null,null,null,null,"Commercial","Warehouse","Process","Commercial-not-refrig-warehouse-Process","Warehouse Process",0,0.15339065184274966,0.31664130253628153,0.45796738170921292,0.58712677790718504,0.71332216161092432,0.8023455141506417,0.88775793214985332,0.96855299190250377,1.0436185328510128,1.1156822212509296,1.1853962501376472,1.2522423340496791,1.3172684059230164,1.3799397840802807,1.440386403953515,1.499247954536747,1.5562066830764505,1.6118162211859952,1.6648780329071493,1.7156068715393031,1.7641089858502419,1.8104855836522242,1.8548330817123213,1.8972433427248876,1.9378039000427505,1.9765981708249498,2.0137056582223081,2.0492021431876566,2.0831598664650297,2.1156477012815125,2.1467313172364935,2.1764733358558264,2.2049334782526717,2.2321687053125241,2.2582333507970431,2.283179247739699,2.3070558484858563,2.3299103387106941,2.3517877457301992,2.3727310414033309,2.3927812399072912,2.4119774906525553,2.4303571665899137,2.4479559481481501,2.4648079030281442,2.4809455620670446,2.4964461470626262,2.5113348080899836,2.5256357023627309,2.5393720334286685,2.5525660888181001,2.5652392762058938,2.5774121581459508,2.5891044854344507,2.6003352291559949,2.6111226114646535,2.6214841351498506,2.6314366120350652,2.6409961902554229,2.6501783804584367,2.6589980809704086,2.6674696019693251,2.6756066887034682,2.6834225437934145,2.6909298486536071,2.6981407840682574,2.7050670499549643,2.7117198843481125,2.7181100816328576,2.7242480100592772]
[null,null,null,null,null,null,null,null,null,null,null,"Commercial","Warehouse","Refrigeration","Commercial-not-refrig-warehouse-Refrig","Warehouse Refrigeration",0,0.13243383457183389,0.26577636274734784,0.38082777025069336,0.48638938142347932,0.58982731049359127,0.6594566121132972,0.72618058048042067,0.78929120227167981,0.84753921972529378,0.90350071352700334,0.95763341845879968,1.0093723269055541,1.0599936946456532,1.1089767835383086,1.1562296476912075,1.2022869379835008,1.2469568856889697,1.29037130847962,1.3317729232814455,1.3713128454912711,1.4090780544679302,1.445151289627937,1.4796112662870933,1.5125328800577784,1.5439874004305225,1.5740426541329287,1.6027631988255484,1.6302104876627583,1.656443025216974,1.6815165152365135,1.7054840006810292,1.728395996453542,1.7503006152246521,1.7712436867223957,1.7912688708403735,1.8104177648971189,1.8287300053611562,1.8462433643387206,1.8629938411046421,1.8790157489413597,1.8943417975363768,1.9090031711746549,1.9230296029494014,1.9364494452024164,1.9492897363935553,1.9615762645879289,1.9733777516634965,1.9847133458192627,1.9956014393316686,2.0060596983965095,2.0161050917927645,2.0257539184148516,2.03502183371798,2.0439238751195061,2.052474486397506,2.0606875411261587,2.0685763651859537,2.076153758385257,2.0834320152283112,2.0904229448633642,2.0971378902433022,2.1035877465298629,2.1097829787713001,2.1157336388821797,2.1214493819528553,2.1269394819150826,2.1322128465892041,2.1372780321372988,2.1421432569457659,2.1468164149598534]
[null,null,null,null,null,null,null,null,null,null,null,"Commercial","Warehouse","Ventilation","Commercial-not-refrig-warehouse-Vent","Warehouse Ventilation",0,0.14611082143649159,0.29745410678006023,0.42795242847173343,0.54754572102515475,0.665432666809185,0.74631161692859449,0.82385701275361078,0.89723290544747925,0.96522338398630214,1.0305252614662237,1.0936651665223711,1.1541366936460289,1.2130688428351826,1.2699890336894224,1.3248393225624038,1.3782564902433785,1.4300257515014114,1.4804315434992878,1.528515759366625,1.5744668140673088,1.6183828672216911,1.6603573690546578,1.7004792964739714,1.7388333768019546,1.7755002998310163,1.810556918835966,1.8440764411406438,1.8761286088030302,1.9067798699515202,1.9360935412753919,1.9641299621445181,1.9909466408070058,2.0165983930885614,2.0411374739939454,2.0646137025887294,2.0870745805187392,2.1085654045048416,2.129129373132213,2.1488076882356655,2.1676396511661178,2.1856627542076703,2.2029127674000577,2.2194238210073411,2.2352284838606038,2.2503578377900504,2.2648415483502071,2.2787534785780017,2.2921162009176372,2.3049513967101984,2.3172798913721535,2.3291216881850967,2.3404960007515578,2.3514212841695401,2.361915264976362,2.371994969910395,2.3816767535373602,2.3909763247860054,2.3999087724362269,2.4084885896009771,2.4167296972416938,2.4246454667553974,2.4322487416701066,2.4395518584837741,2.4465666666805537,2.4533045479568765,2.4597764346885285,2.4659928276686958,2.4719638131457553,2.4776990791884601,2.4832079314050626]
[null,null,null,null,null,null,null,null,null,null,null,"None - ele","None - ele","None - ele","None - ele","None - ele",0,0,0,0,0,0,0,0,0,0,0,0,0,0,0,0,0,0,0,0,0,0,0,0,0,0,0,0,0,0,0,0,0,0,0,0,0,0,0,0,0,0,0,0,0,0,0,0,0,0,0,0,0,0,0,0,0,0,0,0,0,0,0,0,0,0,0,0,0,0,0]

{"sheet":"Com LU Table","index":7,"n_rows":18,"n_cols":16,"rows_kept":18,"cut":false,"hidden":true,"merged":[]}
[null,"DEPRECATED - TAB NO LONGER IN USE"]
[null,null,"Compressed Air","Cooking","Cooling","Exterior Lighting","Heating","Hot Water","Indoor Lighting","Misc","Motors","Office Equipment","Process","Refrigeration","Ventilation","None"]
[null,"College","Commercial-college-AirComp","Commercial-college-Cook","Commercial-college-Cool","Commercial-college-ExtLight","Commercial-college-Heat","Commercial-college-HotWater","C-Unv-Lgt-LPD Int-All-All-C","Commercial-college-Misc","Commercial-college-Motors","Commercial-college-OffEquip","Commercial-college-Process","Commercial-college-Refrig","Commercial-college-Vent","None"]
[null,"Grocery","Commercial-Grocery-AirComp","Commercial-Grocery-Cook","Commercial-Grocery-Cool","Commercial-Grocery-ExtLight","Commercial-Grocery-Heat","Commercial-Grocery-HotWater","C-Gro-Lgt-LPD Int-All-All-C","Commercial-Grocery-Misc","Commercial-Grocery-Motors","Commercial-Grocery-OffEquip","Commercial-Grocery-Process","Commercial-Grocery-Refrig","Commercial-Grocery-Vent","None"]
[null,"Healthcare","Commercial-Healthcare-AirComp","Commercial-Healthcare-Cook","Commercial-Healthcare-Cool","Commercial-Healthcare-ExtLight","Commercial-Healthcare-Heat","Commercial-Healthcare-HotWater","C-Hos-Lgt-LPD Int-All-All-C","Commercial-Healthcare-Misc","Commercial-Healthcare-Motors","Commercial-Healthcare-OffEquip","Commercial-Healthcare-Process","Commercial-Healthcare-Refrig","Commercial-Healthcare-Vent","None"]
[null,"Lodging","Commercial-Lodging-AirComp","Commercial-Lodging-Cook","Commercial-Lodging-Cool","Commercial-Lodging-ExtLight","Commercial-Lodging-Heat","Commercial-Lodging-HotWater","C-Lod-Lgt-LPD Int-All-All-C","Commercial-Lodging-Misc","Commercial-Lodging-Motors","Commercial-Lodging-OffEquip","Commercial-Lodging-Misc","Commercial-Lodging-Refrig","Commercial-Lodging-Vent","None"]
[null,"Large Office","Commercial-large Office-AirComp","Commercial-large Office-Cook","Commercial-large Office-Cool","Commercial-large Office-ExtLight","Commercial-large Office-Heat","Commercial-large Office-HotWater","C-LOff-Lgt-LPD Int-All-All-C","Commercial-large Office-Misc","Commercial-large Office-Motors","Commercial-large Office-OffEquip","Commercial-large Office-Process","Commercial-large Office-Refrig","Commercial-large Office-Vent","None"]
[null,"Other","Commercial-Misc. Com-AirComp","Commercial-Misc. Com-Cook","Commercial-Misc. Com-Cool","Commercial-Misc. Com-ExtLight","Commercial-Misc. Com-Heat","Commercial-Misc. Com-HotWater","C-Oth-Lgt-LPD Int-All-All-C","Commercial-Misc. Com-Misc","Commercial-Misc. Com-Motors","Commercial-Misc. Com-OffEquip","Commercial-Misc. Com-Process","Commercial-Misc. Com-Refrig","Commercial-Misc. Com-Vent","None"]
[null,"Restaurant","Commercial-Resturant-AirComp","Commercial-Resturant-Cook","Commercial-Resturant-Cool","Commercial-Resturant-ExtLight","Commercial-Resturant-Heat","Commercial-Resturant-HotWater","C-Res-Lgt-LPD Int-All-All-C","Commercial-Resturant-Misc","Commercial-Resturant-Motors","Commercial-Resturant-OffEquip","Commercial-Resturant-Process","Commercial-Resturant-Refrig","Commercial-Resturant-Vent","None"]
[null,"Retail","Commercial-Retail-AirComp","Commercial-Retail-Cook","Commercial-Retail-Cool","Commercial-Retail-ExtLight","Commercial-Retail-Heat","Commercial-Retail-HotWater","C-Ret-Lgt-LPD Int-All-All-C","Commercial-Retail-Misc","Commercial-Retail-Motors","Commercial-Retail-OffEquip","Commercial-Retail-Process","Commercial-Retail-Refrig","Commercial-Retail-Vent","None"]
[null,"School","Commercial-School-AirComp","Commercial-School-Cook","Commercial-School-Cool","Commercial-School-ExtLight","Commercial-School-Heat","Commercial-School-HotWater","C-K12-Lgt-LPD Int-All-All-C","Commercial-School-Misc","Commercial-School-Motors","Commercial-School-OffEquip","Commercial-School-Process","Commercial-School-Refrig","Commercial-School-Vent","None"]
[null,"Small Office","Commercial-Small Office-AirComp","Commercial-Small Office-Cook","Commercial-Small Office-Cool","Commercial-Small Office-ExtLight","Commercial-Small Office-Heat","Commercial-Small Office-HotWater","C-SOff-Lgt-LPD Int-All-All-C","Commercial-Small Office-Misc","Commercial-Small Office-Motors","Commercial-Small Office-OffEquip","Commercial-Small Office-Process","Commercial-Small Office-Refrig","Commercial-Small Office-Vent","None"]
[null,"Warehouse","Commercial-not-refrig-warehouse-AirComp","Commercial-not-refrig-warehouse-Cook","Commercial-not-refrig-warehouse-Cool","Commercial-not-refrig-warehouse-ExtLight","Commercial-not-refrig-warehouse-Heat","Commercial-not-refrig-warehouse-HotWater","C-War-Lgt-LPD Int-All-All-C","Commercial-not-refrig-warehouse-Misc","Commercial-not-refrig-warehouse-Motors","Commercial-not-refrig-warehouse-OffEquip","Commercial-not-refrig-warehouse-Process","Commercial-not-refrig-warehouse-Refrig","Commercial-not-refrig-warehouse-Vent","None"]
[]
[]
[null,null,"How to lookup:"]
[null,null,"Select Sector","End Use","Load Profile"]
[null,null,"College","Cooling",{"$f":"INDEX(C3:O13, MATCH(C18, B3:B13, 0), MATCH(D18, C2:O2, 0))","v":"Commercial-college-Cool"}]