{"text_format":"1","workbook":"xlsx","n_sheets":8,"sheets":["User Terms and Conditions","Instructions","Calculator","Hidden Cells","Incentives","Lists","Avoided Costs","Com LU Table"],"not_rendered":{"charts":0,"images":0,"macros":1,"external_links":3,"defined_names":137,"comments":1,"pivot_tables":0},"unopened":[],"bounds":{"document_bytes":16777216,"sheet_cells":100000,"rows_first":2000,"rows_last":500,"rows_between":2000,"halvings":0,"cell_chars":16384,"cell_head_chars":4096},"cells_cut":0,"cells_raw":0,"read":"whole","date_system":"1900"}

{"sheet":"User Terms and Conditions","index":0,"n_rows":15,"n_cols":1,"rows_kept":15,"cut":false,"hidden":false,"merged":[]}
["EXISTING BUILDINGS ATAC COST-EFFECTIVENESS CALCULATOR TOOL TERMS AND CONDITONS OF USE:"]
[]
["·         This Existing Buildings ATAC Cost-Effectiveness (C/E) Calculator tool and its information (the Tool) was developed and is made available by Energy Trust of Oregon, Inc. (Energy Trust) to its authorized Existing Buildings Allied Technical Assistance Contractors (ATACs) for informational purposes only. Use of this Tool is subject to acceptance of these Terms and Conditions of Use. "]
[]
["·         This Tool is intended for the sole purpose of assisting ATACs with an initial, high-level C/E review to help inform ATAC’s discussion with Energy Trust’s Existing Buildings program management contractor (PMC) about whether a potential custom measure may be a good candidate to propose for additional technical analysis under the Existing Buildings program. "]
[]
["·         ATAC will only allow its trained employees to access and use the Tool and will not distribute the Tool to any other entity. Details about Energy Trust’s Existing Buildings C/E criteria, program or incentives as may be included in the Tool are time sensitive and subject to change. "]
[]
["·         ATAC will use the most current version of the Tool at all times and will immediately discontinue its use of the Tool if its Existing Buildings ATAC status is terminated."]
[]
{"$rows_left_out":6}
{"sheet":"Instructions","index":1,"n_rows":8,"n_cols":1,"rows_kept":8,"cut":false,"hidden":false,"merged":[[11,0,11,9],[10,0,10,9],[9,0,9,9],[8,0,8,9],[7,0,7,9],[18,0,18,9],[12,0,12,9],[13,0,13,9],[14,0,14,9],[15,0,15,9],[16,0,16,9],[17,0,17,9],[6,0,6,9],[0,0,0,9],[3,0,3,9],[2,0,2,9],[4,0,4,9],[5,0,5,9],[1,0,1,9]]}
["Instructions for use of Energy Trust Cost Effectiveness Calculator"]
["1. Enter the site utility information in the upper-right section of the calculator."]
["2. Enter the measure name or description in the first column."]
["3. Select the business type."]
["4. Choose the best appropriate load profile descriptors for when the savings happen."]
["    For example, choose \"Res Ele Resistance Heating\" for weatherization measures at a home with resistance heat, since the savings primarily happen during the heating season."]
["If there are no savings for a particular fuel, choose \"None\" for the load profile for that fuel."]
["5. Enter the measure life, estimated savings, incremental measure cost, annual non-energy benefit value (if any), and incentive in the remaining columns."]

{"sheet":"Calculator","index":2,"n_rows":26,"n_cols":12,"rows_kept":26,"cut":false,"hidden":false,"merged":[[25,0,26,0],[0,0,0,5],[1,0,1,5],[2,0,2,5],[3,2,3,3],[3,4,3,5],[4,1,4,5],[5,1,5,5],[25,1,26,9],[6,1,6,5],[12,0,13,0],[12,1,13,1],[12,2,13,2],[12,4,12,5],[12,11,13,11],[7,1,7,5],[9,1,9,5],[10,2,10,3],[10,4,10,5],[12,6,13,6],[12,7,12,8],[0,6,10,11],[12,9,13,9],[12,10,13,10]]}
["Energy Trust of Oregon",null,null,null,null,null,"Please read the Terms and Conditions of Use and the Instructions carefully before using this Tool. \n\nOnly active, approved Existing Buildings ATACs are allowed to access this Tool subject to the Terms and Conditions of Use. This Tool is intended for the sole purpose of assisting ATACs with an initial, high-level C/E review to help inform ATAC’s discussion with Energy Trust’s Existing Buildings PMC about whether a potential custom measure may be a good candidate for additional technical analysis under the Existing Buildings program. Details about Energy Trust’s Existing Buildings C/E criteria, program or incentives as may be included in the Tool are time sensitive and subject to change. Final determination about whether a proposed measure meets Energy Trust’s C/E criteria or may otherwise qualify for additional technical analysis or Energy Trust incentives rests solely with Energy Trust. "]
["ATAC Cost-Effectiveness Calculator Tool"]
["Commercial Sector "]
["Version: ",{"$f":"version","v":"v2025.1"},"Today's Date:"]
["ATAC Name:"]
["Customer Name:"," "]
["Project Name:"," "]
["Site Address:"]
["City:",null,"State",null,"Zip:"," "]
["Sector","Commercial"]
{"$rows_left_out":17}
{"sheet":"Hidden Cells","index":3,"n_rows":24,"n_cols":15,"rows_kept":24,"cut":false,"hidden":true,"merged":[[12,1,13,1],[12,2,13,2],[12,5,12,6],[12,0,13,0],[12,14,13,14]]}
[]
[]
[]
[]
[]
[]
[]
[]
[]
[]
{"$rows_left_out":15}
{"sheet":"Incentives","index":4,"n_rows":24,"n_cols":8,"rows_kept":24,"cut":false,"hidden":true,"merged":[]}
[]
["Existing Buildings Program 2017 Incentive Rules",null,null,null,null,null,"Utility Eligibility"]
["Project Type","$/kWh","$/therm","% of Cost Cap","Minimum Simple Payback (yrs)",null,"Electric","Gas"]
["Electric Only",0.22,0,0.6,1,null,{"$f":"ele_eligible","v":true},{"$f":"gas_eligible","v":true}]
["Gas Only",0,3,0.75,1]
["Dual Fuel",0.22,3,0.65,1]
["RCx Ele Only",0.15,0,0.6,0]
["RCx Gas Only",0,1.8,0.75,0]
["RCx Dual Fuel",0.15,1.8,0.75,0]
[]
{"$rows_left_out":15}
{"sheet":"Lists","index":5,"n_rows":29,"n_cols":17,"rows_kept":29,"cut":false,"hidden":true,"merged":[]}
["LOOKUPS",{"$f":"ROWS(_xlfn.ANCHORARRAY(B3))","v":11},null,null,{"$f":"ROWS(_xlfn.ANCHORARRAY(E3))","v":14},{"$f":"ROWS(_xlfn.ANCHORARRAY(F3))","v":16},{"$f":"ROWS(_xlfn.ANCHORARRAY(G3))","v":27},{"$f":"ROWS(_xlfn.ANCHORARRAY(H3))","v":6}]
["Sector","Commercial","Industrial","Residential","Com End Use","Ind End Use","Res End Use","Gas Load Profiles","Electric Utility","Gas Utility","Yes/No","State","Electric Rate:","Gas Rate:","None","Active Sub-sector","Active Elec End Use"]
["Commercial",{"$f":"_xlfn.UNIQUE(INDEX(_xlfn._xlws.FILTER('Avoided Costs'!$L$4:$P$188,ShapeSector=$B$2),,2))","v":"College"},"Not applicable","Not applicable",{"$f":"_xlfn.VSTACK(_xlfn.UNIQUE(INDEX(_xlfn._xlws.FILTER('Avoided Costs'!$L$4:$P$188,ShapeSector=$B$2),,3)),$O$3)","v":"Compressed Air"},{"$f":"_xlfn.VSTACK(_xlfn.TAKE(_xlfn._xlws.FILTER('Avoided Costs'!$L$4:$P$188,ShapeSector=$C$2),,-1),$O$3)","v":"Ag-Irrigation"},{"$f":"_xlfn.VSTACK(_xlfn.TAKE(_xlfn._xlws.FILTER('Avoided Costs'!$L$4:$P$188,ShapeSector=$D$2),,-1),$O$3)","v":"Res Refrigerator"},{"$f":"TRANSPOSE('Avoided Costs'!$B$2:$G$2)","v":"DHW"},"PGE","NWN","No","OR",0.16358127865305985,1.1665886823743341,"None - ele",{"$f":"INDIRECT(Calculator!$B$10)","v":"College"},{"$f":"OFFSET(Lists!$D$3,,MATCH(Calculator!$B$10,Lists!$A$3:$A$5,0),OFFSET(Lists!$D$1,,MATCH(Calculator!$B$10,Lists!$A$3:$A$5,0)))","v":"Compressed Air"}]
["Industrial","Grocery",null,null,"Cooking","Flat","Res Freezer","FLAT","PAC","NWN-Firm","Yes","WA",null,null,null,"Grocery","Cooking"]
["Residential","Healthcare",null,null,"Cooling","1-Shift Industrial","Res Dryer","Res Heating","Other","CNG",null,null,null,null,null,"Healthcare","Cooling"]
[null,"Lodging",null,null,"Exterior Lights","2-Shift Industrial","Res Clotheswasher","Com Heating",null,"Avista",null,null,null,null,null,"Lodging","Exterior Lights"]
[null,"Large Office",null,null,"Heating","3-Shift Industrial","Res Central AC","Clotheswasher",null,"Other",null,null,null,null,null,"Large Office","Heating"]
[null,"Other",null,null,"Hot Water","Cold Storage","Res Window AC","None",null,null,null,null,null,null,null,"Other","Hot Water"]
[null,"Restaurant",null,null,"Interior Lights","Food Products","Res Water Heat",null,null,null,null,null,null,null,null,"Restaurant","Interior Lights"]
[null,"Retail",null,null,"Other","Wood Products","Res HP Water Heat",null,null,null,null,null,null,null,null,"Retail","Other"]
{"$rows_left_out":20}
{"sheet":"Avoided Costs","index":6,"n_rows":188,"n_cols":87,"rows_kept":188,"cut":false,"hidden":true,"merged":[[1,8,1,9],[1,16,1,23],[1,25,1,26],[8,8,8,9]]}
["Gas Avoided Costs",null,null,null,null,null,null,null,null,null,null,null,null,null,"Electric Avoided Costs"]
["Lifetime","DHW","FLAT","Res Heating","Com Heating","Clotheswasher","None",null,"Gas Avoided Cost Info",null,null,null,null,null,null,null,"Lifetime (yrs)",null,null,null,null,null,null,null,null,"Electric Avoided Cost Info"]
[1,1.4104576543049419,1.3266310501664833,2.0159526696608738,1.9907115922220784,1.3710050781643239,0,null,"Updated on","2025-01-21",null,"Sector","Subsector","End Use","Load Profile Name","Friendly Name",0,1,2,3,4,5,6,7,8,9,10,11,12,13,14,15,16,17,18,19,20,21,22,23,24,25,26,27,28,29,30,31,32,33,34,35,36,37,38,39,40,41,42,43,44,45,46,47,48,49,50,51,52,53,54,55,56,57,58,59,60,61,62,63,64,65,66,67,68,69,70]
[2,2.7418415159690075,2.5776409728367407,3.9277508849556213,3.8780457394151777,2.6649357185780902,0,null,"Base Year","2025$",null,"Residential","Not applicable","Not applicable","R-All-Ref-Refrig-All-All-C","Res Refrigerator",0,0.13618744729744195,0.27495246384631106,0.39490771126821284,0.50529685105289879,0.61415074339928277,0.68758257942297507,0.75797228098845537,0.82459948828687124,0.88619112181587933,0.94537302407041712,1.0025429507559724,1.0572477195876111,1.1107063724105464,1.1624418216031494,1.2122959194837055,1.2608450309703489,1.3079250516278036,1.3536560140090561,1.3972681570598635,1.4389281329920829,1.4787266889148007,1.5167501712940499,1.5530807488672551,1.5877966237897647,1.6209722316575477,1.6526784310138201,1.682982682913172,1.7119492210845118,1.7396392132037732,1.7661109137586803,1.7914198089608828,1.8156187541353197,1.8387581039926832,1.8608858361682434,1.8820476683889598,1.9022871696107118,1.9216458654485162,1.940163338204713,1.9578773217832472,1.9748237917622697,1.9910370508822655,2.0065498101927828,2.0213932660874678,2.0355971734445326,2.0491899150778754,2.0621985676928758,2.0746936715397695,2.0866955002275933,2.0982235270144765,2.109296456403472,2.1199322544910673,2.1301481781176115,2.1399608028669577,2.1493860499607491,2.1584392120909874,2.1671349782327978,2.1754874574776442,2.1835102019256771,2.1912162286743393,2.1986180409389275,2.2057276483393582,2.2125565863860688,2.2191159351966641,2.2254163374736744,2.2314680157725983,2.2372807890882496,2.2428640887863103,2.2482269739059535,2.2533781458583535,2.2583259625449346]
[3,4.0560819849408736,3.8145352571443287,5.8006810627795362,5.7276858857675084,3.9427726859722552,0,null,"Discount Rate",4.1000000000000002E-2,null,"Residential","Not applicable","Not applicable","R-All-Ref-Freezer-All-All-R","Res Freezer",0,0.13537443097366775,0.27331562635893369,0.39269525200076127,0.50280477326522222,0.6112167101442183,0.68410820274572437,0.75398894051897125,0.82008714210304712,0.8811716597602226,0.93989436315930508,0.99658243317667394,1.0508745804950068,1.1039382144836869,1.1553198638170956,1.2048043618994253,1.2529708845640473,1.2996378080983695,1.3450018713872338,1.3882564924320469,1.4295769723926037,1.4690531202345456,1.5067703946231148,1.5428101240602508,1.5772497154106577,1.6101628514518866,1.6416196780476986,1.6716869815102613,1.7004283566849629,1.7279043662616815,1.7541726917881215,1.779288276834228,1.8033034627316078,1.8262681172882409,1.8482297568564803,1.8692336621113106,1.8893229878760298,1.9085388673138171,1.9269205107860337,1.944505299661474,1.9613288753451099,1.9774252237800798,1.9928267556627191,2.0075643825972684,2.0216675894044784,2.035164502786607,2.0480819565402451,2.0604894618266139,2.0724071501239618,2.0838543581705928,2.0948496593391943,2.1054108937725835,2.1155551973297722,2.1252990293893137,2.1346581995550435,2.1436478933075462,2.1522826966429629,2.160576619739127,2.168543119687417,2.1761951223272109,2.1835450432183778,2.1906048077858231,2.197385870668779,2.2038992343062356,2.2101554667886636,2.2161647190050009,2.2219367411127107,2.2274808983576539,2.2328061862694231,2.2379212452568105,2.2428343746270798]
[4,5.2966050044216217,4.9810416878814641,7.5757898346336701,7.4802594825195108,5.148787203419869,0,null,"Source","Link",null,"Residential","Not applicable","Not applicable","R-All-Plug-Dryer-All-All-R","Res Dryer",0,0.15409002404019834,0.34257038560876218,0.50911380163428688,0.66198947193964819,0.81073796143007759,0.92520546132889681,1.0348312671027933,1.1389019267303444,1.2370279995577622,1.3310384619013842,1.4218168890548866,1.508543360259494,1.5928033812222329,1.6740924565166528,1.7525323615413448,1.8282265385844214,1.9019146241196025,1.972992094495412,2.0409502029648392,2.1059886679077695,2.1682367757112471,2.2278178713434653,2.28484964320119,2.3394443936798357,2.3917092962131399,2.4417466394887981,2.489654059508084,2.5355247601213433,2.5794477226370724,2.6215079050700716,2.661786431563709,2.7003607724925884,2.7373049157247484,2.7726895294968905,2.8065821173318968,2.8390471654050122,2.8701462827434518,2.8999383346237462,2.9284795695118535,2.9558237398727973,2.9820222171593618,3.0071241012730594,3.0311763247751946,3.054223752111251,3.0763092740980746,3.097473897910294,3.1178029957992761,3.1373295522193914,3.1560852494820129,3.1741005191608349,3.1914045914678391,3.2080255426800224,3.2239903406938382,3.2393248887812605,3.2540540676184739,3.2682017756553705,3.2817909678913675,3.2948436931204492,3.3073811297058704,3.3194236199425635,3.3309907030630064,3.3421011469401005,3.3527729785385003,3.3630235131638004,3.3728693825570386,3.3823265618800988,3.3914103956357997,3.4001356225647221,3.4085163995591725,3.4165663246330849]
[5,6.490515570619622,6.1038949410513386,9.2829099737409688,9.1657131665584295,6.3096103412003588,0,null,"Inputs","Inputs received from OPUC in new Avoided Cost Input Template",null,"Residential","Not applicable","Not applicable","R-All-WH-Cwash-All-All-R","Res Clotheswasher",0,0.14869484178000522,0.30877267953942611,0.44817689620991635,0.57664926270741368,0.70275117475598137,0.79171081058988046,0.87703567345239886,0.95789526375225864,1.0330313180456128,1.1052426810665761,1.1749628596372843,1.2418008532036262,1.3068292008163724,1.369642113154365,1.4301420843324684,1.4889673672127317,1.5458908246078296,1.6012548676880261,1.6540960532499771,1.7046185739108037,1.7529277806513355,1.799124038875425,1.8433029749345637,1.8855557099207001,1.9259690814113342,1.9646258538129591,2.0016049179130886,2.0369814802173187,2.0708272426160059,2.1032105728950738,2.1341966665771217,2.1638477005522532,2.1922229789328167,2.2193790715424355,2.2453699454272571,2.2702470897561411,2.2940596344565112,2.3168544629137249,2.3386763190439721,2.3595679090339376,2.3795699980245337,2.398721502001067,2.4170595751380128,2.4346196928332371,2.4514357306538548,2.4675400394040259,2.4830085906960937,2.4978664826296906,2.5121378224948301,2.5258457658865692,2.5390125542755224,2.5516595510951876,2.563807276404634,2.5754754401827982,2.5866829743084003,2.5974480632773771,2.6077881737076689,2.6177200826792295,2.6272599049552459,2.636423119128732,2.6452245927369211,2.6536786063842075,2.6617988769127701,2.6695985796584831,2.6770903698282207,2.6842864030332318,2.691198355011919,2.6978374405740042,2.7042144317968315,2.7103396755033224]
[6,7.6500681848975915,7.1951144060249153,10.936008527450992,10.798038339048707,7.437261983575012,0,null,null,null,null,"Residential","Not applicable","Not applicable","R-All-HVAC-CAC-All-All-E","Res Central AC",0,0.33408606205268782,0.79182959837618105,1.2049397587452386,1.5965387473882895,1.9923972298266401,2.3092341183317848,2.613618209094819,2.9042578134487287,3.1794480023450338,3.4440426952585512,3.6977464122848902,3.9421297326215674,4.1771112767936227,4.4034356219021538,4.6197528899069535,4.8283733595833178,5.0290772666965173,5.2232727099678486,5.4090682748656125,5.5872541893716177,5.7581473243390047,5.922051050898026,6.0792558331864814,6.2300397940624821,6.3746692550854096,6.5133992519868684,6.6464740267926992,6.7741274976995349,6.896583707754826,7.0140572533374606,7.1267536933870463,7.2348699402833434,7.3385946332331606,7.4381084949801446,7.5335846726131122,7.6251890632108408,7.7130806250254382,7.7974116748724054,7.8783281723632399,7.955969991585798,8.0304711808085276,8.1019602107570634,8.1705602119854372,8.2363892018392146,8.2995603014842221,8.3601819434519697,8.4184103960192047,8.4743401362624411,8.5280619115417,8.5796628867402962,8.6292267856919782,8.6768340270248796,8.7225618546426897,8.7664844630547609,8.8086731177585094,8.8491962708694007,8.888119672186173,8.9255064758714795,8.9614173429210471,8.9959105395876175,9.0290420319193565,9.0608655765661119,9.0914328080008975,9.1207933222980699,9.1489947576041608,9.176082871431932,9.2021016149030412,9.2270932040598055,9.2510981883617607,9.2741555164781335]
[7,8.7759515021988221,8.2552682805075204,12.536633192607233,12.378740047744673,8.5323855885606648,0,null,"Electric Avoided Cost Info",null,null,"Residential","Not applicable","Not applicable","R-All-HVAC-RAC-All-All-E","Res Window AC",0,0.35112209418449836,0.83983250261313702,1.2820674095730571,1.7014597819929569,2.12432936980067,2.4663497841451876,2.7949374904134974,3.1087801612737822,3.4061930787220605,3.6921263697453326,3.96635324408811,4.2304652344450364,4.4843722121438541,4.7288687378639729,4.9626179579374403,5.1880118025228503,5.4048032353753861,5.6145213677046346,5.8152222765423796,6.007723748508897,6.1923660205355073,6.369474902361203,6.5393624061834634,6.702327347815257,6.8586559206935052,7.0086222440177908,7.1524888862350533,7.2905073650262322,7.4229186248940886,7.5499534933976404,7.6718331170276084,7.7887693776688076,7.9009652905494736,8.0086153845338686,8.1119060655731001,8.2110159640897677,8.3061162670347013,8.3973710353186366,8.4849375072879756,8.5689663888818064,8.6496021310769553,8.7269831951990557,8.8012423066500531,8.8725066975766733,8.9408983389794336,9.0065341627383759,9.0695788498567538,9.1301346918684505,9.1882999420958029,9.2441689750679981,9.2978324396460366,9.3493774061027057,9.3988875073962124,9.4464430748666821,9.4921212685757101,9.5359962025004332,9.5781390647852493,9.6186182332463162,9.6574993863162106,9.6948456096087803,9.7307174982770821,9.76517325533049,9.7982687860704836,9.8300577887983618,9.8605918419420338,9.8899204877432751,9.9180913126412111,9.9451500244824711,9.9711405266832784,9.9961049894638059]
[8,9.8614730634943299,9.2776733018447661,14.078028157177354,13.900992982338341,9.5883827782203266,0,null,"Updated on","2025-01-21",null,"Residential","Not applicable","Not applicable","Residential-res-Water Heating","Res Water Heat",0,0.14048841060178532,0.2844001418111019,0.40859921093834883,0.52192212933026183,0.63245697658325739,0.7089081523197508,0.78219276566552876,0.85151611572227148,0.91575363655147812,0.97741899566993196,1.0371079364622613,1.094171827935714,1.1498793431399938,1.2036968015433045,1.2556733991386446,1.3062915715029308,1.3554408972485723,1.403256261049328,1.4488806064068644,1.4924689746585105,1.5341156712002837,1.5739104457985171,1.6119387224779009,1.6482818173154445,1.6830171448003581,1.7162184133827318,1.7479558107989237,1.7782961797285881,1.8073031843072127,1.8350374679887353,1.8615568032251986,1.8869162334043721,1.9111682074617244,1.934362707559985,1.9565473702077163,1.9777676011677343,1.9980666844868094,2.0174858859597746,2.0360645513239044,2.0538401994631279,2.070848610886304,2.0871239117292477,2.1026986535165655,2.1176038889064137,2.1318692436291347,2.1455229848192294,2.1586377107726396,2.1712347004502979,2.1833343927734736,2.1949564197864175,2.2061196385098292,2.2168421615368312,2.2271413864210898,2.2370340239047692,2.2465361250321148,2.2556631071926616,2.2644297791363246,2.2728503650009508,2.2809385273913323,2.2887073895471119,2.2961695566355558,2.3033371362037474,2.3102217578233724,2.3168345919599829,2.323186368097347,2.3292873921462998,2.3351475631663292,2.3407763894270435,2.3461830038355673,2.3513761787549066]
{"$rows_left_out":179}
{"sheet":"Com LU Table","index":7,"n_rows":18,"n_cols":16,"rows_kept":18,"cut":false,"hidden":true,"merged":[]}
[null,"DEPRECATED - TAB NO LONGER IN USE"]
[null,null,"Compressed Air","Cooking","Cooling","Exterior Lighting","Heating","Hot Water","Indoor Lighting","Misc","Motors","Office Equipment","Process","Refrigeration","Ventilation","None"]
[null,"College","Commercial-college-AirComp","Commercial-college-Cook","Commercial-college-Cool","Commercial-college-ExtLight","Commercial-college-Heat","Commercial-college-HotWater","C-Unv-Lgt-LPD Int-All-All-C","Commercial-college-Misc","Commercial-college-Motors","Commercial-college-OffEquip","Commercial-college-Process","Commercial-college-Refrig","Commercial-college-Vent","None"]
[null,"Grocery","Commercial-Grocery-AirComp","Commercial-Grocery-Cook","Commercial-Grocery-Cool","Commercial-Grocery-ExtLight","Commercial-Grocery-Heat","Commercial-Grocery-HotWater","C-Gro-Lgt-LPD Int-All-All-C","Commercial-Grocery-Misc","Commercial-Grocery-Motors","Commercial-Grocery-OffEquip","Commercial-Grocery-Process","Commercial-Grocery-Refrig","Commercial-Grocery-Vent","None"]
[null,"Healthcare","Commercial-Healthcare-AirComp","Commercial-Healthcare-Cook","Commercial-Healthcare-Cool","Commercial-Healthcare-ExtLight","Commercial-Healthcare-Heat","Commercial-Healthcare-HotWater","C-Hos-Lgt-LPD Int-All-All-C","Commercial-Healthcare-Misc","Commercial-Healthcare-Motors","Commercial-Healthcare-OffEquip","Commercial-Healthcare-Process","Commercial-Healthcare-Refrig","Commercial-Healthcare-Vent","None"]
[null,"Lodging","Commercial-Lodging-AirComp","Commercial-Lodging-Cook","Commercial-Lodging-Cool","Commercial-Lodging-ExtLight","Commercial-Lodging-Heat","Commercial-Lodging-HotWater","C-Lod-Lgt-LPD Int-All-All-C","Commercial-Lodging-Misc","Commercial-Lodging-Motors","Commercial-Lodging-OffEquip","Commercial-Lodging-Misc","Commercial-Lodging-Refrig","Commercial-Lodging-Vent","None"]
[null,"Large Office","Commercial-large Office-AirComp","Commercial-large Office-Cook","Commercial-large Office-Cool","Commercial-large Office-ExtLight","Commercial-large Office-Heat","Commercial-large Office-HotWater","C-LOff-Lgt-LPD Int-All-All-C","Commercial-large Office-Misc","Commercial-large Office-Motors","Commercial-large Office-OffEquip","Commercial-large Office-Process","Commercial-large Office-Refrig","Commercial-large Office-Vent","None"]
[null,"Other","Commercial-Misc. Com-AirComp","Commercial-Misc. Com-Cook","Commercial-Misc. Com-Cool","Commercial-Misc. Com-ExtLight","Commercial-Misc. Com-Heat","Commercial-Misc. Com-HotWater","C-Oth-Lgt-LPD Int-All-All-C","Commercial-Misc. Com-Misc","Commercial-Misc. Com-Motors","Commercial-Misc. Com-OffEquip","Commercial-Misc. Com-Process","Commercial-Misc. Com-Refrig","Commercial-Misc. Com-Vent","None"]
[null,"Restaurant","Commercial-Resturant-AirComp","Commercial-Resturant-Cook","Commercial-Resturant-Cool","Commercial-Resturant-ExtLight","Commercial-Resturant-Heat","Commercial-Resturant-HotWater","C-Res-Lgt-LPD Int-All-All-C","Commercial-Resturant-Misc","Commercial-Resturant-Motors","Commercial-Resturant-OffEquip","Commercial-Resturant-Process","Commercial-Resturant-Refrig","Commercial-Resturant-Vent","None"]
[null,"Retail","Commercial-Retail-AirComp","Commercial-Retail-Cook","Commercial-Retail-Cool","Commercial-Retail-ExtLight","Commercial-Retail-Heat","Commercial-Retail-HotWater","C-Ret-Lgt-LPD Int-All-All-C","Commercial-Retail-Misc","Commercial-Retail-Motors","Commercial-Retail-OffEquip","Commercial-Retail-Process","Commercial-Retail-Refrig","Commercial-Retail-Vent","None"]
{"$rows_left_out":8}