{"text_format":"1","workbook":"xlsx","n_sheets":17,"sheets":["Instructions","1. Cover Page","2. Energy & Economic Summary","3. Utility Data","4. Measure Details","4A. Baseline Descriptions - RCx","4B. Other Opportunities","5. Appendix","Analysis","Logged Data","Lists","CEC Calcs","Lists_CEC","GAS AC","ELE AC","Com LU Table","Common Rates"],"not_rendered":{"charts":2,"images":4,"macros":1,"external_links":2,"defined_names":136,"comments":2,"pivot_tables":0},"unopened":[],"bounds":{"document_bytes":16777216,"sheet_cells":100000,"rows_first":2000,"rows_last":500,"rows_between":2000,"halvings":0,"cell_chars":16384,"cell_head_chars":4096},"cells_cut":0,"cells_raw":0,"read":"whole","date_system":"1900"}

{"sheet":"Instructions","index":0,"n_rows":46,"n_cols":14,"rows_kept":46,"cut":false,"hidden":false,"merged":[[45,0,45,3],[0,0,39,10],[41,0,41,3],[42,0,42,3],[43,0,43,3],[44,0,44,3]]}
["Energy Trust of Oregon's Existing Buidings Program\nCustom Project Service Description\n1/16/2024\n\nStreamlined Technical Analysis Study (TAS)\n\nOverview: The Streamlined TAS is a path for Existing Buildings Allied Technical Assistance Contractors (ATACs) to complete studies for low complexity sites or stand-alone systems without the full requirements of the standard TAS process. This format is only applicable to Excel spreadsheet models with options for data-logging as needed. Excel spreadsheet models must be clearly annotated, with all variables defined and linked to the final energy savings estimates. Savings determined through simulation modeling and proprietary calculation systems must use the standard TAS process.\n\nBenefits:\nThe Streamlined TAS will reduce study preparation time by using this simple Excel-based template in place of the standard TAS template for qualifying projects. The goals of the Streamlined TAS format are to 1) expedite turnaround for incentive offers to participants, 2) bring down study costs and 3) minimize risk to evaluated savings.\n\nParameters:\n- Less than 200,000 kWh and/or 5,000 therms of estimated annual savings\n- Eligible for both capital improvement and retrocommissioning (RCx) custom project types.\n- Suitable for low complexity sites or stand-alone systems only.\n\nHow to Use this Workbook:\n- Sheets that are numbered and blue represent program required information.\n- Cells that require user inputs are shaded blue.\n- Irrelevant sections in this document should be hidden rather than deleted.\n- All the rigor of a TAS analysis is required for the streamlined TAS, so assumptions must be clearly defined and the analysis laid out in a manner that is easy to follow.\n\nSubmission:\n- Make sure to update the headers and footers for each worksheet.\n- Select and print the worksheets that are blue and numbered.\n- This workbook should be submitted to Energy Trust as an excel file, and as a pdf.\n- Appendix items (spec sheets, quotes) should be included in the final pdf.\n\n",null,null,null,null,null,null,null,null,null,null,null,"Version","Date"]
[null,null,null,null,null,null,null,null,null,null,null,null,"Draft","2024-01-16"]
[]
[]
[]
[]
[]
[]
[]
[]
[]
[]
[]
[]
[]
[]
[]
[]
[]
[]
[]
[]
[]
[]
[]
[]
[]
[]
[]
[]
[]
[]
[]
[]
[]
[]
[]
[]
[]
[]
[]
["White Background Black Text",null,null,null,"Standard text/Calculated Values"]
["Turquoise Background Bold Black Text",null,null,null,"Table Heading"]
["Grey Background Bold Black Text",null,null,null,"Table Calculated Total Value"]
["Light Grey Background Orange Text",null,null,null,"Notes for Engineer completing the workbook"]
["Light Blue Background Black Text",null,null,null,"User Input"]

{"sheet":"1. Cover Page","index":1,"n_rows":42,"n_cols":11,"rows_kept":42,"cut":false,"hidden":false,"merged":[[14,0,14,9],[0,0,1,7],[41,0,49,9],[23,0,39,9],[0,8,1,9],[17,3,17,8],[16,3,16,8],[15,3,15,8],[21,1,21,9],[12,7,12,9],[11,7,11,9],[10,7,10,9],[9,7,9,9],[11,2,11,4],[12,2,12,4],[8,7,8,9],[18,3,18,8],[19,3,19,8],[3,1,3,2],[5,1,5,2],[4,1,4,3],[6,1,6,3],[7,7,7,9],[6,7,6,9],[5,7,5,9],[10,2,10,4],[9,2,9,4],[8,2,8,4],[3,5,3,6],[4,5,4,6],[3,7,3,8],[4,7,4,8]]}
["STREAMLINED TECHNICAL ANALYSIS STUDY",null,null,null,null,null,null,null,null,null,"Fill out all light blue boxes."]
[]
[]
[null,"Project Name",null,null,null,"Report Date:",null,"Project #:",null,null,"Project Name and Site Name are place holders. Update with the relevant information for your project."]
[null,null,null,null,null,null,null,"CU-xxxxxx"]
[null,"Site Name"]
[null,"Test",null,null,null,null,"Energy Advisor:"]
[null,null,null,null,null,null,"Phone:",null,null,null,"Fill in contact info for the EA, Site Contact, and ATAC filling the workbook out."]
[null,"Site Contact:",null,null,null,null,"Email:"]
[null,"Phone:",null,null,null,null,"ATAC:"]
[null,"Email:",null,null,null,null,"Company:"]
[null,"Site Address:",null,null,null,null,"Email:"]
[null,null,null,null,null,null,"Phone:"]
[]
["After performing an energy study at your facility, the following energy efficiency measures were identified:"]
[null,null,"EEM 1 - ","Test 1",null,null,null,null,null,null,"Input the EEM Titles. Hide rows of unused EEMs. Rename EEM to RCX as appropriate, "]
[null,null,"EEM 2 -",null,null,null,null,null,null,null,"measure numbering should remain the same, ie. If EEM2 is RCX, should be named RCX2 even "]
[null,null,"EEM 3 -",null,null,null,null,null,null,null,"when EEM1 is not RCX"]
[null,null,"EEM 4 -"]
[null,null,"EEM 5 -"]
[]
[null,{"$f":"CONCATENATE(\"These measures provide a simple payback of \",TEXT('2. Energy & Economic Summary'!L24,\"#.#\"),\" years with Energy Trust incentives.\")","v":"These measures provide a simple payback of . years with Energy Trust incentives."}]
[]
["Next Steps for the Participant: Selecting EEMs and applying for Custom Incentives\n\n1. Evaluate proposed Energy Efficiency Measures (EEMs) and submit contractor bids\n- The participant will evaluate the recommended EEMs contained in the TAS and estimated incentives in the accompanying Form 110C - Pre-Bid Project Estimates and select the EEMs they wish to implement.\n- The participant must obtain bids from contractors for the EEM(s) they wish to implement and send a copy of the final bid to the Energy Advisor. \n- The Program Management Contractor (PMC) will review the contractor’s proposed scope and costs to determine compliance with Existing Buildings program requirements, alignment with the EEMs as described in this TAS and to ensure that the EEMs still meet cost-effectiveness criteria. \n-  If the bids are found satisfactory and in accordance with Existing Buildings program requirements, the PMC will issue Form 120C - Custom Incentive Offer for participant review and signature. The 120C details the approved measures and estimated incentives as well as Energy Trust’s terms and conditions for Existing Buildings custom incentives. \n- To apply for an incentive reservation, the customer must return the signed Form 120C - Custom Incentive Offer to the PMC by the submittal deadline listed and BEFORE issuing purchase orders or beginning the project work. Measure equipment or services purchased or contracted prior to Participant signing and returning the form 120C are done at-risk. Associated costs will not be included as an eligible project cost for the purposes of Energy Trust's incentive calculations if purchased more than 1 year before the date of Energy Trust's pre-authorization signature as noted on the 120C. \n\n2. Notify Existing Buildings PMC upon Installation of EEM(s) and submit completion documentation\n -  The participant must notify the PMC once the installation of EEMs is completed along with paid final invoices before the project’s incentive reservation expiration date as noted on Form 120C - Custom Incentive Offer.   \n- A post-installation verification (PIV) of the installed EEMs may be required. \n- PMC will issue Form 140C - Project Completion Certification upon receipt of required project documenation and completion of PIV.\n- Incentive payment will be issued once signed 140C - Project Completion Certification has been submitted to PMC."]
[]
[]
[]
[]
[]
[]
[]
[]
[]
[]
[]
[]
[]
[]
[]
[]
[]
["Disclaimer\nThis energy analysis is funded by Energy Trust of Oregon to help the participant (customer) identify energy savings potential at their facility. TRC is the Program Management Contractor for the Existing Buildings Program. TRC will work with the Allied Technical Assistance Contractor (ATAC) to review the accuracy of this study. If the energy efficiency upgrades (measures) recommended in this report are eligible for Energy Trust incentives and if the participant wishes to implement the eligible measures, TRC will support and provide guidance to the participant on Energy Trust’s incentive application process and requirements throughout the life of the project.\nThe intent of this energy analysis is to estimate energy savings associated with the recommended energy efficiency upgrades. This report is not intended to serve as a detailed engineering design document. Any description of proposed improvements that may be diagrammatic in nature are for the purpose of documenting the basis of cost and savings estimates for potential energy efficiency measures only. Detailed design efforts may be required by the participant to implement measures recommended as part of this energy analysis. While the recommendations in this study have been reviewed for technical accuracy and are believed to be reasonably accurate, all findings listed are estimates only. Actual savings and incentives may vary based on final installed measures and costs, actual operating hours, energy rates and usage.  \nIn no event will Energy Trust of Oregon, TRC or the ATAC be liable for (i) the inability of the participant to achieve the estimated energy savings or any other estimated benefits included herein, or (ii) for any damages to participant’s site, including, but not limited to, any incidental or consequential damages of any kind, in connection with this report or the installation of any identified energy efficiency measures. "]

{"sheet":"2. Energy & Economic Summary","index":2,"n_rows":81,"n_cols":15,"rows_kept":81,"cut":false,"hidden":false,"merged":[[40,14,42,14],[43,14,44,14],[15,1,17,1],[53,9,53,11],[15,8,17,8],[32,6,34,6],[32,4,32,5],[33,5,34,5],[32,2,34,2],[32,3,34,3],[32,1,34,1],[33,4,34,4],[31,1,31,6],[50,2,50,6],[15,9,17,9],[15,10,15,11],[15,2,15,3],[15,4,15,5],[15,6,17,6],[15,7,17,7],[16,2,17,2],[16,3,17,3],[16,4,17,4],[16,5,17,5],[1,1,1,2],[2,5,2,7],[13,1,13,3],[7,4,8,4],[9,4,10,4],[9,5,10,7],[1,4,1,12],[2,11,2,12],[3,11,4,12],[3,10,4,10],[3,9,4,9],[5,4,6,4],[5,11,6,12],[7,10,8,10],[7,9,8,9],[7,8,8,8],[74,2,74,6],[76,9,76,11],[3,8,4,8],[3,5,4,7],[3,4,4,4],[9,9,10,9],[9,10,10,10],[9,11,10,12],[11,4,12,4],[11,5,12,7],[11,8,12,8],[11,9,12,9],[11,10,12,10],[11,11,12,12],[54,9,54,11],[55,9,55,11],[9,8,10,8],[7,11,8,12],[7,5,8,7],[5,10,6,10],[5,9,6,9],[5,8,6,8],[5,5,6,7],[66,2,66,6],[42,8,42,11],[43,9,43,11],[17,14,19,14],[64,9,64,11],[66,8,66,11],[58,2,58,6],[58,8,58,11],[42,2,42,6],[56,9,56,11],[47,9,47,11],[48,9,48,11],[50,8,50,11],[51,9,51,11],[16,11,17,11],[16,10,17,10],[67,9,67,11],[68,9,68,11],[69,9,69,11],[59,9,59,11],[31,9,33,10],[52,9,52,11],[60,9,60,11],[61,9,61,11],[62,9,62,11],[63,9,63,11],[44,9,44,11],[46,9,46,11],[80,9,80,11],[70,9,70,11],[71,9,71,11],[72,9,72,11],[74,8,74,11],[75,9,75,11],[78,9,78,11],[79,9,79,11],[77,9,77,11]]}
[]
[null,"Facility description",null,null,"EEM Summary",null,null,null,null,null,null,null,null,null,"White backgroud cells in tables should automatically populate."]
[null,"Site Name ",{"$f":"'1. Cover Page'!B7","v":"Test"},null,"EEM/RCX","Title",null,null,"Savings Type","Measure Type","Measure Life","Incentive Rates"]
[null,"Facility Type (e.g., office, grocery etc.)","Hotel/Multifamily",null,1,{"$f":"IF('1. Cover Page'!D16=\"\",\"\",'1. Cover Page'!D16)","v":"Test 1"},null,null,{"$f":"IF(F4=\"\",\"\",IF(AND($C$9<>\"\",$C$9<>\"Other\",$C$10<>\"None\",$C$10<>\"\"),\"Gas & Electric\",IF(AND($C$9<>\"\",$C$9<>\"Other\"),\"Electric\",IF(AND($C$10<>\"None\",$C$10<>\"\"),\"Gas\",\"\"))))","v":"Gas & Electric"},"Capital",15,{"$f":"IF(I4=\"\",\"\",IF(J4=\"Capital\",VLOOKUP(I4,Lists!$C$9:$G$11,5),VLOOKUP(I4,Lists!$C$12:$G$14,5)))","v":"Capital project Gas & Electric incentives are $0.45/kWh and $5.00/therm with a cap of 90% project costs."}]
[null,"Year Built",1987]
[null,"Number of Floors",4,null,2,{"$f":"IF('1. Cover Page'!D17=\"\",\"\",'1. Cover Page'!D17)","v":""},null,null,{"$f":"IF(F6=\"\",\"\",IF(AND($C$9<>\"\",$C$9<>\"Other\",$C$10<>\"None\",$C$10<>\"\"),\"Gas & Electric\",IF(AND($C$9<>\"\",$C$9<>\"Other\"),\"Electric\",IF(AND($C$10<>\"None\",$C$10<>\"\"),\"Gas\",\"\"))))","v":""},null,null,{"$f":"IF(I6=\"\",\"\",IF(J6=\"Capital\",VLOOKUP(I6,Lists!$C$9:$G$11,5),VLOOKUP(I6,Lists!$C$12:$G$14,5)))","v":""}]
[null,"Total Building Area (sq.ft.)",75000]
[null,"Area Affected by Proposed Measure(s) (sq.ft.)",75000,null,3,{"$f":"IF('1. Cover Page'!D18=\"\",\"\",'1. Cover Page'!D18)","v":""},null,null,{"$f":"IF(F8=\"\",\"\",IF(AND($C$9<>\"\",$C$9<>\"Other\",$C$10<>\"None\",$C$10<>\"\"),\"Gas & Electric\",IF(AND($C$9<>\"\",$C$9<>\"Other\"),\"Electric\",IF(AND($C$10<>\"None\",$C$10<>\"\"),\"Gas\",\"\"))))","v":""},null,null,{"$f":"IF(I8=\"\",\"\",IF(J8=\"Capital\",VLOOKUP(I8,Lists!$C$9:$G$11,5),VLOOKUP(I8,Lists!$C$12:$G$14,5)))","v":""}]
[null,"Electric Utility Provider","PGE"]
[null,"Gas Utility Provider","Cascade",null,4,{"$f":"IF('1. Cover Page'!D19=\"\",\"\",'1. Cover Page'!D19)","v":""},null,null,{"$f":"IF(F10=\"\",\"\",IF(AND($C$9<>\"\",$C$9<>\"Other\",$C$10<>\"None\",$C$10<>\"\"),\"Gas & Electric\",IF(AND($C$9<>\"\",$C$9<>\"Other\"),\"Electric\",IF(AND($C$10<>\"None\",$C$10<>\"\"),\"Gas\",\"\"))))","v":""},null,null,{"$f":"IF(I10=\"\",\"\",IF(J10=\"Capital\",VLOOKUP(I10,Lists!$C$9:$G$11,5),VLOOKUP(I10,Lists!$C$12:$G$14,5)))","v":""}]
[null,"Weekly Hours of Operation",120]
[null,"Energy Use Intensity, EUI (kBtu/sqft/year)",{"$f":"('3. Utility Data'!F29+'3. Utility Data'!J29)/'2. Energy & Economic Summary'!C7","v":105.48371200000001},null,5,{"$f":"IF('1. Cover Page'!D20=\"\",\"\",'1. Cover Page'!D20)","v":""},null,null,{"$f":"IF(F12=\"\",\"\",IF(AND($C$9<>\"\",$C$9<>\"Other\",$C$10<>\"None\",$C$10<>\"\"),\"Gas & Electric\",IF(AND($C$9<>\"\",$C$9<>\"Other\"),\"Electric\",IF(AND($C$10<>\"None\",$C$10<>\"\"),\"Gas\",\"\"))))","v":""},null,null,{"$f":"IF(I12=\"\",\"\",IF(J12=\"Capital\",VLOOKUP(I12,Lists!$C$9:$G$11,5),VLOOKUP(I12,Lists!$C$12:$G$14,5)))","v":""}]
[null,"Median EUI for facility type in the US1",{"$f":"INDEX(Lists!B18:C35,MATCH(C4,Lists!B18:B35,0),2)","v":63}]
[null,"1. Please refer to this link to obtain the Median EUI for various facility types - https://www.energystar.gov/buildings/facility-owners-and-managers/existing-buildings/use-portfolio-manager/understand-metrics/what-energy ",null,null,null,null,null,null,null,null,null,null,null,null,"The Energy Summary Tables are populated from the results in the Analysis Tab."]
[]
[null,"Custom Measures","Energy Savings",null,"Cost Savings",null,"Estimated Program Eligibility Cost ($)3 ","Estimated Project Cost - Without Incentive ($) 4","Estimated Energy Trust Incentives ($)","Estimated Project Cost - With Incentive ($) ","Simple Payback5 (years)"]
[null,null,"Estimated Annual Electric Savings (kWh)","Estimated Annual Gas Savings (therms)","Estimated Annual Energy Cost Savings1 ($)","Estimated Annual Non-Energy Benefits2 ($)",null,null,null,null,"Without incentives","With incentives"]
[null,null,null,null,null,null,null,null,null,null,null,null,null,null,"Cost information for the table to the left comes from the data further down this worksheet. Savings numbers come from the 'Analysis' tab,"]
[null,{"$f":"LEFT('1. Cover Page'!C16,5)","v":"EEM 1"},{"$f":"Analysis!C4-Analysis!E4","v":100000},{"$f":"Analysis!D4-Analysis!F4","v":20000},{"$f":"IF(I4=\"Gas & Electric\",C19*Lists!$G$18+D19*IF($C$10=\"NWN - WA\",1.25,1.17),IF(I4=\"Gas\",D19*IF($C$10=\"NWN - WA\",1.25,1.17),IF(I4=\"Electric\",C19*Lists!$G$18,0)))","v":37980},{"$f":"I49","v":0},{"$f":"G49","v":0},{"$f":"G49","v":0},{"$f":"IF(G36=\"Yes\",'CEC Calcs'!K3,IF(G36=\"Maybe\",\"Program to determine eligibility\",0))","v":0},{"$f":"IF(G36=\"Maybe\",\"TBD\",H19-I19)","v":0},{"$f":"IFERROR(H19/(E19+F19),\"\")","v":0},{"$f":"IFERROR(J19/(E19+F19),\"\")","v":0}]
[null,{"$f":"LEFT('1. Cover Page'!C17,5)","v":"EEM 2"},{"$f":"Analysis!C5-Analysis!E5","v":0},{"$f":"Analysis!D5-Analysis!F5","v":0},{"$f":"IF(I6=\"Gas & Electric\",C20*Lists!$G$18+D20*IF($C$10=\"NWN - WA\",1.25,1.17),IF(I6=\"Gas\",D20*IF($C$10=\"NWN - WA\",1.25,1.17),IF(I6=\"Electric\",C20*Lists!$G$18,0)))","v":0},{"$f":"I57","v":0},{"$f":"G57","v":0},{"$f":"G57","v":0},{"$f":"IF(G37=\"Yes\",'CEC Calcs'!K4,IF(G37=\"Maybe\",\"Program to determine eligibility\",0))","v":0},{"$f":"IF(G37=\"Maybe\",\"TBD\",H20-I20)","v":0},{"$f":"IFERROR(H20/(E20+F20),\"\")","v":""},{"$f":"IFERROR(J20/(E20+F20),\"\")","v":""}]
[null,{"$f":"LEFT('1. Cover Page'!C18,5)","v":"EEM 3"},{"$f":"Analysis!C6-Analysis!E6","v":0},{"$f":"Analysis!D6-Analysis!F6","v":0},{"$f":"IF(I8=\"Gas & Electric\",C21*Lists!$G$18+D21*IF($C$10=\"NWN - WA\",1.25,1.17),IF(I8=\"Gas\",D21*IF($C$10=\"NWN - WA\",1.25,1.17),IF(I8=\"Electric\",C21*Lists!$G$18,0)))","v":0},{"$f":"I65","v":0},{"$f":"G65","v":0},{"$f":"G65","v":0},{"$f":"IF(G38=\"Yes\",'CEC Calcs'!K5,IF(G38=\"Maybe\",\"Program to determine eligibility\",0))","v":0},0,{"$f":"IFERROR(H21/(E21+F21),\"\")","v":""},{"$f":"IFERROR(J21/(E21+F21),\"\")","v":""}]
[null,{"$f":"LEFT('1. Cover Page'!C19,5)","v":"EEM 4"},{"$f":"Analysis!C7-Analysis!E7","v":0},{"$f":"Analysis!D7-Analysis!F7","v":0},{"$f":"IF(I10=\"Gas & Electric\",C22*Lists!$G$18+D22*IF($C$10=\"NWN - WA\",1.25,1.17),IF(I10=\"Gas\",D22*IF($C$10=\"NWN - WA\",1.25,1.17),IF(I10=\"Electric\",C22*Lists!$G$18,0)))","v":0},{"$f":"I73","v":0},{"$f":"G73","v":0},{"$f":"G73","v":0},{"$f":"IF(G39=\"Yes\",'CEC Calcs'!K6,IF(G39=\"Maybe\",\"Program to determine eligibility\",0))","v":0},0,{"$f":"IFERROR(H22/(E22+F22),\"\")","v":""},{"$f":"IFERROR(J22/(E22+F22),\"\")","v":""}]
[null,{"$f":"LEFT('1. Cover Page'!C20,5)","v":"EEM 5"},{"$f":"Analysis!C8-Analysis!E8","v":0},{"$f":"Analysis!D8-Analysis!F8","v":0},{"$f":"IF(I12=\"Gas & Electric\",C23*Lists!$G$18+D23*IF($C$10=\"NWN - WA\",1.25,1.17),IF(I12=\"Gas\",D23*IF($C$10=\"NWN - WA\",1.25,1.17),IF(I12=\"Electric\",C23*Lists!$G$18,0)))","v":0},{"$f":"I81","v":0},{"$f":"G81","v":0},{"$f":"G81","v":0},{"$f":"IF(G40=\"Yes\",'CEC Calcs'!K7,IF(G40=\"Maybe\",\"Program to determine eligibility\",0))","v":0},0,"",""]
[null,"Total",{"$f":"SUM(C19:C23)","v":100000},20000,37980,0,0,0,0,0,{"$f":"IFERROR(H24/(E24+F24),\"\")","v":0},{"$f":"IFERROR(J24/(E24+F24),\"\")","v":0}]
[null,{"$f":"CONCATENATE(\"1. Cost savings are based on Energy Trust average utility rates for electricity and gas \",TEXT(Lists!G18,\"0.###\"),\" $/kWh and \",TEXT(Lists!G19,\"0.###\"),\" $/therm (or \",TEXT(Lists!G20,\"0.###\"),\" $/therm for WA).  Actual rates and cost savings may differ.\")","v":"1. Cost savings are based on Energy Trust average utility rates for electricity and gas 0.146 $/kWh and 1.087 $/therm (or 1.658 $/therm for WA).  Actual rates and cost savings may differ."}]
[null,"2. Non-energy cost benefits are related to cost savings due to as avoided maintenance, reduced water costs etc. "]
[null,"3. Program Eligibility Cost is used to estimate cost-effectiveness under the Program. For example, this could be the incremental cost for end-of-life replacement or full costs for early replacement measures. "]
[null,"Program eligibility cost typically include equipment and labor costs. Costs such as permitting, shipping, crane use, painting, warranties, concrete pads, engineering, and design are ineligible to include in the program costs. "]
[null,"4. Project Cost includes all costs the participant would incur towards the EEM such as equipment, labor, permitting, shipping and all other applicable costs."]
[null,"5. Simple payback is estimated using current utility rates and project costs, which could vary over time. "]
[]
[null,"CEC Calculation",null,null,null,null,null,null,null,"Sanity Check \nEEM Savings as % of Base Facility Usage"]
[null,"Custom Measures","Sector","Sub-sector","Load Profile",null,"Likelihood of Meeting Cost Effectiveness Criteria"]
[null,null,null,null,"Electric","Gas"]
[null,null,null,null,null,null,null,null,null,"Electric","Gas"]
[null,{"$f":"B19","v":"EEM 1"},"Residential","Not applicable","Res Freezer","Flat - gas",{"$f":"IF(AND(N('CEC Calcs'!N3)>=0.95, N('CEC Calcs'!O3)>=0.95), \"Yes\", IF(AND(N('CEC Calcs'!N3)>=0.8, N('CEC Calcs'!O3)>=0.8), \"Maybe\", \"No\"))","v":"No"},null,null,{"$f":"C24/'3. Utility Data'!F26","v":7.4626865671641784E-2},{"$f":"D24/'3. Utility Data'!J26","v":0.59880239520958078}]
[null,{"$f":"B20","v":"EEM 2"},"Commercial","Grocery","Process","Com Heating",{"$f":"IF(AND(N('CEC Calcs'!N4)>=0.95, N('CEC Calcs'!O4)>=0.95), \"Yes\", IF(AND(N('CEC Calcs'!N4)>=0.8, N('CEC Calcs'!O4)>=0.8), \"Maybe\", \"No\"))","v":"No"}]
[null,{"$f":"B21","v":"EEM 3"},"Residential","Not applicable","Res Lighting","Com Heating",{"$f":"IF(AND(N('CEC Calcs'!N5)>=0.95, N('CEC Calcs'!O5)>=0.95), \"Yes\", IF(AND(N('CEC Calcs'!N5)>=0.8, N('CEC Calcs'!O5)>=0.8), \"Maybe\", \"No\"))","v":"No"}]
[null,{"$f":"B22","v":"EEM 4"},"Commercial","Retail","Exterior Lights","Res Heating",{"$f":"IF(AND(N('CEC Calcs'!N6)>=0.95, N('CEC Calcs'!O6)>=0.95), \"Yes\", IF(AND(N('CEC Calcs'!N6)>=0.8, N('CEC Calcs'!O6)>=0.8), \"Maybe\", \"No\"))","v":"No"}]
[null,{"$f":"B23","v":"EEM 5"},null,null,null,null,{"$f":"IF(AND(N('CEC Calcs'!N7)>=0.95, N('CEC Calcs'!O7)>=0.95), \"Yes\", IF(AND(N('CEC Calcs'!N7)>=0.8, N('CEC Calcs'!O7)>=0.8), \"Maybe\", \"No\"))","v":"No"}]
[null,null,null,null,null,null,null,null,null,null,null,null,null,null,"Input the items in light blue. Add or hide rows as necessary. Hide tables of unused EEMs."]
[]
[null,null,{"$f":"CONCATENATE(LEFT('1. Cover Page'!C16,5)&\": \",'1. Cover Page'!D16)","v":"EEM 1: Test 1"},null,null,null,null,null,{"$f":"CONCATENATE(LEFT('1. Cover Page'!C16,5)&\" \")&\" Non-Energy Benefits (NEBs)\"","v":"EEM 1  Non-Energy Benefits (NEBs)"}]
[null,null,"Item Description","Vendor","$/unit","# Units","Total Cost",null,"NEB Value ($)","Source/Description of NEB",null,null,null,null,"Add any NEB costs to this table, include supporting information."]
[null,null,null,null,null,null,{"$f":"IF(F45=\"\",\"\",E45*F45)","v":""},null,0]
[null,null,null,null,null,null,{"$f":"IF(F46=\"\",\"\",E46*F46)","v":""}]
[null,null,null,null,null,null,{"$f":"IF(F47=\"\",\"\",E47*F47)","v":""}]
[null,null,null,null,null,null,{"$f":"IF(F48=\"\",\"\",E48*F48)","v":""}]
[null,null,"Total",null,null,null,{"$f":"SUM(G45:G48)","v":0},null,{"$f":"SUM(I45:I48)","v":0}]
[]
[null,null,{"$f":"CONCATENATE(LEFT('1. Cover Page'!C17,5)&\": \",'1. Cover Page'!D17)","v":"EEM 2: "},null,null,null,null,null,{"$f":"CONCATENATE(LEFT('1. Cover Page'!C17,5)&\" \")&\" Non-Energy Benefits (NEBs)\"","v":"EEM 2  Non-Energy Benefits (NEBs)"}]
[null,null,"Item Description","Vendor","$/unit","# Units","Total Cost",null,"NEB Value ($)","Source/Description of NEB"]
[null,null,null,null,null,null,{"$f":"IF(F53=\"\",\"\",E53*F53)","v":""}]
[null,null,null,null,null,null,{"$f":"IF(F54=\"\",\"\",E54*F54)","v":""}]
[null,null,null,null,null,null,""]
[null,null,null,null,null,null,""]
[null,null,"Total",null,null,null,{"$f":"SUM(G53:G56)","v":0},null,{"$f":"SUM(I53:I56)","v":0}]
[]
[null,null,{"$f":"CONCATENATE(LEFT('1. Cover Page'!C18,5)&\": \",'1. Cover Page'!D18)","v":"EEM 3: "},null,null,null,null,null,{"$f":"CONCATENATE(LEFT('1. Cover Page'!C18,5)&\" \")&\" Non-Energy Benefits (NEBs)\"","v":"EEM 3  Non-Energy Benefits (NEBs)"}]
[null,null,"Item Description","Vendor","$/unit","# Units","Total Cost",null,"NEB Value ($)","Source/Description of NEB"]
[null,null,null,null,null,null,{"$f":"IF(F61=\"\",\"\",E61*F61)","v":""}]
[null,null,null,null,null,null,{"$f":"IF(F62=\"\",\"\",E62*F62)","v":""}]
[null,null,null,null,null,null,""]
[null,null,null,null,null,null,""]
[null,null,"Total",null,null,null,{"$f":"SUM(G61:G64)","v":0},null,{"$f":"SUM(I61:I64)","v":0}]
[]
[null,null,{"$f":"CONCATENATE(LEFT('1. Cover Page'!C19,5)&\": \",'1. Cover Page'!D19)","v":"EEM 4: "},null,null,null,null,null,{"$f":"CONCATENATE(LEFT('1. Cover Page'!C19,5)&\" \")&\" Non-Energy Benefits (NEBs)\"","v":"EEM 4  Non-Energy Benefits (NEBs)"}]
[null,null,"Item Description","Vendor","$/unit","# Units","Total Cost",null,"NEB Value ($)","Source/Description of NEB"]
[null,null,null,null,null,null,{"$f":"IF(F69=\"\",\"\",E69*F69)","v":""}]
[null,null,null,null,null,null,{"$f":"IF(F70=\"\",\"\",E70*F70)","v":""}]
[null,null,null,null,null,null,""]
[null,null,null,null,null,null,""]
[null,null,"Total",null,null,null,{"$f":"SUM(G69:G72)","v":0},null,{"$f":"SUM(I69:I72)","v":0}]
[]
[null,null,{"$f":"CONCATENATE(LEFT('1. Cover Page'!C20,5)&\": \",'1. Cover Page'!D20)","v":"EEM 5: "},null,null,null,null,null,{"$f":"CONCATENATE(LEFT('1. Cover Page'!C20,5)&\" \")&\" Non-Energy Benefits (NEBs)\"","v":"EEM 5  Non-Energy Benefits (NEBs)"}]
[null,null,"Item Description","Vendor","$/unit","# Units","Total Cost",null,"NEB Value ($)","Source/Description of NEB"]
[null,null,null,null,null,null,{"$f":"IF(F77=\"\",\"\",E77*F77)","v":""}]
[null,null,null,null,null,null,{"$f":"IF(F78=\"\",\"\",E78*F78)","v":""}]
[null,null,null,null,null,null,""]
[null,null,null,null,null,null,""]
[null,null,"Total",null,null,null,{"$f":"SUM(G77:G80)","v":0},null,{"$f":"SUM(I77:I80)","v":0}]

{"sheet":"3. Utility Data","index":3,"n_rows":30,"n_cols":22,"rows_kept":30,"cut":false,"hidden":false,"merged":[[24,1,24,9],[26,9,27,9],[2,1,9,9],[29,1,29,9],[1,21,4,21],[1,1,1,9],[10,1,11,1],[10,2,10,5],[10,6,10,9],[26,1,27,1]]}
[]
[null,"Utility Data Narrative",null,null,null,null,null,null,null,null,null,null,null,null,null,null,null,null,null,null,null,"In the Narrative, describe the energy consumption noting any significant differences between seasons, or changes in operation."]
[]
[]
[]
[]
[]
[]
[]
[]
[null,"Month","Electric Use (kWh)",null,null,null,"Natural Gas Use (therms)"]
[null,null,2021,2022,2023,"3-year Average",{"$f":"C12","v":2021},{"$f":"D12","v":2022},{"$f":"E12","v":2023},"3-year Average",null,null,null,null,null,null,null,null,null,null,null,"Input electric and natural gas data in the light blue cells."]
[null,"January",100000,120000,120000,{"$f":"IFERROR(AVERAGE(C13:E13),0)","v":113333.33333333333},5000,5500,6000,{"$f":"IFERROR(AVERAGE(G13:I13),0)","v":5500}]
[null,"February",120000,100000,110000,{"$f":"IFERROR(AVERAGE(C14:E14),0)","v":110000},4500,5000,5500,{"$f":"IFERROR(AVERAGE(G14:I14),0)","v":5000}]
[null,"March",100000,120000,120000,113333.33333333333,1400,1400,5000,2600]
[null,"April",120000,100000,110000,110000,1400,1400,1400,1400]
[null,"May",100000,120000,120000,113333.33333333333,1400,1400,1400,1400]
[null,"June",120000,100000,110000,110000,1400,1400,1400,1400]
[null,"July",100000,120000,120000,113333.33333333333,1400,1400,1400,1400]
[null,"August",120000,100000,110000,110000,1400,1400,1400,1400]
[null,"September",100000,120000,120000,113333.33333333333,1400,1400,1400,1400]
[null,"October",120000,100000,110000,110000,1400,1400,1400,1400]
[null,"November",100000,120000,120000,113333.33333333333,4500,5000,5500,5000]
[null,"December",120000,100000,110000,110000,5000,5500,6000,5500]
[null,"Annual Energy Usage"]
[null,"Annual energy usage",{"$f":"SUM(C13:C24)","v":1320000},{"$f":"SUM(D13:D24)","v":1320000},1380000,{"$f":"SUM(F13:F24)","v":1340000},30200,32200,37800,{"$f":"SUM(J13:J24)","v":33400}]
[null,"Rolling energy Usage1","Month 24-36","Month 12-24","Month 0-12",null,"Month 24-36","Month 12-24","Month 0-12"]
[]
[null,"Annual energy usage (kBtu)",{"$f":"C26*3.412","v":4503840},{"$f":"D26*3.412","v":4503840},{"$f":"E26*3.412","v":4708560},{"$f":"F26*3.412","v":4572080},{"$f":"G26*99.976","v":3019275.2},{"$f":"H26*99.976","v":3219227.2},{"$f":"I26*99.976","v":3779092.8},{"$f":"J26*99.976","v":3339198.4}]
[null,"1. Rolling energy usage may need to be calculated in case complete annual data for 3 years is not available. Please estimate utility data for the last 12 months (0-12), previous 12 months (12-24) etc based on data availability. Based on the available utility data range, this table may need to be modified to present rolling or annual energy usage, as feasible to calculate based on the available data. Please modify the table as necessary before printing in the report. \n"]

{"sheet":"4. Measure Details","index":4,"n_rows":157,"n_cols":9,"rows_kept":157,"cut":false,"hidden":false,"merged":[[95,1,95,6],[101,1,101,6],[2,8,7,8],[14,8,18,8],[20,8,26,8],[62,1,62,6],[68,1,68,6],[74,1,74,6],[82,1,82,6],[83,1,88,6],[89,1,89,6],[29,1,34,6],[35,1,35,6],[41,1,41,6],[47,1,47,6],[55,1,55,6],[56,1,61,6],[1,1,1,6],[8,1,8,6],[14,1,14,6],[20,1,20,6],[2,1,7,6],[28,1,28,6],[128,1,128,6],[122,1,122,6],[116,1,116,6],[110,1,115,6],[109,1,109,6],[136,1,136,6],[137,1,142,6],[143,1,143,6],[149,1,149,6],[155,1,155,6]]}
[]
[null,"Baseline Description"]
[null,null,null,null,null,null,null,null,"Describe the  system operation, including: annual operation hours, equipment model numbers and capacity, equipment control strategies, any other note worthy items (i.e. unusual schedules, operations, etc.). Please make note of supporting information for baseline operation. "]
[]
[]
[]
[]
[]
[null,"Baseline Formulas"]
[null,"Formula Description","Formula","Parameter Definition","Assumed Values","Modeled Values","Analysis Location"]
[null,null,null,null,null,null,null,null,"Input formulas used in the Analysis Tab to complete the energy calculations. Define the parameters in the formulas, list assumed vs modeled values, put location of formula in Analysis or Logged Data Tabs."]
[]
[]
[]
[null,"Baseline Assumptions",null,null,null,null,null,null,"Input  assumptions (formula parameters that are not based on logged data or relationships. State the source of the assumption, whether it is constant or variable, the range of values, units, and location in the analysis if applicable."]
[null,"Assumption","Assumption Source","Assumptions Characteristics","Assumed Value Range","Assumption Units","Analysis Location"]
[]
[]
[]
[]
[null,"Baseline Modeled Values",null,null,null,null,null,null,"Input modeled values (formula parameters based on logged data or relationships to independent variables). State the source of the data, whether it is constant or variable, range of values, units, and location in analysis."]
[null,"Modeled Value","Modeled Value Source Data","Model Characteristics","Modeled Value Range","Modeled Value Units","Analysis Location"]
[]
[]
[]
[]
[]
[]
[null,{"$f":"CONCATENATE(LEFT('1. Cover Page'!C16,5)&\": \",'1. Cover Page'!D16,\" Description\")","v":"EEM 1: Test 1 Description"}]
[]
[]
[]
[]
[]
[]
[null,{"$f":"CONCATENATE(LEFT('1. Cover Page'!C16,5),\" Formulas\")","v":"EEM 1 Formulas"}]
[null,"Formula Description","Formula","Parameter Definition","Assumed Values","Modeled Values","Analysis Location"]
[]
[]
[]
[]
[null,{"$f":"CONCATENATE(LEFT('1. Cover Page'!C16,5),\" Assumptions\")","v":"EEM 1 Assumptions"}]
[null,"Assumption","Assumption Source","Assumptions Characteristics","Assumed Value Range","Assumption Units","Analysis Location"]
[]
[]
[]
[]
[null,{"$f":"CONCATENATE(LEFT('1. Cover Page'!C16,5),\" Modeled Values\")","v":"EEM 1 Modeled Values"}]
[null,"Modeled Value","Modeled Value Source Data","Model Characteristics","Modeled Value Range","Modeled Value Units","Analysis Location"]
[]
[]
[]
[]
[]
[]
[null,{"$f":"CONCATENATE(LEFT('1. Cover Page'!C17,5)&\": \",'1. Cover Page'!D17,\" Description\")","v":"EEM 2:  Description"}]
[]
[]
[]
[]
[]
[]
[null,{"$f":"CONCATENATE(LEFT('1. Cover Page'!C17,5),\" Formulas\")","v":"EEM 2 Formulas"}]
[null,"Formula Description","Formula","Parameter Definition","Assumed Values","Modeled Values","Analysis Location"]
[]
[]
[]
[]
[null,{"$f":"CONCATENATE(LEFT('1. Cover Page'!C17,5),\" Assumptions\")","v":"EEM 2 Assumptions"}]
[null,"Assumption","Assumption Source","Assumptions Characteristics","Assumed Value Range","Assumption Units","Analysis Location"]
[]
[]
[]
[]
[null,{"$f":"CONCATENATE(LEFT('1. Cover Page'!C17,5),\" Modeled Values\")","v":"EEM 2 Modeled Values"}]
[null,"Modeled Value","Modeled Value Source Data","Model Characteristics","Modeled Value Range","Modeled Value Units","Analysis Location"]
[]
[]
[]
[]
[]
[]
[null,{"$f":"CONCATENATE(LEFT('1. Cover Page'!C18,5)&\": \",'1. Cover Page'!D18,\" Description\")","v":"EEM 3:  Description"}]
[]
[]
[]
[]
[]
[]
[null,{"$f":"CONCATENATE(LEFT('1. Cover Page'!C18,5),\" Formulas\")","v":"EEM 3 Formulas"}]
[null,"Formula Description","Formula","Parameter Definition","Assumed Values","Modeled Values","Analysis Location"]
[]
[]
[]
[]
[null,{"$f":"CONCATENATE(LEFT('1. Cover Page'!C18,5),\" Assumptions\")","v":"EEM 3 Assumptions"}]
[null,"Assumption","Assumption Source","Assumptions Characteristics","Assumed Value Range","Assumption Units","Analysis Location"]
[]
[]
[]
[]
[null,{"$f":"CONCATENATE(LEFT('1. Cover Page'!C18,5),\" Modeled Values\")","v":"EEM 3 Modeled Values"}]
[null,"Modeled Value","Modeled Value Source Data","Model Characteristics","Modeled Value Range","Modeled Value Units","Analysis Location"]
[]
[]
[]
[]
[]
[]
[null,{"$f":"CONCATENATE(LEFT('1. Cover Page'!C19,5)&\": \",'1. Cover Page'!D19,\" Description\")","v":"EEM 4:  Description"}]
[]
[]
[]
[]
[]
[]
[null,{"$f":"CONCATENATE(LEFT('1. Cover Page'!C19,5),\" Formulas\")","v":"EEM 4 Formulas"}]
[null,"Formula Description","Formula","Parameter Definition","Assumed Values","Modeled Values","Analysis Location"]
[]
[]
[]
[]
[null,{"$f":"CONCATENATE(LEFT('1. Cover Page'!C19,5),\" Assumptions\")","v":"EEM 4 Assumptions"}]
[null,"Assumption","Assumption Source","Assumptions Characteristics","Assumed Value Range","Assumption Units","Analysis Location"]
[]
[]
[]
[]
[null,{"$f":"CONCATENATE(LEFT('1. Cover Page'!C19,5),\" Modeled Values\")","v":"EEM 4 Modeled Values"}]
[null,"Modeled Value","Modeled Value Source Data","Model Characteristics","Modeled Value Range","Modeled Value Units","Analysis Location"]
[]
[]
[]
[]
[]
[]
[null,{"$f":"CONCATENATE(LEFT('1. Cover Page'!C20,5)&\": \",'1. Cover Page'!D20,\" Description\")","v":"EEM 5:  Description"}]
[]
[]
[]
[]
[]
[]
[null,{"$f":"CONCATENATE(LEFT('1. Cover Page'!C20,5),\" Formulas\")","v":"EEM 5 Formulas"}]
[null,"Formula Description","Formula","Parameter Definition","Assumed Values","Modeled Values","Analysis Location"]
[]
[]
[]
[]
[null,{"$f":"CONCATENATE(LEFT('1. Cover Page'!C20,5),\" Assumptions\")","v":"EEM 5 Assumptions"}]
[null,"Assumption","Assumption Source","Assumptions Characteristics","Assumed Value Range","Assumption Units","Analysis Location"]
[]
[]
[]
[]
[null,{"$f":"CONCATENATE(LEFT('1. Cover Page'!C20,5),\" Modeled Values\")","v":"EEM 5 Modeled Values"}]
[null,"Modeled Value","Modeled Value Source Data","Model Characteristics","Modeled Value Range","Modeled Value Units","Analysis Location"]

{"sheet":"4A. Baseline Descriptions - RCx","index":5,"n_rows":30,"n_cols":10,"rows_kept":30,"cut":false,"hidden":false,"merged":[[26,5,26,7],[27,4,27,5],[2,5,2,7],[3,4,3,5],[5,4,13,4],[14,4,19,4],[20,4,24,4]]}
[]
[]
[null,null,null,null,"AHU-1","CV AHU, CHW cooling, Gas heating",null,null,"CHW","Chilled Water"]
[null,null,null,null,"Baseline vs Proposed Conditions",null,"Baseline","Proposed","HW","Hot Water"]
[null,null,null,null," Schedule","Hours of Operation","0500-2100 Mon-Fri","No change suggested","SAT","Supply Air Temperature"]
[null,null,null,null,"Temp Control Loop","CHW Enable Temp","CHW Valve found to be open down to 34 DegF; cooling not active below 50F","No change suggested","STPT","Setpoint"]
[null,null,null,null,null,"HW Enable Temp","+- 55DegF","No change suggested","OSAT","Outside Air Temperature"]
[null,null,null,null,null,"STPT Reset","SAT STPT is 56F","Add reset up to 60F when OAT < 50F","Delta-t","Difference Temperature"]
[null,null,null,null,null,"SAT vs STPT","SAT tracks to STPT","No change suggested","FT","Functional Testing"]
[null,null,null,null,null,"Simultaneous Htg/Clg","Not apparent from logged data",null,"MAT","Mixed Air Temperature"]
[null,null,null,null,null,"Delta-t (CHW / HW)","4degF heating (limited cold data) and 15 DegF cooling","No changes suggested","RAT","Return Air Temperature"]
[null,null,null,null,null,"Sensors","OAT Reads low at higher temperatures","Investigate whether sensor needs to be moved or replaced","OAD","Outside Air Damper"]
[null,null,null,null,null,"Valve Actuators","No issues apparent in data assessment","No changes suggested","MAD","Mixed Air Damper"]
[null,null,null,null,null,"Morning Warmup/Cooldown","None in place","Suggesting add sequence to close OAD prior to occupancy unless economizing (remove min damper position)","RAD","Return Air Damper"]
[null,null,null,null,"Econ Loop","Economizer Control Description","Economizer is enabled up to 75F OAT","Optimize econ to  cutoff when OAT=>RAT or based on enthalpy","SSP","Supply Static Pressure"]
[null,null,null,null,null,"MAT vs SAT STPT","MAT tracks SAT setpoint","No changes suggested","OA%","Outside Air Percentage"]
[null,null,null,null,null,"Clg when OSAT<SAT STPT and OAD<100%","Yes","Optimize economizer logic","DX","Direct Expansion Cooling (Compressors)"]
[null,null,null,null,null,"MAT / RAT Sensors","No issues apparent in data assessment","No changes suggested","DCV","Demand Control Ventilation"]
[null,null,null,null,null,"OAD/MAD/RAD Actuators","No issues apparent in data assessment","No changes suggested"]
[null,null,null,null,null,"C02 Sensor(DCV)","N/A","No changes suggested"]
[null,null,null,null,"Fan Loop","SSP STPT Reset","Some variability, ranges between 1.7\" and 1.9\" with temperature","Suggest resetting SSP from 1.8 to 1.2 inwc."]
[null,null,null,null,null,"SSP vs STPT","Tracks to setpoint","No changes suggested"]
[null,null,null,null,null,"Fan Modulation","Constant volume","No changes suggested"]
[null,null,null,null,null,"Static P. transducers","No issues apparent in data assessment","No changes suggested"]
[null,null,null,null,null,"Building Pressure","N/A","No changes suggested"]
[]
[null,null,null,null,"Chilled Water "]
[null,null,null,null,"Baseline vs Proposed Conditions",null,"Baseline","Proposed"]
[]
[null,null,null,null,"Distibuted Chilled Water","Chilled Water Differential Temperature","Low delta T, AHU valves not 100% open","Assess pump speeds and primary/secondary valve positions. Open valves and slow pumps to increase Delta-t to 8-12 DegF. Investigate further."]

{"sheet":"4B. Other Opportunities","index":6,"n_rows":24,"n_cols":6,"rows_kept":24,"cut":false,"hidden":false,"merged":[[0,1,1,12],[2,1,2,7],[3,1,4,12],[26,1,32,12],[7,1,8,12],[11,1,12,12],[6,1,6,5],[10,1,10,5],[14,2,14,5],[23,1,25,12],[22,1,22,7]]}
[]
[]
[null,"Energy Efficiency Measure (EEM) Summary – Standard (Prescriptive) Track"]
[null,"The following energy efficiency measure(s) (EEMs) are recommended for the participant’s site and are potentially eligible for standard (prescriptive) incentives under the Existing Buildings program:"]
[]
[]
[null,"EEM # - [Title]"]
[null,"Provide brief measure description"]
[]
[]
[null,"EEM # - [Title]"]
[null,"Provide brief measure description"]
[]
[]
[null,null,"Other EEM Opportunities"]
[null,null,"Prescriptive Measures","Measure Quantity","Incentive per unit ($)","Total Incentives ($)"]
[null,null,"EEM #"]
[null,null,"EEM #"]
[null,null,"EEM #"]
[null,null,"Total",null,null,{"$f":"SUM(F17:F19)","v":0}]
[]
[]
[null,"Lighting and Solar Opportunities"]
[null,"Please include brief details of lighting and solar opportunities you may have identified during the study. For lighting include brief details of existing lighting systems. For solar include brief details about the solar potential such as available area, orientation, shading details etc. TRC’s Energy Advisor will work with the participant and the ATAC to discuss these opportunities and/or connect the participant with Energy Trust’s lighting and solar program representatives."]

{"sheet":"5. Appendix","index":7,"n_rows":11,"n_cols":3,"rows_kept":11,"cut":false,"hidden":false,"merged":[[0,0,1,11],[2,0,2,3]]}
["Reminder: Include photos below. Update Table of Contents below to match your project needs. Actual quotes, equipment specs, etc. should be included as an appendix to the PDF report, they should not be in Excel."]
[]
["APPENDIX TABLE OF CONTENTS"]
["A. ","Equipment Photos","PDF Document"]
["B.","Quotes","PDF Document"]
["C.","Analysis Snapshot","PDF Document"]
["D.","Analysis File","Additional Excel File"]
[]
[]
["Appendix A. Equipment Photos"]
[" "]

{"sheet":"Analysis","index":8,"n_rows":8,"n_cols":6,"rows_kept":8,"cut":false,"hidden":false,"merged":[[1,2,1,3],[1,4,1,5],[1,1,2,1]]}
["Use this sheet to perform your energy calculations, or include calculations in additional tabs. Link the summary results to the appropriate cells in the tables below."]
[null,"Model","Baseline",null,"EEM"]
[null,null,"Electrical Energy (kWh/yr)","Natural Gas Energy (therms/yr)","Electrical Energy (kWh/yr)","Natural Gas Energy (therms/yr)"]
[null,{"$f":"'2. Energy & Economic Summary'!B19","v":"EEM 1"},500000,50000,400000,30000]
[null,{"$f":"'2. Energy & Economic Summary'!B20","v":"EEM 2"}]
[null,{"$f":"'2. Energy & Economic Summary'!B21","v":"EEM 3"}]
[null,{"$f":"'2. Energy & Economic Summary'!B22","v":"EEM 4"}]
[null,{"$f":"'2. Energy & Economic Summary'!B23","v":"EEM 5"}]

{"sheet":"Logged Data","index":9,"n_rows":1,"n_cols":1,"rows_kept":1,"cut":false,"hidden":false,"merged":[]}
["Use this sheet for your logged data and any data processing (ie pivot tables)"]

{"sheet":"Lists","index":10,"n_rows":37,"n_cols":8,"rows_kept":37,"cut":false,"hidden":false,"merged":[]}
[]
[null,"Savings Type",null,"Measure Type",null,"Electric Utility",null,"Gas utility"]
[null,"Electric",null,"Capital",null,"PacPower",null,"Cascade"]
[null,"Gas",null,"RCx",null,"PGE",null,"NW Natural"]
[null,"Gas & Electric",null,null,null,"Other",null,"Avista"]
[null,null,null,null,null,null,null,"NWN - WA"]
[null,null,null,null,null,null,null,"None"]
[null,"Measure Type","Savings Type","kWh Incentive","Therm Incentive","Incentive Cap","Total"]
[null,"Capital","Electric",0.45,0,0.9,{"$f":"CONCATENATE(TEXT(B9,),\" project \",TEXT(C9,),\" incentives are \",TEXT(D9,\"$0.##\"),\"/kWh with a cap of \",TEXT(F9,\"##%\"),\" project costs.\")","v":"Capital project Electric incentives are $0.45/kWh with a cap of 90% project costs."}]
[null,"Capital","Gas",0,5,0.9,{"$f":"CONCATENATE(TEXT(B10,),\" project \",TEXT(C10,),\" incentives are \",TEXT(E10,\"$#.00\"),\"/therm with a cap of \",TEXT(F10,\"##%\"),\" project costs.\")","v":"Capital project Gas incentives are $5.00/therm with a cap of 90% project costs."}]
[null,"Capital","Gas & Electric",0.45,5,0.9,{"$f":"CONCATENATE(TEXT(B11,),\" project \",TEXT(C11,),\" incentives are \",TEXT(D11,\"$0.##\"),\"/kWh and \",TEXT(E11,\"$#.00\"),\"/therm with a cap of \",TEXT(F11,\"##%\"),\" project costs.\")","v":"Capital project Gas & Electric incentives are $0.45/kWh and $5.00/therm with a cap of 90% project costs."}]
[null,"RCx","Electric",0.45,0,0.9,{"$f":"CONCATENATE(TEXT(B12,),\" project \",TEXT(C12,),\" incentives are \",TEXT(D12,\"$0.##\"),\"/kWh with a cap of \",TEXT(F12,\"##%\"),\" project costs.\")","v":"RCx project Electric incentives are $0.45/kWh with a cap of 90% project costs."}]
[null,"RCx","Gas",0,5,0.9,{"$f":"CONCATENATE(TEXT(B13,),\" project \",TEXT(C13,),\" incentives are \",TEXT(E13,\"$#.00\"),\"/therm with a cap of \",TEXT(F13,\"##%\"),\" project costs.\")","v":"RCx project Gas incentives are $5.00/therm with a cap of 90% project costs."}]
[null,"RCx","Gas & Electric",0.45,5,0.9,{"$f":"CONCATENATE(TEXT(B14,),\" project \",TEXT(C14,),\" incentives are \",TEXT(D14,\"$0.##\"),\"/kWh and \",TEXT(E14,\"$#.00\"),\"/therm with a cap of \",TEXT(F14,\"##%\"),\" project costs.\")","v":"RCx project Gas & Electric incentives are $0.45/kWh and $5.00/therm with a cap of 90% project costs."}]
[null,"Site Annual Cap",750000,null,null,"Source:","https://www.energytrust.org/incentives/existing-buildings-custom-incentives/#tab-two"]
[]
[null,"Facility type","EUI","Source",null,"Utility Rate"]
[null,"Data Center",40.1,"CBECS - Other",null,"Commercial Electric",0.14580000000000001,"$/kWh"]
[null,"Service Shop",47.9,"CBECS - Service",null,"NWN",1.087,"$/therm"]
[null,"Utility (W/WW)",40.1,"CBECS - Other",null,"NWN - WA",1.6579999999999999,"$/therm"]
[null,"Warehouse",22.7,"CBECS - Non-refrigerated Warehouse \n& Distribution Center"]
[null,"Other",40.1,"CBECS - Other"]
[null,"Bank",88.3,"CBECS - Bank/Financial"]
[null,"K-12",48.5,"CBECS - Elementary/Middle & High School"]
[null,"College/University",84.3,"CBECS - College/University"]
[null,"Public Assembly",56.2,"CBECS - Public Assembly"]
[null,"Convience Store",231.4,"CBECS - Food Sales"]
[null,"Supermarket",196,"CBECS - Grocery Store/Food Market"]
[null,"Fast food",402.7,"CBECS - Fast Food"]
[null,"Hospital",234.3,"Industry Survey"]
[null,"Outpatient",64.5,"CBECS - Clinic/Outpatient"]
[null,"Hotel/Multifamily",63,"CBECS - Hotel & Motel/Inn"]
[null,"Office",52.9,"CBECS - Office & Bank/Financial"]
[null,"Church",30.5,"CBECS - Religious Worship"]
[null,"Retail",51.4,"CBECS - Retail Store"]
[]
[null,null,"Source:","US Energy Use Intensity by Property Type (energystar.gov)"]

{"sheet":"CEC Calcs","index":11,"n_rows":7,"n_cols":15,"rows_kept":7,"cut":false,"hidden":true,"merged":[]}
[]
[null,"EEM/RCX","Sector","Sub Sector","Ele LP","Measure Life","Final Ele Load Profile","Gas Load Profile","kWh","Therms","Incentive","NEBs","Cost","UCT BCR at Max Incentive","TRC BCR"]
[null,1,{"$f":"'2. Energy & Economic Summary'!C36","v":"Residential"},{"$f":"'2. Energy & Economic Summary'!D36","v":"Not applicable"},{"$f":"'2. Energy & Economic Summary'!E36","v":"Res Freezer"},{"$f":"'2. Energy & Economic Summary'!$K4","v":15},{"$f":"IF(E3=\"\",\"\",IF(E3=\"None - ele\",\"None - ele\",IF(OR(C3=\"Residential\",C3=\"Industrial\"),E3,IF(C3=\"Commercial\",D3&\" \"&E3,D3&\" \"&E3))))","v":"Res Freezer"},{"$f":"IF(J3=0,\"None - gas\",'2. Energy & Economic Summary'!$F36)","v":"Flat - gas"},{"$f":"'2. Energy & Economic Summary'!C19","v":100000},{"$f":"'2. Energy & Economic Summary'!D19","v":20000},{"$f":"IF(IF('2. Energy & Economic Summary'!J4=\"RCx\",IF('2. Energy & Economic Summary'!I4=\"Electric\",MIN('2. Energy & Economic Summary'!C19*Lists!$D$12,'2. Energy & Economic Summary'!G19*Lists!$F$12),MIN('2. Energy & Economic Summary'!C19*Lists!$D$14+'2. Energy & Economic Summary'!D19*Lists!$E$13,'2. Energy & Economic Summary'!G19*Lists!$F$14)),IF('2. Energy & Economic Summary'!I4=\"Electric\",MIN('2. Energy & Economic Summary'!C19*Lists!$D$9,Lists!$F$9*'2. Energy & Economic Summary'!G19),IF('2. Energy & Economic Summary'!I4=\"Gas\",MIN('2. Energy & Economic Summary'!D19*Lists!$E$10,Lists!$F$10*'2. Energy & Economic Summary'!G19),MIN('2. Energy & Economic Summary'!C19*Lists!$D$11+Lists!$E$11*'2. Energy & Economic Summary'!D19,'2. Energy & Economic Summary'!G19*Lists!$F$11))))>Lists!$C$15,Lists!$C$15,IF('2. Energy & Economic Summary'!J4=\"RCx\",IF('2. Energy & Economic Summary'!I4=\"Electric\",MIN('2. Energy & Economic Summary'!C19*Lists!$D$12,'2. Energy & Economic Summary'!G19*Lists!$F$12),MIN('2. Energy & Economic Summary'!C19*Lists!$D$14+'2. Energy & Economic Summary'!D19*Lists!$E$13,'2. Energy & Economic Summary'!G19*Lists!$F$14)),IF('2. Energy & Economic Summary'!I4=\"Electric\",MIN('2. Energy & Economic Summary'!C19*Lists!$D$9,Lists!$F$9*'2. Energy & Economic Summary'!G19),IF('2. Energy & Economic Summary'!I4=\"Gas\",MIN('2. Energy & Economic Summary'!D19*Lists!$E$10,Lists!$F$10*'2. Energy & Economic Summary'!G19),MIN('2. Energy & Economic Summary'!C19*Lists!$D$11+Lists!$E$11*'2. Energy & Economic Summary'!D19,'2. Energy & Economic Summary'!G19*Lists!$F$11)))))","v":0},{"$f":"'2. Energy & Economic Summary'!F19","v":0},{"$f":"'2. Energy & Economic Summary'!G19","v":0},{"$f":"IFERROR((INDEX(OR_GAS_AC,MATCH(ROUND(F3,0),OR_GAS_AC_ML,0),MATCH(H3,OR_GAS_AC_LP,0))*J3+(INDEX(ELE_AC,MATCH(G3,ELE_FRIENDLY,0),MATCH(ROUND(F3,0),ELE_AC_ML,0)))*I3)/K3, \"\")","v":""},{"$f":"IFERROR((INDEX(OR_GAS_AC,MATCH(ROUND(F3,0),OR_GAS_AC_ML,0),MATCH(H3,OR_GAS_AC_LP,0))*J3+(INDEX(ELE_AC,MATCH(G3,ELE_FRIENDLY,0),MATCH(ROUND(F3,0),ELE_AC_ML,0)))*I3+-PV(OR_DISCOUNT,ROUND(F3,0),L3))/M3, \"\")","v":""}]
[null,2,{"$f":"'2. Energy & Economic Summary'!C37","v":"Commercial"},{"$f":"'2. Energy & Economic Summary'!D37","v":"Grocery"},{"$f":"'2. Energy & Economic Summary'!E37","v":"Process"},{"$f":"'2. Energy & Economic Summary'!K6","v":0},{"$f":"IF(E4=\"\",\"\",IF(E4=\"None - ele\",\"None - ele\",IF(OR(C4=\"Residential\",C4=\"Industrial\"),E4,IF(C4=\"Commercial\",D4&\" \"&E4,D4&\" \"&E4))))","v":"Grocery Process"},{"$f":"IF(J4=0,\"None - gas\",'2. Energy & Economic Summary'!$F37)","v":"None - gas"},{"$f":"'2. Energy & Economic Summary'!C20","v":0},{"$f":"'2. Energy & Economic Summary'!D20","v":0},{"$f":"IF(IF('2. Energy & Economic Summary'!J5=\"RCx\",IF('2. Energy & Economic Summary'!I5=\"Electric\",MIN('2. Energy & Economic Summary'!C20*Lists!$D$12,'2. Energy & Economic Summary'!G20*Lists!$F$12),MIN('2. Energy & Economic Summary'!C20*Lists!$D$14+'2. Energy & Economic Summary'!D20*Lists!$E$13,'2. Energy & Economic Summary'!G20*Lists!$F$14)),IF('2. Energy & Economic Summary'!I5=\"Electric\",MIN('2. Energy & Economic Summary'!C20*Lists!$D$9,Lists!$F$9*'2. Energy & Economic Summary'!G20),IF('2. Energy & Economic Summary'!I5=\"Gas\",MIN('2. Energy & Economic Summary'!D20*Lists!$E$10,Lists!$F$10*'2. Energy & Economic Summary'!G20),MIN('2. Energy & Economic Summary'!C20*Lists!$D$11+Lists!$E$11*'2. Energy & Economic Summary'!D20,'2. Energy & Economic Summary'!G20*Lists!$F$11))))>Lists!$C$15,Lists!$C$15,IF('2. Energy & Economic Summary'!J5=\"RCx\",IF('2. Energy & Economic Summary'!I5=\"Electric\",MIN('2. Energy & Economic Summary'!C20*Lists!$D$12,'2. Energy & Economic Summary'!G20*Lists!$F$12),MIN('2. Energy & Economic Summary'!C20*Lists!$D$14+'2. Energy & Economic Summary'!D20*Lists!$E$13,'2. Energy & Economic Summary'!G20*Lists!$F$14)),IF('2. Energy & Economic Summary'!I5=\"Electric\",MIN('2. Energy & Economic Summary'!C20*Lists!$D$9,Lists!$F$9*'2. Energy & Economic Summary'!G20),IF('2. Energy & Economic Summary'!I5=\"Gas\",MIN('2. Energy & Economic Summary'!D20*Lists!$E$10,Lists!$F$10*'2. Energy & Economic Summary'!G20),MIN('2. Energy & Economic Summary'!C20*Lists!$D$11+Lists!$E$11*'2. Energy & Economic Summary'!D20,'2. Energy & Economic Summary'!G20*Lists!$F$11)))))","v":0},{"$f":"'2. Energy & Economic Summary'!F20","v":0},{"$f":"'2. Energy & Economic Summary'!G20","v":0},{"$f":"IFERROR((INDEX(OR_GAS_AC,MATCH(ROUND(F4,0),OR_GAS_AC_ML,0),MATCH(H4,OR_GAS_AC_LP,0))*J4+(INDEX(ELE_AC,MATCH(G4,ELE_FRIENDLY,0),MATCH(ROUND(F4,0),ELE_AC_ML,0)))*I4)/K4, \"\")","v":""},{"$f":"IFERROR((INDEX(OR_GAS_AC,MATCH(ROUND(F4,0),OR_GAS_AC_ML,0),MATCH(H4,OR_GAS_AC_LP,0))*J4+(INDEX(ELE_AC,MATCH(G4,ELE_FRIENDLY,0),MATCH(ROUND(F4,0),ELE_AC_ML,0)))*I4+-PV(OR_DISCOUNT,ROUND(F4,0),L4))/M4, \"\")","v":""}]
[null,3,{"$f":"'2. Energy & Economic Summary'!C38","v":"Residential"},{"$f":"'2. Energy & Economic Summary'!D38","v":"Not applicable"},{"$f":"'2. Energy & Economic Summary'!E38","v":"Res Lighting"},{"$f":"'2. Energy & Economic Summary'!$K8","v":0},"Res Lighting",{"$f":"IF(J5=0,\"None - gas\",'2. Energy & Economic Summary'!$F38)","v":"None - gas"},{"$f":"'2. Energy & Economic Summary'!C21","v":0},{"$f":"'2. Energy & Economic Summary'!D21","v":0},{"$f":"IF(IF('2. Energy & Economic Summary'!J6=\"RCx\",IF('2. Energy & Economic Summary'!I6=\"Electric\",MIN('2. Energy & Economic Summary'!C21*Lists!$D$12,'2. Energy & Economic Summary'!G21*Lists!$F$12),MIN('2. Energy & Economic Summary'!C21*Lists!$D$14+'2. Energy & Economic Summary'!D21*Lists!$E$13,'2. Energy & Economic Summary'!G21*Lists!$F$14)),IF('2. Energy & Economic Summary'!I6=\"Electric\",MIN('2. Energy & Economic Summary'!C21*Lists!$D$9,Lists!$F$9*'2. Energy & Economic Summary'!G21),IF('2. Energy & Economic Summary'!I6=\"Gas\",MIN('2. Energy & Economic Summary'!D21*Lists!$E$10,Lists!$F$10*'2. Energy & Economic Summary'!G21),MIN('2. Energy & Economic Summary'!C21*Lists!$D$11+Lists!$E$11*'2. Energy & Economic Summary'!D21,'2. Energy & Economic Summary'!G21*Lists!$F$11))))>Lists!$C$15,Lists!$C$15,IF('2. Energy & Economic Summary'!J6=\"RCx\",IF('2. Energy & Economic Summary'!I6=\"Electric\",MIN('2. Energy & Economic Summary'!C21*Lists!$D$12,'2. Energy & Economic Summary'!G21*Lists!$F$12),MIN('2. Energy & Economic Summary'!C21*Lists!$D$14+'2. Energy & Economic Summary'!D21*Lists!$E$13,'2. Energy & Economic Summary'!G21*Lists!$F$14)),IF('2. Energy & Economic Summary'!I6=\"Electric\",MIN('2. Energy & Economic Summary'!C21*Lists!$D$9,Lists!$F$9*'2. Energy & Economic Summary'!G21),IF('2. Energy & Economic Summary'!I6=\"Gas\",MIN('2. Energy & Economic Summary'!D21*Lists!$E$10,Lists!$F$10*'2. Energy & Economic Summary'!G21),MIN('2. Energy & Economic Summary'!C21*Lists!$D$11+Lists!$E$11*'2. Energy & Economic Summary'!D21,'2. Energy & Economic Summary'!G21*Lists!$F$11)))))","v":0},{"$f":"'2. Energy & Economic Summary'!F21","v":0},{"$f":"'2. Energy & Economic Summary'!G21","v":0},{"$f":"IFERROR((INDEX(OR_GAS_AC,MATCH(ROUND(F5,0),OR_GAS_AC_ML,0),MATCH(H5,OR_GAS_AC_LP,0))*J5+(INDEX(ELE_AC,MATCH(G5,ELE_FRIENDLY,0),MATCH(ROUND(F5,0),ELE_AC_ML,0)))*I5)/K5, \"\")","v":""},{"$f":"IFERROR((INDEX(OR_GAS_AC,MATCH(ROUND(F5,0),OR_GAS_AC_ML,0),MATCH(H5,OR_GAS_AC_LP,0))*J5+(INDEX(ELE_AC,MATCH(G5,ELE_FRIENDLY,0),MATCH(ROUND(F5,0),ELE_AC_ML,0)))*I5+-PV(OR_DISCOUNT,ROUND(F5,0),L5))/M5, \"\")","v":""}]
[null,4,{"$f":"'2. Energy & Economic Summary'!C39","v":"Commercial"},{"$f":"'2. Energy & Economic Summary'!D39","v":"Retail"},{"$f":"'2. Energy & Economic Summary'!E39","v":"Exterior Lights"},{"$f":"'2. Energy & Economic Summary'!$K10","v":0},"Retail Exterior Lights",{"$f":"IF(J6=0,\"None - gas\",'2. Energy & Economic Summary'!$F39)","v":"None - gas"},{"$f":"'2. Energy & Economic Summary'!C22","v":0},{"$f":"'2. Energy & Economic Summary'!D22","v":0},{"$f":"IF(IF('2. Energy & Economic Summary'!J7=\"RCx\",IF('2. Energy & Economic Summary'!I7=\"Electric\",MIN('2. Energy & Economic Summary'!C22*Lists!$D$12,'2. Energy & Economic Summary'!G22*Lists!$F$12),MIN('2. Energy & Economic Summary'!C22*Lists!$D$14+'2. Energy & Economic Summary'!D22*Lists!$E$13,'2. Energy & Economic Summary'!G22*Lists!$F$14)),IF('2. Energy & Economic Summary'!I7=\"Electric\",MIN('2. Energy & Economic Summary'!C22*Lists!$D$9,Lists!$F$9*'2. Energy & Economic Summary'!G22),IF('2. Energy & Economic Summary'!I7=\"Gas\",MIN('2. Energy & Economic Summary'!D22*Lists!$E$10,Lists!$F$10*'2. Energy & Economic Summary'!G22),MIN('2. Energy & Economic Summary'!C22*Lists!$D$11+Lists!$E$11*'2. Energy & Economic Summary'!D22,'2. Energy & Economic Summary'!G22*Lists!$F$11))))>Lists!$C$15,Lists!$C$15,IF('2. Energy & Economic Summary'!J7=\"RCx\",IF('2. Energy & Economic Summary'!I7=\"Electric\",MIN('2. Energy & Economic Summary'!C22*Lists!$D$12,'2. Energy & Economic Summary'!G22*Lists!$F$12),MIN('2. Energy & Economic Summary'!C22*Lists!$D$14+'2. Energy & Economic Summary'!D22*Lists!$E$13,'2. Energy & Economic Summary'!G22*Lists!$F$14)),IF('2. Energy & Economic Summary'!I7=\"Electric\",MIN('2. Energy & Economic Summary'!C22*Lists!$D$9,Lists!$F$9*'2. Energy & Economic Summary'!G22),IF('2. Energy & Economic Summary'!I7=\"Gas\",MIN('2. Energy & Economic Summary'!D22*Lists!$E$10,Lists!$F$10*'2. Energy & Economic Summary'!G22),MIN('2. Energy & Economic Summary'!C22*Lists!$D$11+Lists!$E$11*'2. Energy & Economic Summary'!D22,'2. Energy & Economic Summary'!G22*Lists!$F$11)))))","v":0},{"$f":"'2. Energy & Economic Summary'!F22","v":0},{"$f":"'2. Energy & Economic Summary'!G22","v":0},{"$f":"IFERROR((INDEX(OR_GAS_AC,MATCH(ROUND(F6,0),OR_GAS_AC_ML,0),MATCH(H6,OR_GAS_AC_LP,0))*J6+(INDEX(ELE_AC,MATCH(G6,ELE_FRIENDLY,0),MATCH(ROUND(F6,0),ELE_AC_ML,0)))*I6)/K6, \"\")","v":""},{"$f":"IFERROR((INDEX(OR_GAS_AC,MATCH(ROUND(F6,0),OR_GAS_AC_ML,0),MATCH(H6,OR_GAS_AC_LP,0))*J6+(INDEX(ELE_AC,MATCH(G6,ELE_FRIENDLY,0),MATCH(ROUND(F6,0),ELE_AC_ML,0)))*I6+-PV(OR_DISCOUNT,ROUND(F6,0),L6))/M6, \"\")","v":""}]
[null,5,{"$f":"'2. Energy & Economic Summary'!C40","v":0},{"$f":"'2. Energy & Economic Summary'!D40","v":0},{"$f":"'2. Energy & Economic Summary'!E40","v":0},{"$f":"'2. Energy & Economic Summary'!$K12","v":0},"0 0",{"$f":"IF(J7=0,\"None - gas\",'2. Energy & Economic Summary'!$F40)","v":"None - gas"},{"$f":"'2. Energy & Economic Summary'!C23","v":0},{"$f":"'2. Energy & Economic Summary'!D23","v":0},{"$f":"IF(IF('2. Energy & Economic Summary'!J8=\"RCx\",IF('2. Energy & Economic Summary'!I8=\"Electric\",MIN('2. Energy & Economic Summary'!C23*Lists!$D$12,'2. Energy & Economic Summary'!G23*Lists!$F$12),MIN('2. Energy & Economic Summary'!C23*Lists!$D$14+'2. Energy & Economic Summary'!D23*Lists!$E$13,'2. Energy & Economic Summary'!G23*Lists!$F$14)),IF('2. Energy & Economic Summary'!I8=\"Electric\",MIN('2. Energy & Economic Summary'!C23*Lists!$D$9,Lists!$F$9*'2. Energy & Economic Summary'!G23),IF('2. Energy & Economic Summary'!I8=\"Gas\",MIN('2. Energy & Economic Summary'!D23*Lists!$E$10,Lists!$F$10*'2. Energy & Economic Summary'!G23),MIN('2. Energy & Economic Summary'!C23*Lists!$D$11+Lists!$E$11*'2. Energy & Economic Summary'!D23,'2. Energy & Economic Summary'!G23*Lists!$F$11))))>Lists!$C$15,Lists!$C$15,IF('2. Energy & Economic Summary'!J8=\"RCx\",IF('2. Energy & Economic Summary'!I8=\"Electric\",MIN('2. Energy & Economic Summary'!C23*Lists!$D$12,'2. Energy & Economic Summary'!G23*Lists!$F$12),MIN('2. Energy & Economic Summary'!C23*Lists!$D$14+'2. Energy & Economic Summary'!D23*Lists!$E$13,'2. Energy & Economic Summary'!G23*Lists!$F$14)),IF('2. Energy & Economic Summary'!I8=\"Electric\",MIN('2. Energy & Economic Summary'!C23*Lists!$D$9,Lists!$F$9*'2. Energy & Economic Summary'!G23),IF('2. Energy & Economic Summary'!I8=\"Gas\",MIN('2. Energy & Economic Summary'!D23*Lists!$E$10,Lists!$F$10*'2. Energy & Economic Summary'!G23),MIN('2. Energy & Economic Summary'!C23*Lists!$D$11+Lists!$E$11*'2. Energy & Economic Summary'!D23,'2. Energy & Economic Summary'!G23*Lists!$F$11)))))","v":0},{"$f":"'2. Energy & Economic Summary'!F23","v":0},{"$f":"'2. Energy & Economic Summary'!G23","v":0},{"$f":"IFERROR((INDEX(OR_GAS_AC,MATCH(ROUND(F7,0),OR_GAS_AC_ML,0),MATCH(H7,OR_GAS_AC_LP,0))*J7+(INDEX(ELE_AC,MATCH(G7,ELE_FRIENDLY,0),MATCH(ROUND(F7,0),ELE_AC_ML,0)))*I7)/K7, \"\")","v":""},{"$f":"IFERROR((INDEX(OR_GAS_AC,MATCH(ROUND(F7,0),OR_GAS_AC_ML,0),MATCH(H7,OR_GAS_AC_LP,0))*J7+(INDEX(ELE_AC,MATCH(G7,ELE_FRIENDLY,0),MATCH(ROUND(F7,0),ELE_AC_ML,0)))*I7+-PV(OR_DISCOUNT,ROUND(F7,0),L7))/M7, \"\")","v":""}]

{"sheet":"Lists_CEC","index":12,"n_rows":23,"n_cols":14,"rows_kept":23,"cut":false,"hidden":true,"merged":[]}
["LOOKUPS"]
["Sector","Commercial","Industrial","Residential","Com End Use","Ind End Use","Res End Use","OR Gas Load Profiles","WA Gas Load Profiles","Qty Unit Type","Prescriptive or Not Prescriptive?","Pilot?","OPUC Exception?","Measure Class"]
["Commercial","College","Not applicable","Not applicable","Compressed Air","Ag-Irrigation","Res Refrigerator","DHW","DHW","Units","Prescriptive","No","No","Retrofit"]
["Residential","Grocery",null,null,"Cooking","Flat - ele","Res Freezer","Flat - gas","Flat - gas","Tons","Not Prescriptive","Yes","Yes","Replacement/New"]
[null,"Healthcare",null,null,"Cooling","1-Shift Industrial","Res Dryer","Res Heating","Res Heating","Square feet","Not Approved",null,null,"Early Replacement"]
[null,"Lodging",null,null,"Exterior Lights","2-Shift Industrial","Res Clotheswasher","Com Heating","Hearth","SCFM capacity"]
[null,"Large Office",null,null,"Heating","3-Shift Industrial","Res Central AC","Clotheswasher","Com Heating","Linear feet"]
[null,"Other",null,null,"Hot Water","Warehouse Cooling","Res Window AC","None - gas","Com Cooking","kBtu/hr"]
[null,"Restaurant",null,null,"Interior Lights","Warehouse Heating","Res Water Heat",null,"Clotheswasher","CFM"]
[null,"Retail",null,null,"Other","Warehouse Hot Water","Res HP Water Heat Convert",null,"None - gas","Buildings"]
[null,"School",null,null,"Motors","Warehouse Ventilation","Res Solar Water Heat",null,null,"Amps"]
[null,"Small Office",null,null,"Office Eqpmt","Street Lighting","Res Air Source HP",null,null,"Acres"]
[null,"Warehouse",null,null,"Process","Cold Storage","Res Zonal Ele Heat",null,null,"Horsepower"]
[null,null,null,null,"Refrigeration","Food Products","Res Ele Resistance Heat",null,null,"Other"]
[null,null,null,null,"Ventilation","Wood Products","Res Lighting"]
[null,null,null,null,"None - ele","Pulp & Paper","Res Other"]
[null,null,null,null,null,"Chemicals","Res Whole Home"]
[null,null,null,null,null,"Oil & Petroleum","Res Spa Cover"]
[null,null,null,null,null,"Primary Metals","Res Power Strip"]
[null,null,null,null,null,"Transportation & Equipment","Res Space Conditioning"]
[null,null,null,null,null,"None - ele","Res EV Standby Mode"]
[null,null,null,null,null,null,"Res EV Charging Mode"]
[null,null,null,null,null,null,"None - ele"]

{"sheet":"GAS AC","index":13,"n_rows":74,"n_cols":21,"rows_kept":74,"cut":false,"hidden":true,"merged":[[0,8,0,9],[2,0,2,6],[2,12,2,20],[8,8,8,9]]}
["Oregon Blended Gas Avoided Costs",null,null,null,null,null,null,null,"Oregon Blended Gas Avoided Cost Info",null,null,null,"Washington-Only Gas Avoided Costs"]
[null,null,null,null,null,null,null,null,"Updated on","2023-01-04"]
["$2024 NPV of Avoided Costs with supply & Distribution Capacity, State CO2 Policy, 10% Conservation Act Credit, Risk Premium Value, and Discount Rate of 0.045",null,null,null,null,null,null,null,"Base Year","2024$",null,null,"NPV of Avoided Costs, with supply & Capacity peak factors, 10% Act Credit, Hedge Value, CO2 Social Cost of Carbon adder and Discount Rate of 3.39%"]
["Lifetime","DHW","FLAT - gas","Res Heating","Com Heating","Clotheswasher","None - gas",null,"Discount Rate",4.4999999999999998E-2,null,null,"Lifetime","DHW","FLAT - gas","Res Heating","Hearth","Com Heating","Com Cooking","Clotheswasher","None - gas"]
[1,1.1896274455642148,1.1153782370523389,1.6399382456702665,1.6213898581786272,1.155762299002687,0,null,"Source","Link",null,null,1,1.3185420091178539,1.2018730232385737,2.1228216314287489,1.6651837365010125,2.3009617337264516,1.675622386063442,1.1689632911076808,0]
[2,2.366962154211854,2.2221944377243199,3.2454228068490845,3.2094673507889313,2.3003836430588636,0,null,"Inputs","Inputs received from OPUC in new Avoided Cost Input Template - Includes components from NWN's 2018 IRPs, CNG's 2020 IRP; Avista's 2021 IRP",null,null,2,2.6266095885339231,2.3970970144166315,4.1987886508876393,3.2985181078046306,4.5492279139336755,3.3290622228985924,2.3330691088647622,0]
[3,3.4993065068568279,3.2869624043414039,4.788014317840366,4.7353806262447637,3.4013914958844231,0,null,"Avoided Cost Version Year",2024,null,null,3,3.8757646132469636,3.5371084195939226,6.1938911308339488,4.8655011872719056,6.7109801286206103,4.9122652768398778,3.4426941197047989,0]
[4,4.6058575930835017,4.3287826639211433,6.2876616909674858,6.2191658824736029,4.4776799873201041,0,null,null,null,null,null,4,5.0934182232398406,4.6491970624374144,8.1345308728523591,6.3920589092893163,8.8128054154118498,6.4530139919959657,4.525444187686217,0]
[5,5.6893985618247926,5.3502597965246554,7.7482235178957657,7.6646450157353252,5.5319404373500145,0,null,"Washington-Only Gas Avoided Cost Info",null,null,null,5,6.2886258681270792,5.7423010540222199,10.032700562745744,7.8897236954192804,10.866875622543677,7.9607229476126866,5.589727260472527,0]
[6,6.7521718333357406,6.3534648616719362,9.1729700261608365,9.0750503317158611,6.5663335133901288,0,null,"Updated on","2023-01-24",null,null,6,7.4603182923672895,6.8152376476188143,11.88164378914176,9.3512939614096293,12.866607626614947,9.4346702424685081,6.6350860382177661,0]
[7,7.791129164678221,7.3352431368054267,10.559464517115579,10.447889378450007,7.5778263348942705,0,null,"Base Year","2024$",null,null,7,8.5995418239050192,7.858943401186127,13.675363646579477,10.770342225457593,14.806172128288328,10.866238169610853,7.6522587223438139,0]
[8,8.8044491137733107,8.2936777866494058,11.906442023354158,11.781852512395462,8.5645986641704219,0,null,"Discount Rate",3.39E-2,null,null,8,9.7115224026656133,8.8785380838538526,15.420493158820099,12.153085052922361,16.692364261900131,12.26097761828596,8.6460272909517251,0]
[9,9.7854686984062589,9.2221252293349334,13.207098066952852,13.070087813241244,9.5200954823265977,0,null,"Source","Link",null,null,9,10.797781730399466,9.875440707754775,17.118022140304198,13.500109454876668,18.52633063710817,13.620724584973789,9.6182074269756974,0]
[10,10.73664014732366,10.122556440368129,14.474933362461853,14.324615047679561,10.445508961976641,0,null,"Inputs","NWN 2022 IRP - WA Only AC ",null,null,10,11.860184340785787,10.851416483986018,18.77107641485113,14.814151659078503,20.311348731873629,14.947647592839532,10.570417768426841,0]
[11,11.651220395385874,10.9886024721564,15.692424804914138,15.529379652716276,11.335440469973882,0,null,"Avoided Cost Version Year",2024,null,null,11,12.895322617144945,11.802961729921465,20.375802172639048,16.090981033903763,22.043711418009103,16.238633047339146,11.498899987695022,0]
[12,12.538252672452488,11.829122395523791,16.869781675551025,16.69459317544846,12.198746510419621,0,null,null,null,null,null,12,13.896369190129754,12.723156160122917,21.927792125654008,17.325825824946904,23.719153279668557,17.487137960724827,12.397009531350699,0]
[13,13.389071662707723,12.635438136717255,17.99837472310772,17.811557087338503,13.026885850904687,0,null,null,null,null,null,13,14.873876650559307,13.622462495895004,23.440897854324398,18.532185096540385,25.351663117676896,18.703989980977255,13.274523709660953,0]
[14,14.203423745639327,13.407215857155837,19.078440974683382,18.880477131476816,13.819585765899536,0,null,null,null,null,null,14,15.832784058182837,14.505732874156442,24.914518157976048,19.709116690377826,26.940772452509453,19.894394206303538,14.137106044693157,0]
[15,14.996731117647752,14.159710955313209,20.126517436706621,19.917939121709257,14.591995242853791,0,null,null,null,null,null,15,16.767358685893083,15.367150495036149,26.346564498799118,20.854202290496566,28.484521115782385,21.052875225060063,14.978688160069439,0]
[16,15.768079038013189,14.891924986311627,21.142191685378151,20.923494979003589,15.34318874000518,0,null,null,null,null,null,16,17.678884031399694,16.20791754009732,27.740994433084989,21.971080487956506,29.986990824175873,22.180965413439573,15.799990187635848,0]
[17,16.507945435689869,15.594365418109613,22.115722574080934,21.887340656323794,16.063794139700349,0,null,null,null,null,null,17,18.572835672157886,17.033430936880823,29.099646123299568,23.061280938374264,31.450139829515329,23.284381067035454,16.607036264041362,0]
[18,17.218109484198145,16.268717339097012,23.049467885011534,22.811814249213171,16.75553787987311,0,null,null,null,null,null,18,19.440895665442405,17.835296671557451,30.419763307463391,24.121748988388934,32.871328021634355,24.35503706848101,17.390743765031829,0]
[19,17.900696587541134,16.917022306018058,23.946080129511827,23.699552741258081,17.420490184045637,0,null,null,null,null,null,19,20.294030426095375,18.624407582120579,31.709837018860132,25.160687063699811,34.259158777189327,25.404125023989415,18.162308366885718,0]
[20,18.556744700100154,17.540265879801993,24.806931268188041,24.551914060567874,18.059659999671652,0,null,null,null,null,null,20,21.131482407378293,19.399934957455294,32.967620327352826,26.175569089586979,35.611493825848605,26.431105194512526,18.921160679292605,0]
[21,19.187260327999532,18.139399880790283,25.633373539070231,25.370235954431518,18.674024485728083,0,null,null,null,null,null,21,21.947904630724778,20.156462987989908,34.192417591161195,27.165429432411198,36.927742622848378,27.430841267593216,19.661300804643417,0]
[22,19.79323844914007,18.715351576915008,26.426821035442103,26.155915052702799,19.264545172429141,0,null,null,null,null,null,22,22.74624468411923,20.896872687566898,35.383671192113795,28.129449334762221,38.207449201063177,28.406484589905556,20.386124120149574,0]
[23,20.375632963067062,19.26901188393435,27.188618335140227,26.910279647030258,19.83214457937321,0,null,null,null,null,null,23,23.524149638939083,21.618746736286099,36.543590622592831,29.069585712139826,39.452921370938881,29.3558793105808,21.092714887471256,0]
[24,20.935358747490795,19.80123693226188,27.920045424069173,27.634594496665315,20.377708083395991,0,null,null,null,null,null,24,24.286804051831993,22.327207410809098,37.675376989788639,29.988795376461642,40.667455334030485,30.284400602142235,21.786405517189145,0]
[25,21.47329533253626,20.312850294447493,28.622329728234291,28.330072518989237,20.902087071324175,0,null,null,null,null,null,25,25.034530299864823,23.022516850282191,38.779010122957693,30.88682187177983,41.851122895960344,31.192555207529281,22.46756468574473,0]
[26,21.990263562721825,20.804633743138709,29.296541922469451,28.997773893534269,21.406080498773576,0,null,null,null,null,null,26,25.764290065171508,23.701578474028047,39.853560791982808,31.762507430203485,43.003083787212752,32.077483129673389,23.132861581783359,0]
[27,22.487083241749811,21.277352299703583,29.943840712630841,29.638843214639547,21.890481157458474,0,null,null,null,null,null,27,26.47823333087841,24.366485912710267,40.905784388414808,32.62238639891379,44.130179443057955,32.941506825632196,23.7840781923293,0]
[28,22.962916003140613,21.730122587299491,30.563669495292256,30.252712110868615,22.354427412885389,0,null,null,null,null,null,28,27.188922540732364,25.029747105323985,41.934195229549239,33.46475929854352,45.231007403268883,33.797355557927283,24.434679472252583,0]
[29,23.41843040552455,22.163567176470742,31.156983196912229,30.840323566476137,22.798564538287589,0,null,null,null,null,null,29,27.876309338153739,25.671260977665323,42.928886051809044,34.279512078918543,46.295740898008134,34.625142319021293,25.063948531081557,0]
[30,23.854507452276348,22.578517532542925,31.724968600324942,31.402851643655801,23.223749323852619,0,null,null,null,null,null,30,28.541157773613037,26.291740591110859,43.890962483049805,35.067550361513575,47.325563409604278,35.4257872180386,25.672584819725508,0]
[31,24.271975146470332,22.97576304464188,32.268695866230772,31.941356388359893,23.630789663518758,0,null,null,null,null,null,31,29.184206845534209,26.891875626845003,44.821493899280348,35.829750073860083,48.321619615810071,36.20018019513244,26.261264855167955,0]
[32,24.671613982098737,23.356054193549074,32.789137399177527,32.456802150474012,24.020449223693792,0,null,null,null,null,null,32,29.806171321712924,27.472333152460781,45.72151461330543,36.566958423165133,49.28501666214509,36.949182010679245,26.830642972435047,0]
[33,25.05419419909375,23.720119142325888,33.287323745296689,32.950208644435762,24.393477483372674,0,null,null,null,null,null,33,30.407742533801827,28.033758363424877,46.592025024394594,37.279994838007056,50.216825392520377,37.673625202038949,27.381352051908006,0]
[34,25.420443165056934,24.068650685884691,33.764198699351077,33.422510632732894,24.750583924822685,0,null,null,null,null,null,34,30.989589145745825,28.57677530023123,47.433992730255092,37.969651879154085,51.11808153951263,38.374315008944549,27.914004222788137,0]
[35,25.771060978847135,24.402313599921449,34.220682321254003,33.874619009096122,25.092450748820347,0,null,null,null,null,null,35,31.552357897021576,29.101987542040263,48.24835360254496,38.636696120518849,51.989786875611152,39.052030268549544,28.429191543496252,0]
[36,26.106725122819295,24.721747317931683,34.65768695850015,34.307436356939199,25.419736827772422,0,null,null,null,null,null,36,32.096674321507265,29.609978877574676,49.036012827121681,39.281869001227591,52.832910326717176,39.70752428112813,28.927486659762934,0]
[37,26.428072348349279,25.027558931297015,35.076035370714521,34.7217776727244,25.733063455150823,0,null,null,null,null,null,37,32.623143442781746,30.101313954017666,49.797845910182623,39.905887649751371,53.648389049133286,40.341525647390412,29.409443441140898,0]
[38,26.735702893597914,25.320325622938814,35.476475217905502,35.118384435097617,26.033017931643972,0,null,null,null,null,null,38,33.132350446625907,30.576538904634745,50.534699651415778,40.509445681015315,54.437129471239992,40.954739078343401,29.875597596647204,0]
[39,27.030209092528473,25.600607408223151,35.859798774780224,35.498040604806143,26.32017663386176,0,null,null,null,null,null,39,33.624861331473724,31.036181955816755,51.247393085242209,41.093213967371767,55.200008301017249,41.547846178597766,30.32646727021941,0]
[40,27.312150328485419,25.868937114592573,36.226731669134836,35.86146487733005,26.595085196464908,0,null,null,null,null,null,40,34.101223537536036,31.480754014218924,51.93671839119677,41.657841384294528,55.937873500530969,42.121506203991281,30.76255361664769,0]
[41,27.582065017099019,26.125826025747145,36.577981273006131,36.209357589444807,26.858268277100127,0,null,null,null,null,null,41,34.56196655529628,31.910749234648534,52.603441774458773,42.203955531622874,56.651545228467654,42.676356794370932,31.184341358623008,0]
[42,27.840474179662955,26.371765938248224,36.914249007228413,36.542412667485536,27.110232592911821,0,null,null,null,null,null,42,35.007602514054611,32.326645569332356,53.24830431751127,42.732163431157005,57.341816751764568,43.21301468234816,31.592299325520507,0]
[43,28.087867534017693,26.607223787218111,37.236167470590331,36.861256752127893,27.351455978489625,0,null,null,null,null,null,43,35.438626751174567,32.728905299174542,53.872022803876021,43.243052201380557,58.009455327349173,43.732076378815151,31.986880974517021,0]
[44,28.324602348357143,26.832540083686617,37.544200854498222,37.166348853066886,27.582287568574298,0,null,null,null,null,null,44,35.855518362665009,33.11797554759525,54.475290514839116,43.73718971005988,58.655203054967508,44.234118835984113,32.36852489462197,0]
[45,28.551142840548003,27.048153764517721,37.838969642926834,37.458303016644869,27.803179042339529,0,null,null,null,null,null,45,36.258740735709246,33.494288777521469,55.058778000053444,44.215125205445631,59.279777702049756,44.719700088686466,32.737655294181849,0]
[46,28.767928000539261,27.25448264569582,38.121045038552303,37.737684991360645,28.01455844307182,0,null,null,null,null,null,46,36.648742063733465,33.858263272082084,55.623133822874145,44.677389926778204,59.883873501529635,45.189359874644829,33.09468247240013,0]
[47,28.97537791440649,27.451926551129397,38.390973646806323,38.005036163337465,28.216835381571606,0,null,null,null,null,null,47,37.025955844586761,34.21030359954181,56.168985281255722,45.124497694775663,60.468161923504567,45.643620234407251,33.440003275396819,0]
[48,29.173894578394268,27.640868087429478,38.649278535087696,38.26087460542054,28.41040182989677,0,null,null,null,null,null,48,37.390801362386632,34.550801062990622,56.696939105011964,45.55694548276044,61.033292421594261,46.082986091610479,33.774001537314504,0]
[49,29.363862677904105,27.821673385324281,38.896460246361734,38.505696081098137,28.595632880925624,0,null,null,null,null,null,49,37.743684153565546,34.880134135288536,57.207582130213851,45.975213969059666,61.579893154827346,46.507945814217344,34.097048506961158,0]
[50,29.545650332937441,27.994692809147072,39.132997769112009,38.739975005191518,28.772887475211622,0,null,null,null,null,null,50,38.08499645763645,35.198668879749228,57.701481951474989,46.379768071293185,62.108571685858479,46.918971757351933,34.409503260464071,0]
[51,29.719609811438243,28.16026163577175,39.359349465523756,38.964165363175617,28.942509096537929,0,null,null,null,null,null,51,38.415117653178484,35.506759357030106,58.179187552849534,46.771057463142995,62.619915656291916,47.31652078833617,34.711713100393375,0]
[52,29.886078211917479,28.318700704312111,39.575953959697678,39.178701590911601,29.104826437520043,0,null,null,null,null,null,52,38.734414679527291,35.804748018681011,58.641229918043983,47.149517074178689,63.114493439862322,47.701034794511074,35.00401394179903,0]
[53,30.045378116682294,28.47031703784355,39.783230987615305,39.383999416496266,29.260154036545984,0,null,null,null,null,null,53,39.043242444638821,36.092966087789151,59.088122620621064,47.515567573294362,63.592854774198713,48.072941174407475,35.286730685590157,0]
[54,30.197818216935708,28.615404438352115,39.981582210502985,39.580456665859593,29.408792887288516,0,null,null,null,null,null,54,39.341944219579844,36.371733927143197,59.52036239485173,47.869615836294329,64.055531371873926,48.432653312811979,35.560177579671929,0]
[55,30.34369391095812,28.754244056063655,40.171391993170616,39.768454033671382,29.551031021970367,0,null,null,null,null,null,55,39.630852020083779,36.641361395325845,59.938429687849769,48.212055398147491,64.503037511418555,48.78057104025612,35.82465856824119,0]
[56,30.483287876529797,28.88710493425652,40.353028148833424,39.948355821051081,29.687144069512804,0,null,null,null,null,null,56,39.910286975595866,36.902148191130706,60.342789193602769,48.543266890412852,64.935870608956662,49.117081077439742,36.080467629629396,0]
[57,30.616870618703658,29.014244530613325,40.526842651860036,40.12051064151013,29.817395789649112,0,null,null,null,null,null,57,40.180559686217855,37.154384186686237,60.733890369493096,48.863618464322663,65.354511771098174,49.442557465082274,36.327889103068031,0]
[58,30.744700993989646,29.135909216122233,40.693172319828093,40.285252096494865,29.942038584037917,0,null,null,null,null,null,58,40.441970567949163,37.398349749657051,61.112167935882809,49.173466199993243,65.759426329702976,49.757361979679942,36.567198004739986,0]
[59,30.867026711966663,29.252334752494388,40.852339466209003,40.442899421839115,30.061313985366919,0,null,null,null,null,null,59,40.694810186607931,37.634316054880784,61.478042359318067,49.473154502218392,66.151064359110862,50.061844535630883,36.798660333468057,0]
[60,30.984084815293961,29.36374674902277,41.004652524946714,40.593758106379056,30.175453125394672,0,null,null,null,null,null,60,40.939359580803483,37.86254538578681,61.831920319889946,49.763016483285377,66.529861176412211,50.35634357417517,37.022533366380408,0]
[61,31.096102139052139,29.470361099767636,41.150406648140702,40.738120483929244,30.284677182837505,0,null,null,null,null,null,61,41.175890574318849,38.083291425931911,62.174195163271193,50.043374333238937,66.896237825315751,50.641186439582171,37.23906594488156,0]
[62,31.20329575030398,29.572384401915826,41.289884277991405,40.876266299766741,30.389197811969392,0,null,null,null,null,null,62,41.404666078250926,38.296799540976991,62.505247337931443,50.31453967800492,67.250601544150769,50.916689743003175,37.44849875124693,0]
[63,31.305873368726797,29.670014356124625,41.423355694116481,41.008463252721292,30.489217552765464,0,null,null,null,null,null,63,41.625940383243737,38.503307051418105,62.825444818016834,50.57681392577161,67.593346218524516,51.183159714394044,37.651064576148151,0]
[64,31.404033769131406,29.763440149625865,41.551079537298371,41.134967513921822,30.584930223383711,0,null,null,null,null,null,64,41.839959442139985,38.703043496375187,63.13514351236384,50.830488602013709,67.924852819137499,51.440892542898617,37.846988577406705,0]
[65,31.497967166647779,29.852842822832795,41.673303310678165,41.256024223204605,30.676521295745676,0,null,null,null,null,null,65,42.046961143364697,38.896230888731381,63.434687660102497,51.07584567353134,68.245489825243467,51.690174706071609,38.036488530263412,0]
[66,31.587855585323734,29.938395620160001,41.790263859366966,41.371867964145082,30.764168254943723,0,null,null,null,null,null,66,42.247175575345281,39.083083961906937,63.724410213288166,51.313157861864497,68.555613634224969,51.93128328830683,38.21977506944198,0]
[67,31.67387321085096,30.020264325736278,41.902187829404092,41.482723218633581,30.848040943171519,0,null,null,null,null,null,67,42.4408252822614,39.263810408541573,64.004633206987435,51.542688946430843,68.855568957739351,52.164486288824513,38.397051923275583,0]
[68,31.756186728101898,30.098607584660936,42.009292106951598,41.588804801876158,30.92830188884405,0,null,null,null,null,null,68,42.628125511409408,39.438611111350959,64.2756681172295,51.764694057724341,69.145689204875794,52.390042919560237,38.568516140156895,0]
[69,31.834955644131504,30.173577210426167,42.111784238575986,41.690318278663305,31.005106621545039,0,null,null,null,null,null,69,42.809284452455927,39.607680366413732,64.537816207220857,51.979419960900181,69.426296852749317,52.60820389328665,38.734358307563149,0]
[70,31.910332597269878,30.245318479101023,42.209862833431863,41.787460361713215,31.078603973412015,0,null,null,null,null,null,70,42.984503468846796,39.771206099137181,64.791368862208145,52.187105330061449,69.697703804943487,52.819211702287916,38.894762763899593,0]

{"sheet":"ELE AC","index":14,"n_rows":191,"n_cols":73,"rows_kept":191,"cut":false,"hidden":true,"merged":[[0,0,0,1],[8,2,8,72]]}
["Oregon Blended Ele Avoided Cost Info"]
["Updated on","2023-01-04"]
["Base Year","2024$"]
["Discount Rate",4.4999999999999998E-2]
["Source","Link"]
["Inputs","PAC and PGE avoided costs"]
["Avoided Cost Version Year",2024]
[]
["Avoided Cost (NPV/kWh)",null,"Lifetime (yrs)"]
["Load Profile Name","Friendly Name",0,1,2,3,4,5,6,7,8,9,10,11,12,13,14,15,16,17,18,19,20,21,22,23,24,25,26,27,28,29,30,31,32,33,34,35,36,37,38,39,40,41,42,43,44,45,46,47,48,49,50,51,52,53,54,55,56,57,58,59,60,61,62,63,64,65,66,67,68,69,70]
["R-All-Ref-Refrig-All-All-C","Res Refrigerator",0,7.7459832591547623E-2,0.14968360136201664,0.21641723845013952,0.28110903338918941,0.34395037442339771,0.40597044043078068,0.46642439864078067,0.52563103750775619,0.58240151673851703,0.63678040340973396,0.68903172098164756,0.73935272638594485,0.78675602767934805,0.83260493259365886,0.87700745012938608,0.91971538032529243,0.96023988367643509,0.99932275881367072,1.0365230796014731,1.0723106929254242,1.1063047694063046,1.1390834411694868,1.1703365111752995,1.2003390006159171,1.228868243962538,1.2564061910098323,1.2826181785900448,1.307701420293597,1.3317045224022597,1.3546739981043292,1.3766543576278407,1.3976881944924451,1.4178162680470905,1.4370775824534494,1.4555094622681473,1.4731476247702502,1.4900262491741767,1.5061780428621445,1.521634304764506,1.5364249860107848,1.5505787479689466,1.5641230177853693,1.5770840415331424,1.5894869350716809,1.6013557327162156,1.6127134338114641,1.62358204729974,1.6339826343698607,1.6439353492694977,1.6534594783600594,1.6625734774897836,1.671295007757462,1.6796409697361019,1.6876275362228383,1.6952701835785673,1.7025837217180206,1.7095823228084066,1.7162795487322209,1.7226883773674502,1.7288212277360904,1.7346899840697174,1.7403060188387385,1.7456802147899548,1.7508229860351379,1.7557442982314853,1.7604536878930617,1.764960280870647,1.7692728100358002,1.7733996322034111,1.7773487443255267]
["R-All-Ref-Freezer-All-All-R","Res Freezer",0,7.7049581057803948E-2,0.14872471254239447,0.21496801897605508,0.27917538111151763,0.3415654209681741,0.40309136853864308,0.46306029160383655,0.52174170179306645,0.57805964359656725,0.63193577191385408,0.68374183619887496,0.73359078298074409,0.78054907153609854,0.82590967970789386,0.86990192422829871,0.91218454304893792,0.95232486425289098,0.99104524175110531,1.0278652982061705,1.0632881411173538,1.0969687284907941,1.1294470012862612,1.1604291403779943,1.1901600970391781,1.2184414900062737,1.2457362200968234,1.2717247639233298,1.2965941838530011,1.3203926718239782,1.3431663445234781,1.3649593327526643,1.3858138669432734,1.405770358991703,1.4248674805691477,1.4431422380595254,1.460630044270413,1.4773647870559514,1.4933788949846964,1.5087034001796678,1.5233679984523676,1.5374011068472955,1.5508299187084709,1.5636804563746671,1.5759776216054771,1.587745243835917,1.5990061263530846,1.6097820904843456,1.6200940178826813,1.6299618909911364,1.6394048317647778,1.6484411387252,1.657088322419384,1.6653631393516175,1.6732816244542332,1.6808591221600857,1.6881103161369779,1.6950492577416596,1.701689393248532,1.7080435899058262,1.714124160869744,1.7199428890648807,1.7255110500171646,1.7308394337035606,1.7359383654608775,1.740817725994195,1.7454869705236855,1.7499551471069299,1.7542309141722356,1.7583225572969301,1.7622380052631448]
["R-All-Plug-Dryer-All-All-R","Res Dryer",0,9.7453184956381861E-2,0.1899962135372249,0.27651048828639346,0.3598964976405945,0.44045842232898375,0.51979726202595411,0.59677826193174821,0.67190083617344087,0.74368595015050298,0.81272648447835572,0.87902003548611396,0.94290361182977411,1.0031909630836309,1.0614818912763597,1.1176794567437569,1.1717271751617329,1.2231461585275665,1.2725328811267138,1.3197476965251738,1.3651166650533266,1.4081383612103195,1.4495896220605302,1.4890978740218839,1.5270399306921114,1.5631006089246293,1.5978618260406661,1.6309597002191392,1.6626323070884914,1.6929410217960055,1.7219445765400381,1.7496991743812176,1.7762585981526813,1.8016743146803977,1.8259955745155332,1.8492695073721221,1.8715412134549823,1.8928538508548485,1.9132487191800793,1.9327653395869986,1.951441531363955,1.9693134852175016,1.9864158334027138,2.0027817168335389,2.0184428493032276,2.0334295789392938,2.0477709470120846,2.0614947442109273,2.0746275644969008,2.087194856636589,2.0992209735166729,2.1107292193349352,2.1217418947591096,2.1322803401410946,2.1423649768702666,2.1520153469460297,2.1612501508462816,2.170087283765183,2.1785438702904472,2.1866362975873508,2.1943802471537657,2.2017907252077511,2.208882091766589,2.2156680884736106,2.2221618652267421,2.2283760056603601,2.2343225515298508,2.2400130260461104,2.2454584562052107,2.2506693941565024,2.2556559376505612]
["R-All-WH-Cwash-All-All-R","Res Clotheswasher",0,7.8557292237808524E-2,0.15132528304829471,0.21814756398785054,0.28289808673625122,0.34582894939340114,0.40794052699578343,0.46849207093461109,0.5278049523374625,0.58465276964649449,0.63904491330311475,0.6912760374819924,0.74153400552252557,0.78893728428142151,0.83477548012226654,0.87914194290869829,0.92183061188567794,0.9623573000177118,1.0014215054051867,1.0386048091217939,1.0743869804026214,1.1083822701996113,1.141155002963103,1.1724040307330776,1.2024190542617252,1.2309342851335261,1.2584601244294491,1.2846832782338344,1.3097772053193706,1.333790532673951,1.3567697933003435,1.3787595163878004,1.3998023136006781,1.4199389616512785,1.4392084813169248,1.4576482130543853,1.4752938893581755,1.4921797040029507,1.5083383783041711,1.5238012245254344,1.5385982065553516,1.5527579979715402,1.5663080376042566,1.5792745827073345,1.5916827598394667,1.6035566135544255,1.6149191529945774,1.6257923964779764,1.6361974141654398,1.6461543688902849,1.6556825552298498,1.6648004368945053,1.6735256825066156,1.6818751998387784,1.6898651685776906,1.6975110716771278,1.7048277253608,1.7118293078332134,1.7185293867541831,1.7249409455302307,1.7310764084738168,1.7369476648791626,1.7425660920613117,1.747942577403081,1.7530875394526211,1.7580109481124679,1.7627223439592115,1.7672308567312147,1.7715452230202131,1.7756738032010728,1.7796245976325176]
["R-All-HVAC-CAC-All-All-E","Res Central AC",0,0.33749105245310923,0.65076596347825844,0.94245459409956245,1.22322173095888,1.4928445510504149,1.7525152206004431,2.0024765230007002,2.2430849833352986,2.4734162342905113,2.6939339151416042,2.9045700369316503,3.1068516280757792,3.299550861309581,3.4846103791493217,3.6620912339568963,3.8324029415093048,3.994529473608786,4.1503508936128481,4.2988781906239444,4.4415155824433992,4.5775213509348456,4.7080025271534653,4.8327188465572553,4.9522647402749369,5.0664115367594418,5.1759151417745217,5.2806346409699083,5.3808446880468326,5.4767394699386269,5.5685048114618754,5.6563185354075669,5.7403508071259317,5.8207644642726937,5.8977153323557188,5.9713525266935417,6.0418187413708839,6.1092505257511158,6.1737785490814812,6.2355278537038403,6.2946180973616004,6.3511637850723757,6.4052744910157013,6.4570550708657732,6.5066058649806759,6.554022892841826,6.5993980391204383,6.6428192317315506,6.6843706122206532,6.7241326988130963,6.7621825424422282,6.7985938760586224,6.8334372575097175,6.8667802062667462,6.8986873342639026,6.929220471103287,6.9584387838682478,6.9863988917773012,7.0131549759007976,7.0387588841529469,7.0632602317626594,7.0867064974178868,7.109143115269779,7.130613562974939,7.1511594459463836,7.1708205779764747,7.1896350583880446,7.2076393458632317,7.2248683290930753,7.2413553943847919,7.2571324903577263]
["R-All-HVAC-RAC-All-All-E","Res Window AC",0,0.37314804402729346,0.72028637532604767,1.0441629364019396,1.355725112743702,1.6548322757266498,1.9427124117008847,2.2196703598990437,2.4861303576841354,2.7411895242452569,2.9853525459977246,3.218598818206396,3.442498055418667,3.6559059153518847,3.8607887588868048,4.0572144634481422,4.2456749761979813,4.4251723264724463,4.5976044834076726,4.7620292483258861,4.9198670068219617,5.0704448150339108,5.2148437658853144,5.3528819463727872,5.4851849100646941,5.6115269208701042,5.7327080617395252,5.8486079450553845,5.9595169243050101,6.0656499188022597,6.1672125929623069,6.2644017548379507,6.3574057374940685,6.4464047639592543,6.5315712964618236,6.6130703706269616,6.6910599152825956,6.7656910584937302,6.8371084204182599,6.9054503935517815,6.9708494109044334,7.0334322026294593,7.0933200416007756,7.1506289784154324,7.205470066276348,7.2579495761911001,7.3081692029037812,7.3562262619589784,7.4022138782797411,7.4462211666249685,7.4883334042759051,7.5286321962863694,7.5671956336169588,7.6040984444596269,7.6394121390459118,7.6732051482193917,7.7055429560409028,7.7364882266834964,7.7661009258630118,7.7944384370395827,7.821555672615248,7.8475051803431581,7.8723372451545552,7.8960999866008681,7.9188394520997312,7.9405997061656297,7.9614229157980683,7.9813494321927454,8.000417868934063,8.0186651768204946,8.0361267154677947]
["Residential-res-Water Heating","Res Water Heat",0,8.2453089589626841E-2,0.15965619974274464,0.23106102522454414,0.30011517634315565,0.36714425749601454,0.43328430089182324,0.49769851558007583,0.56076810505232011,0.62112935800959379,0.67898558505001083,0.73451855321314441,0.78797234026966545,0.83842047064241987,0.88723623579694,0.93438454420700312,0.97977098042785205,1.0228903252007688,1.0643885409977483,1.1039894567784012,1.1420526105931215,1.1782026760024751,1.2130277338216462,1.2462242437444726,1.2781113894099685,1.3084029035778431,1.3376301449385777,1.3654738566860596,1.3921185569228844,1.4176158777236738,1.442015227772276,1.4653638881058666,1.4877071037360969,1.5090881713248341,1.529548523084391,1.5491278070648287,1.5678639639839076,1.5857933007485763,1.6029505608104602,1.6193689914916889,1.6350804084115249,1.6501152571386408,1.6645026721885123,1.6782705334802557,1.6914455203623067,1.7040531633116376,1.7161178934066912,1.7276630896699003,1.7387111243715359,1.7492834063826703,1.7594004226612678,1.769081777951792,1.7783462327752602,1.7872117397833636,1.7956954785470989,1.8038138888473241,1.8115827025317499,1.8190169740001003,1.826131109376512,1.8329388944257097,1.8394535212670475,1.8456876139381839,1.8516532528579317,1.8573619982356808,1.8628249124727612,1.8680525815991542,1.8730551357870899,1.8778422689812868,1.8824232576838675,1.8868069789303561,1.8910019274915895]
["R-All-WH-WHConvert-All-All-N","Res HP Water Heat Convert",0,9.5521511411883017E-2,0.18466001774070176,0.26737625982990332,0.34729374169179444,0.4247622874300358,0.5007457705321704,0.57454476570008128,0.64650670849235958,0.71549511455665737,0.78144331098622244,0.84480924599655527,0.90564374050841356,0.96319695595565324,1.0186689939259383,1.0723207137115272,1.12385132596888,1.1728724306438234,1.2200395710525762,1.2649703463345789,1.308126806978009,1.3492596525475535,1.3888382042416985,1.4266130911571124,1.4628665650967021,1.4973475085549806,1.5305836701369202,1.5622788525537972,1.5926091706560717,1.6216333985051381,1.6494077792219481,1.6759861339748765,1.7014199662743295,1.7257585617761984,1.7490490837875561,1.7713366646596687,1.7926644932454223,1.8130738985906412,1.8326044300214726,1.8512939337830339,1.8691786263778294,1.8862931647460548,1.9026707134237824,1.9183430088091675,1.933340420661211,1.9476920109502476,1.9614255901742064,1.9745677712497645,1.9871440210828346,1.9991787099183087,2.0106951585646953,2.0217156835851608,2.032261640542544,2.0423534653821451,2.0520107140324813,2.0612521003007456,2.070095532136405,2.0785581463332083,2.0866563417368478,2.0944058110226274,2.101821571104713,2.1089179922358956,2.1157088258542522,2.1222072312306697,2.1284258009688686,2.1343765854073364,2.1400711159704633,2.1455204275141253,2.1507350797090172,2.1557251775031721,2.1605003907033202]
["R-All-WH-SWH-All-All-C","Res Solar Water Heat",0,7.8525851154932602E-2,0.15242132706549719,0.22094307059754625,0.28720878501996766,0.35155612990369861,0.41515252445289563,0.4771346475071741,0.53788477253948175,0.5960130597110791,0.65177455718687693,0.70532062980849464,0.75689070661888991,0.80551488389847881,0.85260734972459273,0.89809721593142433,0.94190184462679605,0.98350847953685849,1.0235495412700009,1.0617844027154211,1.0985184217975184,1.1333989612588928,1.167003806724463,1.1990302409776539,1.2297963076417704,1.2590185459344005,1.2872201311497462,1.3140753473628979,1.3397741188587367,1.364366244692075,1.3878993794608201,1.4104191256510068,1.4319691220052524,1.4525911280858703,1.4723251051965092,1.4912092938191304,1.5092802877163756,1.5265731048429259,1.5431212552032609,1.5589568057873138,1.5741104427098525,1.5886115306740043,1.6024881698741495,1.6157672504484513,1.628474504586539,1.6406345563933216,1.6522709696055538,1.6634062932536229,1.6740621053570379,1.6842590547382967,1.6940169010361517,1.7033545529958218,1.7122901051103385,1.7208408726840387,1.7290234253861441,1.7368536193594508,1.7443466279463473,1.7515169710917025,1.7583785434796024,1.764944641458454,1.7712279888066373,1.777240761388631,1.7829946107493904,1.7885006866927009,1.7937696588872565,1.7988117375423334,1.8036366931931249,1.8082538756340734,1.8126722320368951,1.8169003242883992,1.8209463455817045]
["R-All-HVAC-ASHP-All-All-E","Res Air Source HP",0,0.11483911078643835,0.22465190072233934,0.32779393228620912,0.42742922635795705,0.52367727904390016,0.61813042476850377,0.70971710799528309,0.79915101269652267,0.88442390658889047,0.96669625859030972,1.045411508800036,1.1214147892218427,1.1931931956056565,1.2628894894378679,1.3297424225889147,1.3942561870656995,1.4555351550495084,1.5144144207118218,1.5707532910298951,1.624833080714299,1.6761198944722318,1.7254789909063033,1.7725081621634964,1.8176233719430712,1.8605378239186543,1.901880910778601,1.9412744749818105,1.9789716656068914,2.015045532233763,2.0495659787666543,2.082599898893823,2.1142113057140803,2.144461455781312,2.1734089678073714,2.2011099362533608,2.2276180400294274,2.2529846465137018,2.2772589110919546,2.3004878724108568,2.3227165435294235,2.343987999145277,2.3643434590647541,2.3838223680786075,2.4024624723980845,2.4202998927994979,2.4373691946190323,2.4537034547334193,2.4693343256562779,2.4842920968743241,2.4986057535423107,2.5123030326504323,2.5254104767730365,2.5379534855028014,2.5499563646700403,2.5614423734425178,2.5724337693970418,2.5829518516501748,2.5930170021316417,2.6026487250804138,2.6118656848400046,2.620685742026216,2.6291259881374227,2.637202778674463,2.6449317648343098,2.6523279238389481,2.659405587958219,2.6661784722828803,2.6726597013016948,2.6788618343340533,2.6847968898674108]
["R-All-HVAC-ERconvertDHP-HZ1-All-N","Res Ductless HP Convert",0,7.9871457983086064E-2,0.15734284733784451,0.23037655652767916,0.30090349786702308,0.36928950356335005,0.43707813469192996,0.50313229939276294,0.56800772296665381,0.62981701656426603,0.68953150909770999,0.74678094939086692,0.80212057390044722,0.85421626182587163,0.90490957122240034,0.95361731294022534,1.0006957427705971,1.0453936188047441,1.0883350393907463,1.1295386803442833,1.1690361275784498,1.2064327840864824,1.2424593433666482,1.2767511897043107,1.3096779816897706,1.3409392806345166,1.3711083302975551,1.3998089288031066,1.4272736163682276,1.4535556140382,1.478705851042958,1.5027730634877026,1.5258038887936782,1.5478429560721239,1.5689329726065215,1.5891148066107299,1.6084275664233694,1.626908676291924,1.6445939488934118,1.6615176547321562,1.6777125885491362,1.6932101328716052,1.7080403188261208,1.7222318843328344,1.7358123297938044,1.7488079713832496,1.7612439920430054,1.7731444902820064,1.7845325268743519,1.7954301695464527,1.8058585357398507,1.8158378335325758,1.8253874007983417,1.8345257426794574,1.8432705674460754,1.85163882081126,1.8596467187683743,1.8673097790144166,1.8746428510201991,1.8816601448056367,1.8883752584759117,1.894801204571869,1.9009504352857034,1.9068348665908084,1.9124659013325356,1.917854451324619,1.9230109584940767,1.9279454151155675,1.9326673831744103,1.9371860128957912,1.9415100604760598]
["R-All-HVAC-DHP_cool-All-All-N","Res Ductless HP - Cooling",0,0.28085755646675176,0.54002428381802325,0.78027398104649559,1.0117967516402102,1.2342882846014884,1.4488012324426174,1.6555219872440388,1.8546787871562851,2.045356188678443,2.2280260843752413,2.4025145693072094,2.5702148007651529,2.7296701212519436,2.8828685775480412,3.0299687854447965,3.1712198064200816,3.3055143651389511,3.4347225391250817,3.5576423250060474,3.675856349417514,3.7884830613416187,3.8966834866446276,4.0000796824126077,4.0991740188457282,4.1937616440754937,4.2845418823021717,4.3713709875878726,4.4544610404928493,4.5339730528421107,4.610061102937097,4.6828726341284712,4.7525487405317,4.819224440439096,4.8830289379581355,4.9440858733830533,5.0025135627848885,5.0584252272842525,5.1119292124511082,5.163129198256712,5.2121243999845621,5.2590097604896817,5.3038761341787914,5.3468104630678921,5.3878959452584185,5.4272121961584441,5.4648354027613388,5.5008384712808569,5.5352911684287198,5.5682602566084931,5.5998096232877019,5.6300004047989063,5.6588911048096282,5.686537707690702,5.7129937870027341,5.7383106093108989,5.7625372335292386,5.7857206059869801,5.8079056514010867,5.8291353599313327,5.8494508704865913,5.8688915504437764,5.8874950719339063,5.9052974848431212,5.9223332866701215,5.9386354893753843,5.9542356833517127,5.9691640986400651,5.983449663509302,5.9971200605133568,6.0102017801344614]
["R-All-HVAC-Zonal-All-All-E","Res Zonal Ele Heat",0,8.3793235086464093E-2,0.16498133956196967,0.24135172090965767,0.31515330511759754,0.38665062217109436,0.4574881354534151,0.52645266451346107,0.59420937199207702,0.65870787685153009,0.72111033638322208,0.78082931788887078,0.83860813375882215,0.89299001079556495,0.94603223378150125,0.99689458441007917,1.0460894648700558,1.0927919548178135,1.1376455309546367,1.1806956537686364,1.2220067395064007,1.2610660516860508,1.2987012603380352,1.3345104930787848,1.368890730934174,1.4015400731190732,1.4330443350792748,1.4630198734102071,1.4917045990857403,1.519154097339839,1.5454215597839525,1.5705578874816688,1.5946117895847467,1.6176298777216633,1.6396567563215836,1.6607351090487799,1.6809057815149964,1.7002078604300361,1.7186787493439497,1.7363542411275994,1.7532685873320486,1.7694545645611865,1.7849435379861991,1.7997655221249671,1.8139492390041709,1.8275221738168062,1.8405106281829642,1.8529397711170867,1.8648336878004577,1.8762154262534441,1.8871070419979288,1.8975296407964786,1.9075034195510721,1.9170477054406347,1.9261809933732306,1.9349209818254758,1.9432846071386292,1.9512880763378189,1.9589468985380005,1.9662759149975042,1.9732893278774124,1.9800007277624916,1.9864231199970173,1.9925689498865158,1.9984501268142651,2.0040780473192883,2.0094636171805549,2.0146172725501881,2.0195490001766312,2.0242683567569593,2.0287844874558383]
["R-All-HVAC-ER-All-All-E","Res Ele Resistance Heat",0,9.2685255054428553E-2,0.18221884633591517,0.26647320557507231,0.34787236199928523,0.42669266304760273,0.50454391244271724,0.58022185716574148,0.65445973885956499,0.72514846910658348,0.79343205177325349,0.85880387721533558,0.92198457969976266,0.98159215679150225,1.0396279097945225,1.0952732207162945,1.149036742148787,1.2001233962424063,1.2491673213578078,1.2962129826188451,1.3413612409823075,1.3840891982404937,1.4252262339395216,1.4643820786043604,1.5019767134663187,1.5376826544918158,1.5721288721549285,1.6049069218750986,1.6362734766312423,1.6662893185031504,1.6950126121604787,1.7224990175741899,1.7488017978743919,1.7739719225635806,1.7980581662852921,1.8211072033395617,1.8431636981283364,1.8642703917061112,1.8844681846035032,1.9037962160842614,1.922291939989293,1.9399911973146822,1.9569282856643366,1.9731360257118531,1.9886458248003853,2.0034877378037654,2.0176905253668087,2.0312817096376636,2.044287627600204,2.056733482109812,2.0686433907314465,2.0800404324746378,2.0909466925159688,2.1013833049957116,2.1113704939715419,2.1209276126087002,2.1300731806825359,2.1388249204661105,2.1471997910724023,2.1552140213176574,2.1628831411695764,2.1702220118412692,2.1772448545893006,2.1839652782716272,2.1903963057188296,2.196550398969741,2.202439483420374,2.2080749709329415,2.2134677819497526,2.2186283666548348,2.2235667252242912]
["R-All-Lgt-Lighting-All-All-R","Res Lighting",0,8.5918436115434899E-2,0.16694129221999862,0.24231970839915257,0.315282662414967,0.38607296629200161,0.45588427109983043,0.523776972155368,0.59029036657820599,0.65390104849096053,0.71495701565178726,0.77358043755367811,0.83005195147331023,0.8833578105565264,0.93497844806241959,0.98478634285232203,1.032759091349041,1.0783372417257695,1.1222005736577354,1.164036747779061,1.2042559203730356,1.2424341245449417,1.2792118213482733,1.3142601691683644,1.3479138591189379,1.3798820860520891,1.4107414461996912,1.4401134212559519,1.4682205744198378,1.495117371705853,1.5208559337020398,1.5454861365692041,1.5690557086908925,1.5916103231614078,1.6131936862910874,1.63384762230035,1.6536121543666302,1.6725255821812526,1.6906245561665367,1.7079441484969524,1.7245179210619437,1.7403779905021264,1.7555550904448851,1.7700786310599652,1.7839767560504727,1.7972763971897139,1.8100033265095623,1.8221822062414743,1.8338366366069405,1.8449892015499705,1.8556615125002385,1.8658742502516907,1.8756472050377697,1.8849993148809074,1.8939487022906087,1.9025127093812317,1.9107079314775219,1.9185502492730149,1.92605485960363,1.9332363048960848,1.9401085013481945,1.9466847658956679,1.9529778420176522,1.9589999244310341,1.9647626827213518,1.9702772839561058,1.9755544143242914,1.980604299844086,1.9854367261788182,1.9900610575996143,1.9944862551314761]
["Residential-res-Other","Res Other",0,8.2708455831579319E-2,0.16021511733531907,0.23207153657283977,0.3016237929911173,0.36911715468602774,0.43567356780532102,0.50046154299054402,0.56388006987119899,0.62460887287003874,0.68283094444239878,0.73874972956361484,0.7925816361097664,0.84334723305340098,0.89246249141652156,0.9399440599605553,0.98563323573014316,1.0290272287273348,1.0708125738121848,1.1106426855160416,1.1489278834572709,1.1853120427970147,1.2203673421604411,1.2537887442054274,1.2858755477135853,1.3163729942884619,1.3458021405337681,1.3738290719336774,1.4006491019814373,1.4263142025056095,1.4508741073134297,1.4743764085649322,1.4968666489969922,1.5183884101759968,1.5389833969501641,1.5586915182651566,1.5775509644995993,1.595598281470358,1.6128684412509879,1.6293949099405862,1.6452097125143645,1.6603434948816165,1.6748255832713312,1.6886840410605319,1.7019457231554609,1.7146363280309911,1.7267804475291058,1.7384016145129477,1.7495223484687774,1.7601641991442125,1.7703477883073084,1.7800928497074,1.7894182673151431,1.7983421119158545,1.8068816761270612,1.8150535079081205,1.8228734426268376,1.8303566337452268,1.8375175821838772,1.8443701644218198,1.8509276593863584,1.8572027741849599,1.8632076687290762,1.8689539792976084,1.8744528410856776,1.8797149097823946,1.8847503822194442,1.8895690161304963,1.894180149059733,1.8985927164561318,1.9028152689885707]
["R-All-Bld-Bldg-All-All-R","Res Whole Home",0,8.6668434719573736E-2,0.16840670299806457,0.2443670864574411,0.31785212268704593,0.38910298039897279,0.45938408383271168,0.52777373471571754,0.59476271585401819,0.65878536022712553,0.7203320741540612,0.77937997844518547,0.83632204413419298,0.89002692727442334,0.94206861325942493,0.99225806489031321,1.0406218529802094,1.0865395971505334,1.130720544721886,1.1728958888717094,1.2134304595907632,1.2518890196933377,1.2889470790997748,1.3242525884717264,1.3581606570267488,1.3903725337534278,1.4214543106757183,1.4510467419730411,1.4793648580470344,1.5064635337159276,1.5323952807675001,1.557210349716373,1.5809568271794094,1.6036807290579134,1.625426089707199,1.6462350472663243,1.6661479253133342,1.6852033110042528,1.7034381298472372,1.7208877172567913,1.7375858870266996,1.7535649968543632,1.768856011043515,1.783488560506818,1.79749100018462,1.8108904639911292,1.8237129173944873,1.8359832077326288,1.8477251123624292,1.8589613847354443,1.8697137984895253,1.8800031896417564,1.8898494969644652,1.8992718006225597,1.9082883591470523,1.9169166448164232,1.9251733775143856,1.9330745571296608,1.940635494560546,1.9478708413843595,1.954794618249253,1.9614202420434095,1.9677605518942767,1.9738278340482169,1.9796338456787814,1.9851898376697525,1.9905065764170931,1.9955943646920604,2.0004630616059043,2.005122101714846,2.0095805133023501]
["Residential-Spa Heater","Res Spa Cover",0,0.11061198247591923,0.21368274203931181,0.30960715033661002,0.40252751952558058,0.49261395408693409,0.58063670383866373,0.66620025225254431,0.74953855468507413,0.82940103813641908,0.90561420242848445,0.97888294973506962,1.049216985252138,1.1159660577056751,1.1802520122760951,1.2423731365086372,1.3020085896380686,1.3586535016271577,1.4131825262181346,1.4652036204182044,1.5149896391794802,1.5626479258879786,1.608353133173188,1.6520317560906046,1.693916310255607,1.7337756012523791,1.772180858907789,1.808828403613469,1.8438978243844548,1.8774570787107572,1.909571197683295,1.9403024120110823,1.9697102726118358,1.9978517660096864,2.02478142476361,2.0505514331405705,2.0752117282381404,2.0988100967525614,2.1213922675797585,2.1430020004287509,2.1636811706191743,2.1834698502272349,2.202406385737341,2.2205274723498829,2.2378682250891568,2.2544622468492279,2.2703416935095833,2.2855373362467648,2.3000786211627284,2.3139937263454686,2.3273096164724927,2.3400520950629464,2.3522458544796487,2.3639145237779284,2.3750807144939854,2.385766064461504,2.395991279741426,2.4057761747461361,2.415139710635811,2.4241000320613373,2.4326745023249989,2.4408797370270667,2.4487316362634957,2.4562454154371118,2.4634356347420079,2.4703162273782722,2.4769005265517303,2.4832012913110209,2.4892307312720643,2.4950005302778475,2.5005218690393627]
["Residential-Res-TV","Res Power Strip",0,9.0726868705773261E-2,0.17602667813404069,0.25537273652830955,0.33204358862136812,0.40634058952313473,0.47941570921181476,0.55045250530676937,0.61984428087922516,0.68628405369737866,0.74998011249559204,0.8111344228866546,0.86998065960290138,0.9255488453967452,0.97925202845324189,1.0311159764840561,1.0809927089208389,1.1283918339010091,1.1740029929077425,1.2175198111030949,1.2593184785647784,1.2990629425004574,1.3373286708367498,1.373818797814236,1.4088544732480928,1.4421682240145526,1.4742863011579213,1.5048862038363797,1.5341684073564357,1.562189654744049,1.5890042455455928,1.6146641410494629,1.639219064976611,1.6627165998351259,1.6852022791255707,1.7067196755757572,1.7273104855759358,1.7470146099780206,1.7658702314154224,1.7839138882933188,1.801180545592741,1.8177036626256808,1.8335152578725136,1.8486459710273773,1.8631251223717444,1.8769807695912344,1.8902397621457705,1.9029277932984368,1.9150694499038587,1.9266882600525881,1.9378067386638123,1.9484464311147445,1.9586279549912344,1.9683710400405072,1.9776945664034478,1.98661660120052,1.995154433542216,2.0033246080318774,2.0111429568258115,2.0186246303128299,2.0257841264726562,2.0326353189700974,2.039191484039419,2.0454653262110192,2.0514690029302534,2.0572141481161235,2.062711894705473,2.0679728962263813,2.0730073474425619,2.0778250041087634,2.0824352018754637]
["Res-Conditioning-Synthetic-ETO","Res Space Conditioning",0,0.21330487251697758,0.41318916664153615,0.59984927300813573,0.77966247395089783,0.95266648676521415,1.1202604251100972,1.2819596574202723,1.4382949504767819,1.5877724008603631,1.7311833098778857,1.8682446988523589,2.0000716573583253,2.1253569122137628,2.2460692237382176,2.3618380814621354,2.4731050060517252,2.5789835355503441,2.6807199651331231,2.7778496221119249,2.8711125368306725,2.9598679768246035,3.0450987749016609,3.1264824110512417,3.2045198911835175,3.2789428285854485,3.3504307039911456,3.4187124889003795,3.4840539098661534,3.5465815854314875,3.6064166816662562,3.663675146962686,3.7184679367200353,3.7709012283538623,3.8210766270465197,3.8690913626375796,3.9150384780357226,3.9590070095171996,4.0010821592602399,4.0413454604497518,4.079874935272251,4.1167452461071781,4.1520278402075883,4.1857910881505633,4.2181004163256599,4.2490184337180965,4.2786050532323907,4.3069176077915223,4.3340109614366256,4.3599376156424654,4.3847478110547522,4.408489624846414,4.4312090638814974,4.4529501538672225,4.4737550246669606,4.4936639919394361,4.5127156352623805,4.5309468728919917,4.5483930333031024,4.5650879236486643,4.5810638952712104,4.5963519063932639,4.6109815821081481,4.6249812717874637,4.6383781040164731,4.6511980391638508,4.6634659196876571,4.6752055182750309,4.686439583908883,4.6971898859508459,4.7074772563259293]
["R-All-Plug-EVSEStandbySave-All-All-U","Res EV Standby Mode",0,4.950468035347938E-2,9.8112561802099096E-2,0.15052210979588732,0.20354779866529354,0.25710166493184178,0.30972681323323276,0.36376564709337372,0.41737982258696266,0.47055248091794571,0.52138731114679748,0.5704390741094616,0.61734675886620471,0.66323783267069136,0.70735507807520426,0.75072189795765687,0.79281532676212862,0.83419577559920777,0.87494063218709683,0.9141985478744773,0.95161139099707104,0.98756184025862748,1.0217166123448009,1.0546291781227177,1.086014473701028,1.1161307692956732,1.14478882948852,1.1724316511460251,1.1987423500600392,1.2227393126878827,1.2457029132886901,1.2676776507057304,1.2887061075641422,1.3088290327875027,1.3280854205610535,1.3465125858945948,1.3641462369314767,1.3810205441438037,1.3971682065479443,1.4126205150686533,1.4274074131745946,1.4415575549027682,1.4550983603842742,1.4680560689790165,1.480455790122311,1.4923215519819226,1.5036763480198285,1.5145421815489251,1.524940108371027,1.53489027757878,1.5444119706005532,1.5535236385639728,1.5622429380504985,1.5705867653103318,1.578571289003952,1.5862119815337326,1.5935236490263451,1.6005204600240606,1.6072159729405346,1.6136231623342898,1.6197544440508018,1.6256216992819141,1.6312362975891983,1.636609118935882,1.6417505747700289,1.6466706281998345,1.651378813300127,1.6558842535874885,1.6601956796997959,1.664321446314444,1.6682695483380308]
["R-All-Plug-EVSEChargeSave-All-All-U","Res EV Charging Mode",0,7.0649468597188472E-2,0.13956530541116124,0.21157153367099421,0.2833717795302711,0.35512990191243182,0.42521065316793649,0.49613256447174359,0.56582886320335857,0.63447785570596738,0.7000375122487682,0.76310703516398815,0.82339262600657936,0.88207992294312521,0.93849321538907449,0.99362200235540066,1.0469672550222673,1.0990848163137552,1.1501048526927551,1.1991781596103741,1.2459846261325143,1.2909314010525756,1.3337059856741431,1.3748564748931726,1.4141224363542666,1.4517995352509432,1.4876638957644535,1.5222065497127641,1.555138190901681,1.5850961610582246,1.6137640750836253,1.6411974856342479,1.6674495531468054,1.6925711488526021,1.7166109533557568,1.7396155509664311,1.761629519971861,1.7826955190201195,1.8028543697840032,1.8221451360652314,1.8406051994922443,1.8582703319582849,1.8751747649401422,1.8913512558318717,1.9068311514220435,1.9216444486375188,1.9358198526714665,1.9493848326082588,1.9623656746530362,1.9747875330690909,1.9866744789217747,1.9980495467233859,2.0089347790694259,2.0193512693527174,2.0293192026381637,2.038857894777347,2.0479858298387663,2.056720695926249,2.0650794194549404,2.073078197951296,2.0807325314406313,2.0880572524830576,2.0950665549160012,2.1017740213590095,2.108192649534137,2.1143348774529196,2.1202126075187402,2.1258372295912955,2.1312196430578556,2.1363702779540854,2.1412991151753582]
["A-Irr-Irr-Irrigation-All-All-E","Ag-Irrigation",0,9.0019118807899409E-2,0.1711376170577065,0.2454796631992775,0.31743191615170313,0.38731316897294449,0.45542853851090037,0.52159046092686878,0.58575709076882765,0.64775928235295244,0.70649487346043593,0.76322750439399012,0.81742956587592996,0.86875906782183665,0.91762830360163727,0.96554011093153225,1.0112037023510199,1.054709094245555,1.0966319100022208,1.1362223450598177,1.1743001863566493,1.2108983615062106,1.2461259026859408,1.2798534230075069,1.3121575677077983,1.3429832241401924,1.3726886482837846,1.4010521350414531,1.4281942276325235,1.4541675219780452,1.4790223491029466,1.5028068726674455,1.5255671822985448,1.5473473829024678,1.5681896801311022,1.5881344621680729,1.6072203779929251,1.6254844122750802,1.6429619570426932,1.6596868802652891,1.6756915914830841,1.6910071046101609,1.7056630980332008,1.7196879721222342,1.73310890426485,1.7459519015305109,1.7582418510670286,1.7700025683268541,1.7812568432166391,1.792026484259496,1.8023323608555311,1.8121944437225501,1.8216318435952958,1.8306628482582106,1.8393049579834875,1.8475749194430828,1.8554887581603987,1.863061809564529,1.8703087487072372,1.8772436187002597,1.8838798579280323,1.89023032608858,1.8963073291130279,1.9021226430120208,1.9076875366952677,1.9130127938084225,1.9181087336296234,1.922985231066179,1.9276517357901559,1.9321172905499426,1.9363905486932793]
["DSI-0","Flat - ele",0,7.2370073711845229E-2,0.14020786710520697,0.20305987123240052,0.26396702415938378,0.32315544504619076,0.38167441412261688,0.43875158399350039,0.49470989715978059,0.54834072885501706,0.59975174841539647,0.64916845627316266,0.6967759711368342,0.74158797679867539,0.78497050925160883,0.82697962006937287,0.86740577585201095,0.90576648641876412,0.94275120687607683,0.97798449574825252,1.0118632231851752,1.0440365857676202,1.0750613626861172,1.1046352284673817,1.1330296547628065,1.1600210136781501,1.1860796977476522,1.2108769263289942,1.2346063316699913,1.2573138965896058,1.279043623785409,1.2998376211019675,1.3197361831273822,1.3387778692761043,1.3569995785093312,1.3744366208377778,1.3911227857453825,1.4070904076665354,1.4223704286437149,1.4369924582869491,1.4509848311512878,1.4643746616434781,1.4771878965642342,1.4894493653879246,1.5011828283771018,1.5124110226251182,1.5231557061160432,1.5334376998872632,1.5432769283764689,1.5526924580312111,1.5617025342558448,1.570324616767456,1.5785754134292851,1.5864709126272074,1.5940264142520137,1.6012565593475221,1.6081753584819798,1.6147962188977287,1.6211319704917468,1.6271948906774101,1.6329967281756528,1.6385487257816265,1.6438616421509791,1.6489457726479675,1.6538109692958032,1.6584666598678948,1.6629218661569776,1.6671852214575353,1.6712649872953895,1.6751690694368768,1.678905033208635]
["IndShift1","1-Shift Industrial",0,7.8379545805124795E-2,0.15115218909261241,0.21802426904163244,0.28274143013757658,0.34562824958134675,0.4076973138034114,0.46818212520364999,0.52744205327284488,0.58419075353791994,0.63850653915112421,0.69064967734318816,0.74079949875619855,0.7881414558013432,0.83392479172266043,0.87819153498916902,0.92079491720642459,0.96126273652461502,1.0002237316270524,1.0373574849547773,1.0730633315063685,1.1070009790847954,1.1396950227854503,1.1708628034009554,1.200815065853909,1.2292475249357988,1.2566920909325245,1.2828471760701896,1.3078759656756109,1.3318269605133348,1.3547465727982377,1.3766792161330734,1.3976673915731073,1.4177517699846229,1.4369712708568867,1.4553631377202971,1.4729630103168621,1.4898049936628572,1.5059217241374938,1.5213444327256627,1.5361030055373075,1.5502260417206997,1.5637409088818406,1.576673796117382,1.5890497647638335,1.6008927969613944,1.6122258421265248,1.6230708614233,1.6334488703197356,1.64337997931154,1.6528834328922142,1.6619776468450123,1.6706802439290298,1.679008088028568,1.686977316831954,1.6946033731031365,1.7019010346066608,1.7088844427440042,1.7155671299567734,1.7219620459498537,1.7280815827853373,1.7339375988958479,1.7395414420638007,1.7449039714111239,1.7500355784420552,1.7549462071797883,1.7596453734359927,1.764142183250542,1.7684453505371922,1.7725632139693932,1.7765037531389636]
["IndShift2","2-Shift Industrial",0,7.7462826697461115E-2,0.14944881049868558,0.21564456689521541,0.27971670359224809,0.3419810978856207,0.40345224708300131,0.46336345619657765,0.52206958650645896,0.57829332779422105,0.63211447853268043,0.6837898286748928,0.73349864140163823,0.7804091019469398,0.82578102694198907,0.86965772454427237,0.91188610434948436,0.95199333073168013,0.99061320714737056,1.0274197141562453,1.062811640784276,1.0964469301491973,1.1288534389178491,1.1597465470754127,1.189432506541338,1.2176156949241737,1.2448209550401141,1.270743415151361,1.2955495970759991,1.3192875702096243,1.3420033339738586,1.3637409069539872,1.3845424121981293,1.4044481588432414,1.4234967202261239,1.4417250086307962,1.4591683468170855,1.4758605364690371,1.4918339236957847,1.5071194617118113,1.521746770818057,1.5357441958001101,1.5491388608547063,1.5619567221509707,1.574222618128257,1.5859603176280528,1.5971925659532162,1.6079411289438033,1.6182268351548914,1.6280696162181334,1.637488545465255,1.6465018748883378,1.6551270705085128,1.6633808462215991,1.6712791961862747,1.6788374258175434,1.6860701814455514,1.6929914786972342,1.699614729655782,1.7059527688505647,1.7120178781278688,1.7178218104506477,1.7233758126734029,1.7286906473363262,1.733776613520942,1.7386435668076556,1.7433009383738887,1.7477577532698054,1.7520226479070464,1.7561038867943584,1.7600093785525515]
["IndShift3","3-Shift Industrial",0,7.5651818579298757E-2,0.14625281296020728,0.21142087632015841,0.27452153459628026,0.33583421127573176,0.39638920241379549,0.45541993445373302,0.51326557177344589,0.56868319254685284,0.6217651151554866,0.67275576105278367,0.72183640034092356,0.76810511334749831,0.81287223760698424,0.85618496590442439,0.89786697998458331,0.93744062507961889,0.97556747490051188,1.0118979983226963,1.0468318566155566,1.0800218324797437,1.1120099782355293,1.1425038781623604,1.1717952189968066,1.1996212963917556,1.2264815067758612,1.2520605837307148,1.2765381693334459,1.2999616962260114,1.3223765544964092,1.3438261796355455,1.3643521367064897,1.383994200889211,1.4027904345568871,1.4207772610331322,1.4379895351730798,1.4544606109050868,1.4702224058639455,1.4853054632408433,1.4997390109699325,1.51355101836619,1.5267682503243312,1.5394163191837964,1.5515197343603182,1.5631019498402434,1.5741854096296455,1.5847915912462982,1.5949410473387888,1.6046534455134209,1.6139476064460834,1.622841540352937,1.6313524818905962,1.639496923553428,1.647290647632693,1.6547487567994537,1.6618857033705166,1.6687153173141174,1.6752508330496205,1.6815049150931642,1.6874896825989478,1.6932167328437164,1.6986971636999546,1.7039415951413308,1.7089601898220736,1.7137626727701529,1.7183583502324298,1.7227561277082928,1.7269645272067262,1.7309917037602511,1.7348454612277389]
["Commercial-Ref.warehouse-Refrig","Cold Storage",0,7.5819511543682244E-2,0.14617797917236824,0.21096398659008514,0.2738250656958911,0.33489599755817584,0.39516962676322814,0.45392596610415753,0.51149028111657668,0.56668689064329059,0.61955423983493851,0.67034324028298864,0.71927076811999002,0.7653456544784536,0.80991951829929965,0.85309733895671547,0.89463538111868435,0.93402611577875305,0.97204125395641316,1.0081848332727954,1.0429808080798912,1.0760196734248717,1.1078901389492888,1.13827318448646,1.1674475976164049,1.195180006501559,1.2219543263338766,1.2474388835680217,1.2718260196772515,1.2951629920305814,1.3174950229907059,1.3388653875458489,1.3593154971679955,1.3788849800600016,1.3976117579470886,1.4155321195615262,1.4326807909629018,1.4490910028302468,1.4647945548564143,1.4798218773694931,1.4942020903006694,1.5079630596127995,1.5211314512990484,1.5337327830562246,1.5457914737329481,1.5573308906484729,1.5683733948738556,1.5789403845632173,1.5890523364190654,1.5987288453720303,1.6079886625519011,1.6168497316235475,1.6253292235581376,1.6334435699070278,1.6412084946428076,1.6486390446291996,1.6557496187788574,1.6625539959555631,1.6690653616748989,1.6752963336551248,1.6812589862677807,1.6869648739353942,1.6924250535216272,1.6976501057572571,1.7026501557435054,1.7074348925724512,1.7120135881025431,1.7163951149255974,1.7205879635600991,1.7246002589041198,1.7284397759797379]
["SIC 20-IND_SIC 20","Food Products",0,7.5032430206673037E-2,0.1450361743094313,0.20978515701588094,0.27260712956082328,0.3336463619893425,0.39392635456640052,0.45264763960469506,0.51021581290396578,0.56539632908557025,0.61827353866238077,0.66909354810148491,0.71804440689061289,0.76411774972330293,0.80873388813241187,0.85193345293869938,0.89350592685919106,0.93295313742544539,0.97101247949073333,1.007192159223939,1.0420264270635178,1.075095620153377,1.1069922215277743,1.1373971776452045,1.1665875944689932,1.194326894337751,1.2211174200308024,1.2466076759671743,1.2710002653799704,1.2943424562056125,1.3166794809191458,1.3380546241856848,1.3585093067373966,1.3780831656385564,1.3968141310942117,1.4147384999512982,1.4318910060346346,1.4483048874540951,1.4640119510133873,1.4790426338452463,1.4934260623924793,1.5071901088491619,1.5203614451713463,1.5329655947619532,1.545026981929998,1.556568979219993,1.567613952703242,1.578183305318791,1.5882975183480248,1.5979761911032724,1.6072380789073373,1.6161011294375427,1.6245825175047248,1.6326986783345643,1.6404653394157502,1.647897550976694,1.6550097151498457,1.6618156138801343,1.668328435631607,1.6745608009440209,1.6805247868889146,1.6862319504725449,1.6916933510310428,1.6969195716611842,1.7019207397283052,1.7067065464911007,1.7112862658813353,1.7156687724748614,1.7198625586887621,1.7238757512379492,1.7277161268831043]
["SIC 24-IND_SIC 24","Wood Products",0,7.4338268508597136E-2,0.14409329551279113,0.20872542688776133,0.27131055479787541,0.33210502543420894,0.39219320937354163,0.45076587426591258,0.50818676543356311,0.56318925697469646,0.61592611681600784,0.66659498689787278,0.71539761193258833,0.76136833679044413,0.80588325936953797,0.84893964163371671,0.89038239057877711,0.92972098442721607,0.96762524191002486,1.0037583431316153,1.038498859957083,1.071486621806617,1.1032830032719012,1.1335874379137172,1.1626937239792168,1.1903515380542888,1.217051672609573,1.242462257948642,1.2667786075554062,1.290047841628865,1.3123150512685386,1.3336233858519582,1.3540141366494887,1.3735268168385133,1.3921992380720298,1.4100675837500358,1.4271664791356875,1.4435290584521006,1.4591870290898163,1.4741707330493532,1.4885092057379052,1.5022302322341274,1.5153604011300335,1.5279251560543456,1.5399488449771326,1.5514547673912824,1.5624652194622395,1.57300153723349,1.583084137971529,1.5927325597304178,1.601965499212608,1.6108008479993932,1.6192557272211969,1.6273465207348847,1.6350889068723851,1.6424978888221462,1.6495878237023003,1.6563724503818735,1.6628649161039535,1.6690778019624031,1.6750231472814936,1.680712472945695,1.6861568037248351,1.6913666896378878,1.6963522263967898,1.701123074969902,1.7056884803030237,1.7100572892342407,1.7142379676373189,1.7182386168268677,1.7220669892570577]
["SIC 26-IND_SIC 26","Pulp & Paper",0,7.439782606015255E-2,0.14401664913773599,0.20846472586643058,0.27088911622828588,0.33150783121042143,0.39138381008751694,0.44975893040809595,0.50693716198861216,0.56175324172977348,0.61428686849108205,0.66477601688356269,0.71341361586669794,0.75921121901081845,0.80351811050055477,0.84642000602706857,0.88768411961441362,0.92683370125973596,0.96458454281417605,1.0005449896561092,1.0351297516350728,1.0679723386816722,1.099638808180379,1.1298250386134789,1.1588139898948095,1.18637852576773,1.2129813563806113,1.2382968651324873,1.2625222323591627,1.2857044019540675,1.3078882963032588,1.3291169033359775,1.3494313598266177,1.3688710311095267,1.3874735873611141,1.4052750765970832,1.4223099945262403,1.4386113513962469,1.4542107359608467,1.469138376692521,1.4834232003591949,1.4970928880785002,1.5101739289582179,1.5226916714268477,1.5346703723537658,1.5461332440541662,1.5571024992698603,1.5675993942131083,1.5776442697568862,1.5872565908514107,1.5964549842432998,1.6052572745704667,1.6136805189026837,1.6217410397947574,1.6294544569163589,1.6368357173198054,1.643899124404443,1.6506583656337617,1.6571265390589467,1.6633161787002724,1.6692392788355119,1.67490731724244,1.6803312774404573,1.6855216699744451,1.690488552782089,1.6952415506841405,1.6997898740353861,1.7041423365724628,1.7083073724931108,1.7122930527999507,1.7161071009404676]
["SIC 28-IND_SIC 28","Chemicals",0,7.0805385201208618E-2,0.13733371352137452,0.19899229886215003,0.25873797084018213,0.3168020919564129,0.37428015324875363,0.4303713577979143,0.48539665872739324,0.53810903790702647,0.58867614908702492,0.63726597883449165,0.68410526322106457,0.72816766131543231,0.77086501854864997,0.81218552641836417,0.85197211271094664,0.88971568305298521,0.92610810885169226,0.96080137521585762,0.99415769272438126,1.025808668196978,1.0563350820051531,1.0854275197961365,1.1133640549084396,1.1399143877374758,1.1655485006363748,1.1899385745914495,1.2132783582805162,1.2356130795140727,1.2569860184935526,1.2774385916796578,1.2970104320491367,1.3157394658955277,1.3336619863226964,1.3508127235735754,1.3672249123303974,1.38293035611683,1.3979594889268132,1.4123414341995244,1.4261040612547504,1.439274039298029,1.4518768891002094,1.4639370324515784,1.475477839486381,1.4865216739694458,1.4970899366326658,1.5072031066453164,1.5168807812985707,1.5261417139811106,1.5350038505194263,1.5434843639532212,1.551599687813312,1.5593655479665089,1.5667969930891854,1.5739084238285888,1.5807136207084007,1.5872257708326225,1.5934574934395334,1.5994208643552377,1.6051274393941888,1.610588276752037,1.6158139584341884,1.6208146107616059,1.6255999239935846,1.6301791711055258,1.634561225758101,1.6387545794926228,1.6427673581859452,1.64660733779678,1.6502819594339426]
["SIC 29-IND_SIC 29","Oil & Petroleum",0,7.0878066721691044E-2,0.13721097714273542,0.19862223389681524,0.25816292415487591,0.31605195618657056,0.37331364396444577,0.42917991868843541,0.48397122044648216,0.53649967236798535,0.58683685075304093,0.63524346185837388,0.68186917056321017,0.72574646799026399,0.7682093397687999,0.80936436880080098,0.84895938602877097,0.88653159429801554,0.92275966537759402,0.95725595268971331,0.99042421185186313,1.0219389938442289,1.0523297435271368,1.0813025052795828,1.1091160823053441,1.1355529745197095,1.161083701119664,1.1853774830982748,1.2086251213553187,1.2308716651419636,1.2521602237894707,1.2725320502464152,1.2920266210186109,1.3106817126666452,1.3285334750092617,1.345616501174445,1.3619638946339505,1.3776073333511807,1.3925771311667119,1.4069022965404259,1.4206105887640759,1.4337285717532144,1.4462816655227251,1.4582941954457018,1.4697894393911339,1.4807896728317391,1.4913162120093515,1.5013894552415166,1.5110289224493298,1.5202532929831227,1.529080441819288,1.5375274741983935,1.5456107587717003,1.5533459593203192,1.5607480651084711,1.5678314199296695,1.5746097499021079,1.5810961900671208,1.5873033098422527,1.5932431373782641,1.5989271828672702,1.6043664608471804,1.609571511545659,1.6145524213049687,1.6193188421272746,1.6238800103782851,1.6282447646854721,1.6324215630655554,1.6364184993144388,1.640243318691361,1.6439034329276503]
["SIC 33-IND_SIC 33","Primary Metals",0,7.0667324857811881E-2,0.13718914421475412,0.19897216771857437,0.25881686168409085,0.31698902449399102,0.37455838401531871,0.430729336740938,0.48582443376260709,0.538604417901965,0.58923832197538684,0.63789807095870965,0.68479035703647273,0.72890000570359847,0.7716398734348674,0.81300372157752754,0.85283588377821962,0.8906406168906541,0.92708193882626444,0.96181677352065897,0.99521509949981535,1.0269105286612779,1.0574829906786163,1.0866218415687714,1.1145939552635522,1.1411817987820487,1.1668518335784808,1.1912781494149292,1.2146526143301908,1.2370205233400107,1.258425220957063,1.2789081851839073,1.2985091078890216,1.3172659717216666,1.3352151237146286,1.352391345717463,1.3688279217967305,1.3845567027338284,1.3996081677454053,1.4140114835459576,1.4277945608670599,1.4409841085427562,1.4536056852659105,1.465683749115819,1.4772417049530517,1.4883019497733703,1.4988859161086034,1.5090141135585873,1.5187061685346483,1.5279808622916446,1.5368561673222632,1.5453492821840991,1.5534766648270042,1.5612540644852866,1.5686965521965617,1.5758185500063941,1.5826338589153248,1.5891556856224356,1.5953966681172784,1.6013689001697595,1.6070839547654352,1.612552906531632,1.6177863531978491,1.6227944361320281,1.6275868599924865,1.632172911533595,1.6365614776016415,1.6407610623557529,1.6447798037472472,1.6486254892893468,1.6523055711478154]
["SIC 37-IND_SIC 37","Transportation & Equipment",0,7.381819279387089E-2,0.14289025792316734,0.20678220173822198,0.26864930153188693,0.32875787827356212,0.3881611113323179,0.44608712855228499,0.50285266283014529,0.55724913281367194,0.60937503295941708,0.65946456123580299,0.70769726780891362,0.75312806796843446,0.7970885268219069,0.83964247777521805,0.88059009052587833,0.91945711612524783,0.95691323459977962,0.99260822667819204,1.0269250030092409,1.0595242396668882,1.0909505989086379,1.1209089791397115,1.149680217103791,1.1770225596449315,1.2034147915126969,1.2285404743619732,1.2525841900072141,1.2755925303375879,1.2976100808929694,1.3186795072617559,1.338841637758202,1.3581355425394903,1.3765986093158429,1.3942666158003905,1.4111737990391922,1.4273529217557488,1.4428353358385781,1.4576510430948741,1.4718287533879804,1.4853959402713357,1.4983788942266996,1.5108027736098231,1.5226916534022854,1.5340685718639722,1.5449555751765909,1.5553737601647426,1.5653433151773282,1.5748835592085106,1.5840129793340441,1.5927492665355114,1.6011093499818918,1.6091094298348871,1.6167650086415812,1.6240909213752597,1.6311013641826078,1.6378099218929887,1.644229594343114,1.6503728215681144,1.6562515079078273,1.6618770450750169,1.6672603342302224,1.6724118071060168,1.6773414462216099,1.6820588042269617,1.6865730224139017,1.690892848430112,1.6950266532303131,1.6989824472974915,1.7027678961656045]
["Other SICs-IND_Other SICs","Other Industrial",0,7.3818192619307388E-2,0.14289025758066767,0.20678220123152324,0.26864930086464317,0.32875787745164242,0.38816111036223666,0.44608712743875295,0.50285266157860986,0.55724913142934085,0.60937503145110394,0.6594645596092219,0.70769726607022432,0.75312806612167704,0.79708852486978254,0.83964247572304984,0.88059008837914665,0.91945711388885354,0.95691323227649405,0.99260822427002615,1.0269250005221418,1.059524237102855,1.0909505962724191,1.1209089764340123,1.1496802143314275,1.177022556809147,1.2034147886164075,1.2285404714076118,1.2525841869972809,1.2755925272744761,1.2976100777789692,1.3186795040990582,1.3388416345489043,1.3581355392855989,1.3765986060192781,1.3942666124629901,1.4111737956627148,1.4273529183418769,1.4428353323889223,1.4576510396109752,1.471828749871313,1.4853959367233109,1.4983788906486675,1.5108027700030759,1.5226916497680598,1.5340685682034514,1.5449555714909073,1.5553737564549799,1.5653433114445232,1.5748835554536553,1.5840129755580883,1.5927492627393636,1.6011093461664214,1.6091094260009267,1.6167650047899267,1.6240909175066731,1.6311013602978179,1.6378099179926937,1.6442295904279813,1.6503728176387829,1.6562515039649086,1.6618770411190962,1.6672603302618592,1.6724118031257473,1.6773414422299466,1.6820588002243955,1.6865730184009018,1.6908928444071278,1.6950266491977746,1.69898244325581,1.7027678921151739]
["S-All-Lgt-Streetlight-All-All-U","Street Lighting",0,7.5835150340717028E-2,0.14867593555509354,0.2173974547236403,0.28406010485786748,0.34869865432716485,0.41259776169720913,0.47483464702067801,0.53586013721702552,0.59427814348582453,0.65055345095336481,0.70464770600877824,0.75694328493861096,0.80605014504328587,0.85373892585167943,0.89981532044442936,0.94420904652584836,0.98628915523801775,1.0268916983394705,1.0656114055780741,1.1028313003865815,1.1380806757274939,1.1720977300855746,1.2045016443642582,1.2355727687953086,1.2651584370361773,1.2937177220493405,1.3208347981188562,1.3467841532093017,1.3716160719561394,1.3953786736277547,1.4181180053709272,1.4398781314409488,1.4607012185892947,1.4806276177743147,1.4996959423532814,1.5179431429073162,1.5354045788441919,1.5521140869177572,1.5681040467967668,1.5834054438101732,1.5980479289904663,1.6120598765314169,1.6254684387715608,1.638299598809976,1.6505782208563062,1.6623280984126034,1.6735720003803516,1.6843317151820247,1.6946280929826689,1.7044810860933333,1.7139097876346385,1.7229324685354095,1.7315666129380609,1.739828952079354,1.7477354967121705,1.7553015681311339,1.7625418278621992,1.7694703060737447,1.776100428764219,1.7824450437790271,1.788516445707073,1.794326399705203,1.799886164296715,1.8052065131881139,1.8102977561463907,1.8151697589772773,1.8198319626431976,1.8242934015579537,1.8285627210936057,1.8326481943334643]
["Commercial-college-AirComp","College Compressed Air",0,8.2053125910362124E-2,0.15863583265677847,0.22932549728883481,0.29766902279222246,0.36405243777852136,0.42952888609921169,0.49328168170710907,0.55569641816451387,0.61546008003219732,0.67264576475916416,0.72755665237140865,0.7803408698950477,0.83021434525324778,0.87841707917111,0.92500433356979095,0.9698218025392682,1.0124375444516698,1.0534343439143616,1.09254873428805,1.1301320738129963,1.1658623586565573,1.2002679472335456,1.2330752274598287,1.2645958669840618,1.29452135512208,1.3233992989302508,1.3509211890530362,1.3772579260126394,1.4024605451127383,1.4265778839645076,1.4496566771240953,1.4717416466548012,1.492875588789448,1.5130994568608804,1.5324524406612943,1.5509720423841784,1.5686941492960291,1.5856531032786614,1.6018817673768742,1.6174115894804271,1.6322726632637312,1.6464937865013429,1.6601025168722632,1.6731252253611821,1.6855871473601476,1.6975124315696839,1.7089241867941205,1.719844526721811,1.7302946127770173,1.740294695126497,1.7498641519202576,1.7590215268425164,1.767784565045635,1.7761702475366574,1.7841948240830905,1.7918738447016866,1.7992221897912524,1.8062540989678704,1.8129831986584137,1.8194225285058236,1.8255845666373165,1.8314812538444867,1.8371240167221614,1.8425237898108455,1.8476910367856627,1.8526357707328562,1.8573675735531372,1.8618956145294825,1.8662286680953633,1.8703751308378329]
["Commercial-college-Cook","College Cooking",0,8.1143712488918829E-2,0.15678819253529722,0.22654072511765938,0.29400740491462291,0.3595373185334913,0.42418736327599388,0.487152263329444,0.54880648379062014,0.60784834717843672,0.66436101176864226,0.71861875554688093,0.77079647324285772,0.82006633383376182,0.86770675571180034,0.91375264411324386,0.95805746506391265,1.0001640205679325,1.040690523931572,1.0793391905181151,1.1164903092107175,1.1517987874781912,1.1858054071822921,1.2182294136648848,1.2493812780262512,1.2789627971819262,1.3075103198326168,1.3347129656635841,1.360744205693218,1.3856544832335376,1.4094920693965227,1.4323031566338291,1.4541319482484765,1.4750207440519667,1.4950100223328187,1.5141385182953564,1.5324432991207513,1.5499598357957705,1.5667220718484201,1.5827624891236831,1.5981121707268056,1.6128008612561093,1.6268570244420459,1.6403078983041863,1.6531795479330287,1.6654969159989066,1.6772838710858711,1.6885632539442104,1.6993569217512337,1.7096857904660885,1.7195698753606863,1.7290283298052775,1.7380794823838337,1.7467408724111602,1.7550292839205635,1.7629607781879351,1.7705507248552763,1.7778138317139762,1.784764173205555,1.7914152176951041,1.7977798535702707,1.8038704142163631,1.8096987019159729,1.8152760107194275,1.8206131483303887,1.825720457049012,1.8306078338132448,1.8352847493771038,1.8397602666630934,1.8440430583243275,1.8481414235503888]
["Commercial-college-Cool","College Cooling",0,0.1045921186410823,0.20023210142366291,0.28770702632283085,0.3723340094990652,0.45430348800175552,0.53446760002751714,0.61226145633314022,0.68803209732997994,0.76072405111858932,0.83009468284350629,0.89664786115552098,0.96050324543134236,1.0209670091886993,1.079194974948845,1.1355126302861291,1.1895907108440971,1.2409692640822032,1.2904666659357513,1.3374755564920946,1.3826960458214752,1.4258325106387597,1.4673309998886155,1.506945274898315,1.5449971588825049,1.5811729212443906,1.6160356821306303,1.6493164314993105,1.681164038550679,1.7116402175472041,1.7408040251993813,1.7687119751057709,1.7954181472649955,1.8209742928719088,1.8454299346010126,1.8688324625714468,1.8912272261795178,1.9126576219767149,1.9331651777635064,1.9527896330618715,1.9715690161225079,1.98953971761594,2.0067365611503245,2.0231928707526063,2.0389405354437855,2.0540100710334306,2.0684306792531864,2.0822303043438617,2.095435687205752,2.1080724172171306,2.1201649818213206,2.1317368139784403,2.1428103375737702,2.1534070108707364,2.1635473680927135,2.1732510592142229,2.1825368880386335,2.1914228486361558,2.199926160212732,2.2080633004773986,2.2158500375727725,2.2233014606305472,2.2304320090111931,2.237255500284538,2.2437851570054419,2.2500336323364509,2.2560130345670815,2.2617349505772544,2.2672104682903385,2.2724501981593184,2.2774642937277205]
["Commercial-college-ExtLight","College Exterior Lights",0,8.7766368847988468E-2,0.17166391042289933,0.25083040047866895,0.32745062487278415,0.40162192980738148,0.47457746638621034,0.54547140894793888,0.61471282331521193,0.68104129017691761,0.74481499733462497,0.80610174846194138,0.86521818964465835,0.92087358735208447,0.97475823299325959,1.0268140882262027,1.076894037498092,1.1244363295365716,1.1702591746604671,1.2139524422535415,1.2559269705133065,1.2957744035783563,1.3341822010397988,1.3708024711870868,1.4059067941480343,1.4393587116150774,1.471609208110642,1.5022757983590844,1.531621817735584,1.5597041329284069,1.5865771618210602,1.6122929789432163,1.6369014163806865,1.6604501603399882,1.6829848435546308,1.7045491337121836,1.7251848180734783,1.7449318844479227,1.7638285986818409,1.7819115788099924,1.7992158660139652,1.8157749925249438,1.8316210466024352,1.8467847347148671,1.8612954410425533,1.8751812844183293,1.8884691728162013,1.9011848554935908,1.9133529728882219,1.9249971043663376,1.9361398139147741,1.9468026938654308,1.9570064067368727,1.9667707252741373,1.9761145707643428,1.9850560497023388,1.9936124888774545,2.0018004689493356,2.0096358565779298,2.017133835169886,2.0243089343009446,2.0311750578713355,2.037745511048743,2.0440330260510469,2.0500497868188021,2.0558074526252659,2.0613171806697292,2.0665896476979237,2.0716350706914115,2.076463226666041,2.081083471617839]
["Commercial-college-Heat","College Heating",0,8.2967465414288372E-2,0.161306409544058,0.23409266562546738,0.30442009770658757,0.37263933291813595,0.43998971195826636,0.50556476031465092,0.56978957452040557,0.63118479449524223,0.69015393086821386,0.74673291546088394,0.80123802682883327,0.8526562515172128,0.90247194345550064,0.95052347556031147,0.99681271749481692,1.0407994889572489,1.0830904135964186,1.1235100199996351,1.1623371988663587,1.19919215544362,1.2346980306759914,1.2685321456683887,1.3010266978302361,1.3318951697085815,1.3616739973463137,1.3900415538166704,1.4171875408696433,1.4431645619729665,1.468022955373276,1.4918108916415147,1.5145744670178196,1.5363577927367718,1.5572030805061039,1.5771507243045078,1.5962393786570477,1.6145060335398607,1.6319860860592992,1.6487134090444076,1.66472041668566,1.6800381273471452,1.6946962236739254,1.7087231101110356,1.7221459679455908,1.734990807978658,1.7472825209289615,1.7590449256660941,1.7703008153666995,1.7810720016830683,1.7913793570097369,1.8012428549299941,1.8106816089206708,1.8197139093902177,1.8283572591218418,1.8366284071903813,1.8445433814186492,1.8521175194361301,1.8593654984002268,1.8663013634376397,1.8729385548610018,1.879289934213501,1.8853678091919694,1.8911839574967237,1.8967496496543834,1.9020756708578854,1.9071723418660214,1.9120495390029935,1.9167167132967469,1.9211829087931613,1.9254567800815963]
["Commercial-college-HotWater","College Hot Water",0,8.3103195918586281E-2,0.16065326584943293,0.23218077467566831,0.30127860242472709,0.3683617291852147,0.4345135316061039,0.49893714132011802,0.56198027374192316,0.62232806470204205,0.68010152076103925,0.73555284447808944,0.78886757998765267,0.83924434001892156,0.8879354536790397,0.93497658228910374,0.98023238688736503,1.0232630696234728,1.0646398353415734,1.1041481083166693,1.1421047006636602,1.1781865175674604,1.2129286262010492,1.2460539914432074,1.2778833960061633,1.3081090206091641,1.3372663100784301,1.3650617926001976,1.3916603404679175,1.417113496322195,1.4414705832640873,1.4647788004333622,1.4870833144709459,1.5084273470427962,1.5288522585948063,1.5483976285010357,1.5671013317605855,1.5849996123917338,1.6021271536655599,1.6185171453151543,1.6342013478506512,1.6492101541047151,1.6635726481277429,1.6773166615469082,1.6904688274982627,1.7030546322364009,1.7150984645217007,1.7266236628808391,1.7376525608321678,1.7482065301635827,1.758306022346755,1.7679706081679725,1.777219015652391,1.786069166355184,1.7945382100899141,1.8026425581614263,1.8103979151676579,1.8178193094319945,1.8249211221251393,1.8317171151329337,1.8382204577241243,1.8444437520697614,1.8503990576636724,1.8560979146913386,1.8615513663924541,1.8667699804605076,1.8717638695208458,1.876542710726911,1.8811157645126195,1.8854918925372208,1.8896795748574136]
["C-Unv-Lgt-LPD Int-All-All-C","College Interior Lights",0,8.351509319724687E-2,0.16144304063147344,0.23334448471254574,0.30286831464481423,0.37037295452844077,0.43692968962581041,0.50172154445520334,0.56514746404801663,0.62586670047798609,0.68399384883564418,0.73978419595971834,0.79343526457380253,0.84412461539803041,0.89313769193438608,0.94047869064404221,0.98603542958440449,1.0293409246885665,1.0710087852000811,1.1107587422282903,1.1489645670379041,1.1852704572526291,1.220232859702731,1.2535668097572634,1.285594353820503,1.3160060573759595,1.3453508641790917,1.373314967487778,1.4000748749602052,1.4256824419194656,1.4501872906843081,1.4736369067272195,1.496076730691728,1.5175502464472388,1.5380990653520337,1.5577630068877224,1.5765801758213962,1.5945870360450072,1.6118184812350655,1.6283079024695712,1.6440872529332131,1.6591871098362196,1.6736367336668478,1.6874641248923294,1.7006960782181491,1.7133582345107994,1.7254751304846274,1.7370702462490564,1.7481660508083186,1.7587840456018708,1.7689448061698636,1.7786680220244018,1.7879725348038644,1.7968763747842114,1.8053967958180361,1.8135503087690645,1.821352713506891,1.8288191295239495,1.8359640252340537,1.8428012460092726,1.8493440410094826,1.8556050888565732,1.8615965222030713,1.8673299512427826,1.8728164862090135,1.8780667589039712,1.8830909433010599,1.8878987752599965,1.89249957139295,1.8969022471182646,1.9011153339367475]
["Commercial-college-Misc","College Other",0,8.0600953087506394E-2,0.15602139811956539,0.22580028302146934,0.29329925152044378,0.35885975706212736,0.42355399453592257,0.48655655463673292,0.54825261914191803,0.60733410006495336,0.66389573062492924,0.71822547362369471,0.7704763565695365,0.81980378346321381,0.86749938063161869,0.91361025941681362,0.95797449003177804,1.0001414048525887,1.0407256683266244,1.0794392010859026,1.1166300604580026,1.1519858972987143,1.1860355446228175,1.2185031376999351,1.2496903231320164,1.2793063342385071,1.3078883292155148,1.3351179924300891,1.3611750864153276,1.38611010458302,1.4099713659875104,1.4328051089583143,1.4546555807007107,1.4755651230379319,1.4955742544611099,1.5147217486459696,1.5330447095884188,1.5505786435046383,1.5673575276349918,1.5834138760850911,1.5987788028315972,1.613482082014857,1.6275522056352012,1.6410164387647173,1.653900872381479,1.6662304739286193,1.6780291356962178,1.689319721119757,1.7001241090848664,1.7104632363242052,1.7203571379886444,1.7298249864713615,1.7388851285600859,1.7475551209894873,1.7558517644625986,1.7637911362072027,1.771388621130269,1.7786589416308107,1.7856161861289368,1.7922738363663782,1.7986447935313936,1.804741403258681,1.8105754795527362,1.8161583276810187,1.821500766081289,1.8266131473255667,1.8315053781813349,1.8361869388088643,1.840666901131859,1.8449539464170213,1.8490563820966022]
["Commercial-college-Motors","College Motors",0,8.339655594047056E-2,0.16140714604152262,0.2335651377815707,0.30329645858656262,0.3710108558994466,0.43776378484977818,0.50273711816266919,0.56631570070144777,0.62719290409826078,0.68544396786715933,0.74137960317510831,0.79513949580989252,0.84595018788170595,0.89504524751278391,0.94248840997955241,0.9881208684934083,1.0315272333999406,1.0732720832812328,1.1131157451083828,1.1513882838195859,1.1877793488495454,1.2228169106503712,1.2562301188398863,1.2883281166550717,1.3188071831478647,1.3482128334672467,1.3762403115289124,1.4030608646979708,1.4287264658166867,1.4532868496623479,1.4767896093232675,1.4992802884246264,1.5208024693828643,1.541397857859647,1.5611063635790565,1.5799661776646157,1.5980138466460119,1.6152843432789272,1.6318111343152095,1.6476262453547144,1.6627603229044798,1.6772426937654992,1.6911014218621685,1.7043633626245314,1.7170542150287067,1.7291985713963383,1.7408199650495744,1.7519409159139152,1.7625829741573036,1.7727667619500196,1.7825120134263028,1.7918376129251383,1.8007616315843114,1.8093013623586394,1.8174733535302454,1.8252934407758012,1.8327767778528881,1.839937865964933,1.8467905818616268,1.8533482047292764,1.8596234419231992,1.8656284535920251,1.8713748762416191,1.8768738452842928,1.8821360166169949,1.8871715872702983,1.8919903151681963,1.8966015380369985,1.9010141914999668,1.9052368263927597]
["Commercial-college-OffEquip","College Office Eqpmt",0,7.7819249591829232E-2,0.15047495503036062,0.21749954024550977,0.28234133447310183,0.34535975563152721,0.40760808674516757,0.46827663997242397,0.52773004497584164,0.5846656752398901,0.63916971532317102,0.69150975837368167,0.74185436460505705,0.78936789247089756,0.83532909406415812,0.87976696748984451,0.92253247044223718,0.96317260897012036,1.0022910123449467,1.0396063549095298,1.0754709544880092,1.1095481056278989,1.1423761738665787,1.1736732493319426,1.2037428581310403,1.2322928758664982,1.2598508678339082,1.286104841532381,1.3112282613395323,1.3352698113942225,1.3582760793891415,1.3802916468483939,1.401359175517535,1.4215194900334593,1.4408116570343441,1.4592730608629421,1.4769394760099255,1.493845136437661,1.5100228019187474,1.5255038215178733,1.5403181943400035,1.5544946276626159,1.5680605925646374,1.5810423771598732,1.5934651375380893,1.6053529465124587,1.6167288402678361,1.6276148630002549,1.6380321096341486,1.6480007667000753,1.6575401514521584,1.6666687493010417,1.6754042496349013,1.6837635800979247,1.6917629393926843,1.6994178286699659,1.7067430815668863,1.7137528929514989,1.7204608464295972,1.7268799406670117,1.7330226145784133,1.7389007714314293,1.7445258019127843,1.7499086062011624,1.7550596150895621,1.759988810198079,1.7647057433162765,1.7692195549126382,1.7735389918469553,1.777672424319986,1.7816278620932213]
["Commercial-college-Process","College Process",0,8.6963094793009815E-2,0.16820532495808291,0.24318822413301569,0.31564994564341547,0.38596825685990294,0.45525579229018648,0.52265954324087582,0.58861442115733731,0.65172404107390824,0.71214643297755842,0.77009647668023407,0.82583249930673841,0.87853903503851127,0.92951420315791455,0.97867537510779368,1.0259952805711772,1.0709935398031776,1.1142806569794337,1.1555983538804282,1.1953239966730433,1.23303825594654,1.2693488890914173,1.3039650110028316,1.3372310069735036,1.3688212780487456,1.3992981156711348,1.4283358165100764,1.456123090040164,1.4827137824134535,1.5081594210481803,1.5325093144785409,1.5558106479047231,1.5781085746283428,1.5994463035504667,1.6198651829017814,1.6394047803671543,1.6581029597598556,1.6759959543940197,1.6931184372975261,1.7095035884013599,1.7251831588356505,1.7401875324569815,1.7545457847261976,1.7682857390508062,1.7814340207011494,1.7940161084048269,1.8060563837193513,1.8175781782787044,1.8286038190053584,1.8391546713753619,1.8492511808203416,1.8589129123466379,1.8681585884483569,1.877006125387801,1.8854726679135845,1.8935746224837124,1.9013276890579975,1.9087468915214283,1.9158466067974387,1.9226405927074961,1.9291420146309963,1.935363471017121,1.9413170177981014,1.9470141917511925,1.9524660328546291,1.9576831056808841,1.9626755198686883,1.967452949713477,1.9720246529142313,1.9763994885130394]
["Commercial-college-Refrig","College Refrigeration",0,7.3118812360397883E-2,0.14155536503976232,0.2048598852340491,0.26620726121814825,0.32584058106371,0.38482328733499327,0.44236448195169348,0.49879670034890794,0.55287714009192812,0.60470726746208003,0.65452284424792895,0.70250782556771918,0.74768181472251394,0.79141624579236125,0.83376559515774784,0.87452299248551002,0.91319981958221075,0.95048587893209258,0.98600841191652655,1.0201659697483911,1.0526036632065672,1.0838823353132585,1.113697086960413,1.142328084975835,1.1695354077057589,1.1958058441725301,1.2208072105243917,1.2447319630142117,1.2676264630044698,1.289535075435339,1.3105002547950224,1.3305626273880207,1.3497610700607465,1.3681327855370391,1.3857133745095678,1.4025369046268201,1.4186359765093584,1.4340417869232704,1.4487841892332343,1.4628917512523383,1.4763918106007632,1.4893105276805958,1.5016729363694308,1.5135029925309953,1.5248236204367986,1.5356567571887636,1.5460233952289215,1.5559436230185462,1.5654366639655555,1.5745209136756122,1.5832139755991115,1.5915326951431299,1.5994931923144395,1.607110892956841,1.6144005586433496,1.6213763152811569,1.6280516804848002,1.6344395897705832,1.6405524216230072,1.646402021481786,1.6519997246959286,1.6573563784893663,1.6624823629806944,1.6673876112977548,1.6720816288260423,1.6765735116282312,1.6808719640705172,1.6849853156899297,1.6889215373353006,1.6926882566131674]
["Commercial-college-Vent","College Ventilation",0,8.2833815210707401E-2,0.15988291191079351,0.23085769597063649,0.29952357864945695,0.3661927997002799,0.43191442971048005,0.49590491471035592,0.55853626693420777,0.61852319335340811,0.67594296408466203,0.73106872470936679,0.78408361283343886,0.83413904033919151,0.88252830917370317,0.9293075392538499,0.9743122156992754,1.0170708970796822,1.0582349884267259,1.0974666739657164,1.1351858818011664,1.1710447944678315,1.2055838245491211,1.2385170105881647,1.2701558112594737,1.3002058282840141,1.3292023632013121,1.3568357610509494,1.3832792039692625,1.4085839340346338,1.4327989867287694,1.4559712859576071,1.4781457349804181,1.4993653034232994,1.5196711105456742,1.5391025049211524,1.55769714068716,1.5754910505110911,1.5925187154143741,1.6088131315897647,1.6244058743413348,1.6393271592710668,1.6536059008306188,1.6672697683517215,1.6803452396637812,1.6928576524025944,1.7048312531095926,1.7162892442167681,1.7272538290083237,1.7377462546461757,1.7477868533426848,1.7573950817603969,1.7665895587151452,1.7753881012555746,1.7838077591889996,1.7918648481205066,1.7995749810693176,1.8069530987236817,1.8140134983929299,1.8207698617127848,1.8272352811576218,1.8334222854110542,1.8393428636440041,1.8450084887473055,1.8504301395638616,1.855618322163437,1.8605830902013083,1.8653340644002279,1.8698804511934526,1.8742310605649595,1.8783943231214255]
["Commercial-Grocery-AirComp","Grocery Compressed Air",0,7.8356246507730806E-2,0.15123654980378798,0.2183035271207468,0.28323171084237747,0.34632667553510671,0.40863513796390188,0.46936766716128864,0.52888443860589107,0.58588587342550025,0.64045872490068811,0.69286426025220993,0.74328510066867604,0.79085548422921825,0.83687217684364912,0.88137799806916717,0.92421047314354576,0.96488756369904527,1.004060989061492,1.0413957763468258,1.0772956904026634,1.1114102147544638,1.1442798588226644,1.1756146776795058,1.2057220231169876,1.234308535301462,1.2619044710224245,1.2881952125193652,1.3133538168226577,1.3374290362516459,1.3604675237435002,1.3825139232572368,1.4036109562847356,1.4237995046364091,1.4431186896619344,1.4616059480595658,1.4792971044209358,1.4962264406519119,1.5124267624040422,1.5279294626453153,1.5427645824934231,1.5569608694294117,1.5705458330045206,1.5835457981481651,1.5959859561803609,1.6078904136274381,1.6192822389356463,1.6301835071731658,1.6406153428071557,1.6505979606387253,1.6601507049751554,1.6692920871152797,1.678039821220662,1.6864108586420805,1.6944214207678399,1.7020870304575617,1.7094225421223674,1.716442170509741,1.7231595182488548,1.729587602209729,1.735738878727312,1.7416252677393533,1.7472581758848473,1.7526485186078082,1.757806741309206,1.7627428395880556,1.767466378610878,1.7719865116470719,1.7763119978061093,1.7804512190109294,1.7844121962404225]
["Commercial-Grocery-Cook","Grocery Cooking",0,7.5018550980611512E-2,0.14481809562869571,0.20903157936199412,0.27123155197450372,0.33171150205770455,0.3915167181920875,0.44985032768989608,0.50706622220547792,0.56187281524604493,0.6143499387862168,0.66475976093021627,0.71327707337183788,0.75901934484035127,0.80328611371797176,0.84612139117769691,0.88735148196162239,0.92649635510724948,0.96420674566688513,1.0001410583759081,1.0347017901599778,1.067530943855971,1.0991715319149964,1.1293311546820064,1.1583091678393538,1.1858216839503162,1.2123901699737358,1.2376922549895075,1.2619047765357005,1.2850746536133972,1.3072467847882265,1.3284641351947619,1.3487678197943174,1.3681971830474806,1.3867898751557706,1.4045819250201628,1.4216078100578586,1.4379005230125919,1.4534916358879344,1.4684113611274967,1.4826886101605705,1.4963510494266701,1.509425153987531,1.5219362588304599,1.5339086079624493,1.5453654013901903,1.5563288400770239,1.5668201689639458,1.5768597181380342,1.5864669422280706,1.5956604581037035,1.604458080951199,1.6128768587956928,1.6209331055368348,1.6286424325618511,1.6360197789972735,1.6430794406579647,1.6498350977495353,1.6562998413778325,1.6624861989168729,1.6684061582843757,1.6740711911719381,1.6794922752748687,1.6846799155647543,1.6896441646459845,1.6943946422356786,1.6989405538047637,1.7032907084163287,1.7074535357958167,1.7114371026661399,1.715249128379368]
["Commercial-Grocery-Cool","Grocery Cooling",0,0.1054416948522329,0.2016865638567279,0.28970668530330979,0.37489124719531813,0.45737614309981373,0.53798233520125649,0.61620051000160425,0.69232626789350704,0.76540513438389102,0.83513067624947923,0.90204809485269632,0.96625737907343867,1.0270366202555483,1.0855239788739037,1.1421543085947701,1.1964940323251347,1.2481062351947583,1.2978512161476765,1.3450575418262962,1.3904865013214034,1.433828439691389,1.4755441788979615,1.5153708643960933,1.5536154409236296,1.5899958419717859,1.6250479603761421,1.6585102170489334,1.6905315153004086,1.7211739059716766,1.7504967678580574,1.7785569227732545,1.8054087456586105,1.8311042699508171,1.855693288412259,1.8792234496193805,1.9017403502960517,1.9232876236708567,1.9439070240295218,1.9636385076263301,1.9825203101113145,2.000589020623261,2.0178796526921094,2.0344257120881366,2.0502592617494066,2.0654109839133015,2.0799102395725306,2.0937851253708368,2.1070625280486412,2.1197681765441478,2.1319266918508526,2.1435616347280826,2.1546955513570105,2.1653500170306255,2.1755456779623148,2.1853022912940752,2.1946387633818838,2.2035731864324184,2.2121228735621163,2.2203043923465167,2.2281335969248901,2.2356256587223768,2.242795095849158,2.2496558012336374,2.2562210695441447,2.262503622951328,2.2685156357811689,2.2742687581063756,2.2797741383218844,2.2850424447482087,2.2900838863044997]
["Commercial-Grocery-ExtLight","Grocery Exterior Lights",0,8.7800081696288931E-2,0.17150387737234934,0.25032537277969236,0.32659645982115021,0.4004424819040891,0.47306820342423028,0.54365046163250164,0.61257874283569569,0.67861544314909739,0.74207267817623612,0.80304885299962003,0.86184181901775048,0.91721042712382705,0.97079807005087027,1.0225752444440279,1.0723806896876837,1.1196684398490915,1.1652410980828802,1.2086940687576433,1.2504361989459549,1.2900762434435551,1.3282806984372197,1.364710580713177,1.3996369812727814,1.4329142508056147,1.4649941215087601,1.4955084358227149,1.524708736601619,1.5526516081603789,1.5793911981687616,1.6049793225786975,1.6294655660331812,1.6528973779513476,1.6753201644759088,1.6967773764611349,1.7173105936718775,1.7369596053567988,1.7557624873519386,1.773755675864034,1.7909740380765657,1.8074509397153522,1.8232183097046213,1.8383067020388499,1.8527453549902653,1.866562247766739,1.8797841547298719,1.8924366972783244,1.9045443934969393,1.9161307056678627,1.9272180857357317,1.9378280188150323,1.9479810648239324,1.9576968983252721,1.9669943466519131,1.9758914263903253,1.9844053782931126,1.9925527006881241,2.0003491814489007,2.0078099285883999,2.014949399535289,2.0217814291495366,2.0283192565315926,2.0345755506771002,2.0405624350268683,2.0462915109596604,2.0517738802733376,2.0570201666979089,2.0620405364821872,2.0668447180939373,2.0714420210716886]
["Commercial-Grocery-Heat","Grocery Heating",0,8.2772465228289183E-2,0.16336324857514728,0.2394514440062058,0.31302395294354024,0.38418978897592554,0.45474966005522588,0.52345608118996612,0.59099467816025297,0.65523072016196948,0.71761201168474453,0.77732058300884077,0.83520250724773049,0.88950180368068843,0.94253954664536943,0.99344176191695754,1.0427183517158989,1.0894064615212422,1.1342640402606794,1.1772905342937539,1.2185363924899468,1.2575639857258558,1.2952109285747411,1.3310103830200946,1.3653772204385439,1.3980171356847917,1.4295036367132343,1.4594597677330647,1.4881259218190268,1.5155576482170767,1.5418081041003777,1.5669281575772211,1.5909664862631954,1.6139696716086256,1.635982289164061,1.6570469949587361,1.6772046081593821,1.6964941901695698,1.7149531203228594,1.732617168316438,1.7495205635256041,1.7656960613334185,1.7811750066040544,1.7959873944228446,1.81016192822073,1.8237260753957401,1.8367061205392901,1.8491272163704386,1.8610134324768008,1.8723878019565734,1.8832723660520494,1.8936882168611173,1.9036555382095077,1.9131936447629914,1.9223210194553204,1.9310553493044391,1.9394135596863709,1.9474118471331956,1.9550657107186733,1.9623899820923367,1.9693988542202441,1.9761059088880977,1.9825241430200153,1.9886659938639555,1.9945433630926064,2.0001676398664352,2.0055497229035919,2.0107000415994354,2.0156285762366064,2.0203448773248085,2.0248580841077768]
["Commercial-Grocery-HotWater","Grocery Hot Water",0,7.758701104941633E-2,0.15000635839501814,0.21677794199846961,0.28135887542798088,0.34410789321032365,0.40610294798624441,0.46654868756319057,0.52577361980925996,0.58248492184141376,0.63679281352937045,0.68894332153278304,0.73912153629259836,0.7864638574860765,0.83226275014120665,0.87654587655166738,0.91916176512330916,0.95964618164458404,0.99861464658081345,1.0357991379912384,1.0715370671918754,1.1054910560328228,1.1382023095264169,1.1693858326881614,1.199348835650774,1.2278020748777323,1.2552622028066232,1.28142477109911,1.3064607216182365,1.3304185690049604,1.3533447387530215,1.3752836571722187,1.3962778374776705,1.4163679621718828,1.4355929618792629,1.4539900907858467,1.4715949988304247,1.4884418007869586,1.5045631423721586,1.5199902635063212,1.5347530588500173,1.5488801357339372,1.5623988695941478,1.5753354570201863,1.587714966518788,1.5995613870916126,1.6108976747211097,1.6217457968545999,1.6321267749727721,1.6420607253250901,1.6515668979110403,1.6606637137827631,1.6693688007413492,1.6776990274959773,1.6856705363520808,1.6932987744918926,1.7005985239079806,1.7075839300477778,1.7142685292246171,1.7206652748483868,1.7267865625266352,1.7326442540847677,1.7382497005518802,1.7436137641567726,1.7487468393767653,1.7536588730801075,1.7583593838010092,1.7628574801846471,1.7671618786378891,1.7712809202199389,1.7752225868056326]
["C-Gro-Lgt-LPD Int-All-All-C","Grocery Interior Lights",0,7.602513040330558E-2,0.14692958612856277,0.21232356224366442,0.27565919330252009,0.33721362894857992,0.39804222665412781,0.45735536905637236,0.51550047294913071,0.57120183235440902,0.62455728259139209,0.67581164633861013,0.72515131099121011,0.77165580216400231,0.81665923071956192,0.86020650277558219,0.90211815637432691,0.94190621278684616,0.9802412413242525,1.0167708067701655,1.0518968654422491,1.0852660317312601,1.1174291641936036,1.1480885275175039,1.1775398329440836,1.2055136916645066,1.2325205620926623,1.2582384713677575,1.2828489108654562,1.3063995706718665,1.3289360872330247,1.350502131789157,1.3711394950007667,1.3908881679305372,1.4097864195379726,1.4278708708369541,1.445176565859903,1.4617370395660738,1.4775843828255677,1.4927493046049878,1.5072611914752461,1.5211481645568328,1.5344371340128968,1.5471538511957335,1.55932295854773,1.5709680373534682,1.5821116534355144,1.5927754008824486,1.6029799438938688,1.6127450568234578,1.6220896624977055,1.6310318688845453,1.6395890041829566,1.647777650401532,1.6556136754910777,1.6631122640935141,1.6702879469666589,1.677154629141917,1.6837256168694368,1.6900136434029485,1.6960308936742514,1.7017890279051635,1.7072992042026871,1.7125721001811784,1.717617933653419,1.7224464824306827,1.7270671032701694,1.7314887500065204,1.73571999090255,1.7397690252528175,1.7436436992722122]
["Commercial-Grocery-Misc","Grocery Other",0,7.5063836012825708E-2,0.14501004113572505,0.20945241788993024,0.27187449157257987,0.33255926054218887,0.39255741304204705,0.45107481308212083,0.50846082166388296,0.5634347685072657,0.61608540650916099,0.66666530020080039,0.71535440646740056,0.76124609618815742,0.80565951704576078,0.84863973272424176,0.8900079704859305,0.92928062820501989,0.96711873609692856,1.0031739532728907,1.0378481133649258,1.0707843931915293,1.1025309285674565,1.1327919755784122,1.1618632826811062,1.1894711982954647,1.2161293128465414,1.2415139563024831,1.2658054811407049,1.2890509594547928,1.3112954363103793,1.3325820170334286,1.3529519507396959,1.3724447102672244,1.3910980686667731,1.4089481723983988,1.4260296113760309,1.4423754859957747,1.458017471277826,1.4729858782462961,1.487309712665885,1.5010167312492237,1.5141334954438059,1.5266854229027367,1.5386968367390337,1.5501910126589351,1.5611902240655393,1.5717157852201848,1.5817880925452041,1.5914266641480936,1.6006501776436814,1.6094765063475935,1.6179227539111456,1.6260052874647839,1.6337397693342943,1.641141187391242,1.6482238840964551,1.6550015842928314,1.6614874218013254,1.6676939648716544,1.6736332405370411,1.6793167579201862,1.6847555305356363,1.6899600976317606,1.6949405446136978,1.6997065225868435,1.7042672670587531,1.7086316158357004,1.7128080261485685,1.7168045910412653,1.7206290550534151]
["Commercial-Grocery-Motors","Grocery Motors",0,7.7636355178482844E-2,0.14993289878699517,0.21653231411195381,0.2810167791045301,0.34367967359258289,0.40557181852753021,0.46590464502400619,0.52503285517843623,0.58166778094129501,0.63590277243360682,0.68798983025862126,0.73811536248429388,0.78538852865697217,0.83112377185857267,0.87536490956558644,0.91794316624053862,0.95837284241702458,0.99731536257856346,1.0344271947192143,1.0701127459200339,1.1040195238121908,1.1366938872006416,1.1678419430753388,1.1977663892653394,1.226184408779146,1.2536177774536275,1.2797491414303275,1.304755231360184,1.3286845040203339,1.3515833295324389,1.3734960812186641,1.3944652215882574,1.414531384621361,1.4337334545094984,1.4521086410053237,1.4696925515276444,1.4865192601614443,1.5026213736866116,1.5180300947633267,1.532775282396547,1.5468855097967578,1.5603881197491125,1.5733092775982558,1.5856740219515031,1.5975063131986296,1.6088290799422913,1.619664263429049,1.6300328600670946,1.6399549621130711,1.6494497966068289,1.6585357626295634,1.6672304669575391,1.6755507581804823,1.6835127593507628,1.6911318992266293,1.6984229421700423,1.7054000167570404,1.7120766431560817,1.7184657593274129,1.7245797460942371,1.7304304511342603,1.7360292119381102,1.7413868777791148,1.7465138307370141,1.7514200058163434,1.7561149101984768,1.7606076416646332,1.7649069062255485,1.7690210349919744,1.7729580003186978]
["Commercial-Grocery-OffEquip","Grocery Office Eqpmt",0,7.7619759474012368E-2,0.14978708857738302,0.21616606550902445,0.28043527934611362,0.34289985349167412,0.40460476973022519,0.46475945273496011,0.52372349077999969,0.58019538972589813,0.63426239283736707,0.68618234498100017,0.73613788769805477,0.78326260799055192,0.82885267840536425,0.87294997861090762,0.91539242028907764,0.95569615462559265,0.99451198817075659,1.0315041894241757,1.0670759548222168,1.1008769430356686,1.1334468351008899,1.1644947073138834,1.194327609374749,1.2226509633970777,1.2499950046150647,1.2760452855117175,1.3009737839774138,1.3248288064326257,1.347656579117039,1.3695013376667167,1.3904054128338725,1.4104093125153612,1.429551800248843,1.4478699703287301,1.4653993196874739,1.4821738166814868,1.4982259669149922,1.5135868762293514,1.5282863109799345,1.5423527557173342,1.5558134683847027,1.5686945331381654,1.5810209108926749,1.5928164876912487,1.6041041209913194,1.6149056839578941,1.6252421078493533,1.6351334225780223,1.644598795524117,1.6536565686782747,1.6623242941846457,1.6706187683534217,1.6785560642087098,1.6861515626348229,1.6934199821813425,1.7003754075847106,1.7070313170616178,1.7134006084270794,1.7194956240878079,1.7253281749593186,1.7309095633531089,1.7362506048782667,1.7413616493999491,1.7462526010953388,1.7509329376459508,1.7554117286034745,1.7596976529647412,1.7637990159898769,1.7677237652962268]
["Commercial-Grocery-Process","Grocery Process",0,8.1464801738335729E-2,0.15720738157563441,0.22691957247154193,0.29437876116000511,0.35990116294665053,0.42453440249523927,0.48749512279707941,0.54915159778388756,0.60819232727289929,0.66471392999130663,0.71897382243456665,0.77116361455508653,0.82043303631749565,0.86807706161069487,0.91413549296612351,0.95845900451151456,1.0005611783562556,1.0410951057551103,1.0797318612660696,1.1168765942347818,1.1521861810925322,1.1861985651156453,1.2186257069440303,1.2497827906783221,1.2793667410895344,1.3079173199484444,1.335127034533627,1.3611650389213616,1.3860817895316337,1.4099255700199327,1.4327425848412711,1.4545770487851359,1.4754712726548627,1.4954657452574722,1.5145992118628402,1.532908749284245,1.5504298377257808,1.5671964295358629,1.583241015000056,1.5985946853007196,1.6132871927654691,1.6273470085212105,1.6408013776654604,1.6536763720618721,1.6659969408622659,1.6777869588530734,1.6890692727198746,1.6998657453196846,1.7101972980467757,1.7200839513741353,1.7295448636491206,1.7385983682184845,1.7472620089547179,1.7555525742525491,1.7634861295614785,1.7710780485173916,1.7783430427335765,1.785295190308873,1.7919479631081998,1.7983142528683214,1.8044063961794421,1.8102361983910411,1.8158149564882651,1.8211534809832162,1.8262621168635522,1.8311507636389934,1.8358288945245831,1.8403055747978747,1.8445894793656177,1.848688909573984]
["Commercial-Grocery-Refrig","Grocery Refrigeration",0,7.3500314146851306E-2,0.14209380661193452,0.2054493214797152,0.26686403216074805,0.32656439472139082,0.38558179844129792,0.44315469649533612,0.49960005500907784,0.55371540655839824,0.6055519066439905,0.65537741913266212,0.70336195135255308,0.74853861422940937,0.7922565419901898,0.83460891759022149,0.87535736265816833,0.91401967785309435,0.95130489875944835,0.98680352273218608,1.0209473118910068,1.0533798751934744,1.0846551561947619,1.1144700480440344,1.1431008119227977,1.170311701642561,1.196584708664681,1.2215902747814253,1.2455190461850085,1.2684173920257578,1.2903296846963312,1.3112983858164973,1.3313641285152209,1.3505657961695017,1.3689405977525455,1.3865241399372763,1.4033504960949137,1.419452272322318,1.4348606706260538,1.4496055493856099,1.4637154812129363,1.4772178083204257,1.4901386955046259,1.5025031808483582,1.5143352242394896,1.525657753800381,1.5364927103179804,1.5468610897606592,1.5567829839641796,1.5662776195656345,1.5753633952608068,1.5840579174571436,1.5923780343914375,1.6003398687783215,1.6079588490528514,1.6152497392677128,1.6222266677029868,1.628903154243919,1.6352921365797393,1.6414059952743041,1.6472565777571413,1.6528552212813874,1.6582127748931061,1.6633396204545594,1.6682456927621703,1.6729404987981615,1.6774331361531771,1.6817323106555844,1.6858463532416199,1.6897832360990703,1.6935505881157693]
["Commercial-Grocery-Vent","Grocery Ventilation",0,7.5345894560566909E-2,0.14564948497514657,0.21054808334224279,0.27342251114712635,0.3345277151054229,0.39491149033436546,0.45379406718868914,0.51151225093049268,0.56682303284765856,0.6198049353104621,0.67071441803385001,0.71973040756014117,0.76591157413344657,0.81059762979763306,0.85385844446323145,0.89548575564460997,0.93499731662706798,0.97307885108780834,1.0093535982776236,1.0442394313135868,1.0773787744918166,1.1093265454937336,1.1397818093752741,1.1690322334803078,1.1968239177894566,1.2236552521930419,1.2491998940254478,1.2736445273578938,1.297036520977459,1.3194212038669952,1.3408419530435849,1.3613402776144841,1.3809558992134305,1.3997268289731881,1.4176894411834826,1.4348785437770655,1.4513274457804943,1.4670680218603305,1.4821307740898388,1.4965448910558756,1.5103383044205039,1.5235377430469423,1.5361687847947305,1.54825590608448,1.5598225293282593,1.5708910683175219,1.5814829716565293,1.5916187643254356,1.6013180874535757,1.6105997363800257,1.6194816970751931,1.6279811809940135,1.6361146584282913,1.6438978904228154,1.6513459593170972,1.6584732979719123,1.6652937177372855,1.6718204352161115,1.6780660978752751,1.6840428085539005,1.6897621489162216,1.6952352018945192,1.7004725731656174,1.7054844117025534,1.7102804294412484,1.7148699201002864,1.7192617771902752,1.7234645112476805,1.7274862663265373,1.7313348357799887]
["Commercial-Healthcare-AirComp","Healthcare Compressed Air",0,7.2379447538675742E-2,0.13982075174505168,0.20191776965750971,0.26209894606986883,0.32063660333583777,0.37858011755925602,0.43513023168923454,0.49063257955039347,0.54380633014283308,0.59473990481860439,0.64368068196364803,0.69080635802107315,0.73519636584596715,0.77817505040829849,0.8197841547062138,0.85983947319363807,0.89785489537894847,0.93449204198493352,0.96939780500256056,1.0029718516001773,1.0348535811020432,1.0655919973558381,1.0948884527069171,1.1230342411042644,1.1497599707508932,1.175573909134386,1.200147965120246,1.2236638081689162,1.2461670072585527,1.2677011690668174,1.2883080224718551,1.3080274994144752,1.3268978122782262,1.3449555279373182,1.3622356386158752,1.3787716296958339,1.3945955446048852,1.4097380469101977,1.4242284797382478,1.4380949226359037,1.4513642459829426,1.4640621630614485,1.4762132798829857,1.4878411428701024,1.498968284484568,1.5096162668907553,1.5198057237387816,1.5295564001483759,1.5388871909709545,1.5478161774040438,1.5563606620290098,1.5645372023399819,1.5723616428289504,1.5798491456892074,1.5870142201966302,1.5938707508257433,1.6004320241550378,1.6067107546136929,1.6127191091195829,1.6184687306563199,1.6239707608350156,1.6292358614844853,1.6342742353117288,1.6390956456727273,1.6437094354918649,1.6481245453666373,1.6523495308927356,1.6563925792430689,1.6602615250328616,1.6639638655015627]
["Commercial-Healthcare-Cook","Healthcare Cooking",0,7.7466288076138159E-2,0.14939710253579247,0.21547202181297723,0.27944819743881011,0.34164169011792561,0.40308998014609437,0.46299865252407785,0.52173380568982264,0.5779835630836474,0.63182254968480556,0.68352325519697621,0.73325973939821343,0.78019270025702669,0.82559378203416833,0.86950631829794445,0.91177132905256819,0.95191214185503092,0.99056526949115675,1.0274034233885263,1.0628305749417404,1.096494396911373,1.1289284776806034,1.1598468334296494,1.1895583118413124,1.2177604740159578,1.2449912282798201,1.2709348525947985,1.2957612873459741,1.3195186411748503,1.3422529510589423,1.3640082715221882,1.3848267600037634,1.404748758550725,1.4238128719927938,1.4420560427507541,1.4595136224234435,1.4762194402920459,1.4922058688744406,1.5075038866566361,1.5221431381228523,1.536151991200571,1.5495575922318809,1.5623859185776319,1.5746618289563408,1.5864091116153927,1.5976505304278823,1.6084078690044272,1.6187019729054275,1.6285527900355712,1.6379794092988667,1.6470000975891015,1.6556323351874125,1.6638928496355567,1.6717976481505274,1.6793620486433225,1.6866007094019777,1.6935276574963849,1.7001563159599324,1.7064995298006478,1.7125695908922414,1.7183782617932879,1.7239367985407008,1.7292559724616701,1.7343460910463298,1.7392170179216022,1.7438781919649249,1.7483386455948988,1.7526070222742998,1.7566915932593725,1.7606002736278632]
["Commercial-Healthcare-Cool","Healthcare Cooling",0,9.5451282776705851E-2,0.18278282015952696,0.26270856554168937,0.34011794894678832,0.41515936452194202,0.48867785035155287,0.56011101422665877,0.62975154222358409,0.69661066108003322,0.76042493578322035,0.82170276250784191,0.8805437523156493,0.9361769667059161,0.98976003638334631,1.0416757804225989,1.0915079318921423,1.138824805329365,1.1844497746006708,1.2277533018815363,1.2694388401242525,1.3091669904136449,1.3474254248102921,1.3839408994121478,1.4190067574812351,1.4523580609631326,1.4845124094444604,1.5151826110355766,1.5445320862423864,1.57261770844986,1.5994939019498347,1.6252127474043558,1.6498240827675339,1.6733755998614845,1.6959129367934944,1.7174797663935042,1.738117880843274,1.7578672726612359,1.776766212199955,1.7948513218063851,1.8121576467886147,1.8287187233266333,1.8445666434587089,1.8597321172693073,1.8742445323990664,1.8881320109921376,1.9014214641912488,1.9141386442860922,1.9263081946160856,1.9379536973242133,1.9490977190544789,1.9597618546815276,1.9699667691571721,1.979732237554918,1.9890771833900818,1.9980197152897599,2.0065771620837105,2.0147661063841413,2.022602416719482,2.030101278284401,2.0372772223656637,2.0441441545008434,2.0507153814244599,2.0570036368537581,2.0630211061640913,2.0687794500017307,2.0742898268798546,2.079562914801504,2.0846089319514083,2.0894376564967709,2.0940584455353952]
["Commercial-Healthcare-ExtLight","Healthcare Exterior Lights",0,8.6140131825867688E-2,0.16833595501192902,0.24578079636818839,0.32073664676969282,0.39331970399194394,0.46473597742242961,0.53415977199511722,0.60197551894952595,0.66695168125475024,0.72940031839732211,0.78941619328221624,0.84729620029240049,0.901783557485904,0.95452973591807488,1.0055039906674765,1.0545395153964061,1.1010892300539985,1.1459589762327496,1.1887392228953504,1.229837394704316,1.2688586245073614,1.3064722295599391,1.3423370907874876,1.3767197175060624,1.4094813883312709,1.441067385578517,1.4711057989363323,1.4998506921017056,1.5273577669011058,1.553680326517757,1.5788693787824948,1.6029737350166935,1.6260401046187978,1.6481131855777493,1.6692357510887075,1.6894487324389069,1.708791298324265,1.727300930750445,1.7450134976654499,1.7619633224644977,1.778183250501864,1.7937047127385781,1.8085577866493094,1.8227712545064685,1.8363726591544676,1.8493883573822181,1.86184357099729,1.8737624357007083,1.8851680478570896,1.8960825092507556,1.9065269699145511,1.9165216691143552,1.9260859745687131,1.935238419979582,1.9439967409469205,1.9523779093367184,1.9603981661690606,1.9680730530899624,1.9754174424879545,1.9824455663137843,1.9891710436590759,1.9956069071473932,2.0017656281888452,2.0076591411471725,2.0132988664661462,2.0186957328000923,2.0238601981914282,2.0288022703362474,2.0335315259772222,2.0380571294614089]
["Commercial-Healthcare-Heat","Healthcare Heating",0,7.2098274100547449E-2,0.14063802551931665,0.20462502664642215,0.26658449140176665,0.32676679382031582,0.38639244403475181,0.44456476400905687,0.50166914651588723,0.55630451219726595,0.60883880307518734,0.65931554162059391,0.70802371577349532,0.75382332846789168,0.7982670195396806,0.84121936551179333,0.88261232146464252,0.92188906005664306,0.95972148354075593,0.99584995217083205,1.0305561354308777,1.0634720133490398,1.0952137027194446,1.1254531098904845,1.1544826635301937,1.1820754417205674,1.2087159341149807,1.2340516585877306,1.2582963710018453,1.2814970527378404,1.3036986620545821,1.3249442212093587,1.3452748998263699,1.3647300946751846,1.383347506013763,1.4011632106439817,1.4182117318212244,1.4345261061535142,1.4501379476198202,1.4650775088315962,1.4793737396562623,1.4930543433162298,1.5061458300721795,1.5186735685946195,1.5306618351232704,1.5421338605095389,1.5531118752332409,1.5636171524808027,1.5736700493684215,1.5832900463900665,1.5924957851667603,1.6013051045702948,1.6097350752913806,1.6178020329192138,1.6255216095965661,1.6329087643117359,1.6399778118860611,1.6467424507131665,1.6532157893036981,1.6594103716869817,1.6653382017188321,1.6710107663426124,1.6764390578486223,1.6816335951749475,1.6866044442910484,1.6913612377035849,1.6959131931222802,1.7002691313219886,1.7044374932355852,1.7084263563107973,1.7122434501626749]
["Commercial-Healthcare-HotWater","Healthcare Hot Water",0,7.268568330568638E-2,0.14072714299232245,0.20355456988984058,0.2643567033646973,0.32347043428009059,0.38198533343830177,0.43909672088383117,0.49511828798624458,0.54877371133176123,0.60018792745305027,0.64958434628500694,0.69714567267966754,0.74195528859397275,0.78533730293644821,0.82731530402481968,0.86772352470659608,0.9060910097465561,0.94303947804407717,0.97829577538648993,1.0121806021574531,1.0443590119478547,1.0753757070711758,1.1049379381205506,1.1333400158687799,1.160315047636816,1.1863571944633351,1.2111538610367634,1.2348827285711443,1.2575897788432795,1.2793190135534565,1.3001125395919033,1.3200106506334792,1.3390519052187195,1.3572732014725382,1.3747098486053786,1.3913956353353698,1.4073628953640693,1.4226425700326812,1.4372642682801569,1.4512563240193679,1.4646458510425364,1.4774587955623149,1.4897199864903325,1.5014531835506364,1.5126811233212625,1.5234255632931533,1.5337073240318047,1.5435463295233371,1.5529616457831767,1.561971517802162,1.5705934049016694,1.5788440145662699,1.586739334819476,1.5942946652053192,1.6015246464357913,1.6084432887616018,1.615063999121229,1.6213996071208725,1.6274623898956508,1.6332640959002234,1.6388159676749339,1.6441287636315947,1.6492127789011266,1.6540778652834538,1.6587334503383124,1.6631885556539665,1.6674518143292336,1.671531487702695,1.6754354813615095,1.679171360460854]
["C-Hos-Lgt-LPD Int-All-All-C","Healthcare Interior Lights",0,7.4638896828923759E-2,0.14422754301261384,0.20837302385491946,0.27051454307682171,0.33092660075068769,0.39066099248898906,0.44892542029677912,0.50606635057153526,0.56080879546384355,0.61324564640972978,0.66362325540587797,0.71212409066796378,0.75782667001988901,0.80206116074232991,0.8448739753465494,0.88608136722808284,0.9251973213213015,0.9628885671152404,0.99880149675913332,1.0333384962408301,1.0661434470356366,1.0977663931246815,1.1279092566520028,1.156865110673196,1.1843661993353085,1.2109212159829275,1.2362055425651108,1.2604010703949511,1.2835546855431237,1.3057112550629062,1.3269137139335114,1.3472031482594495,1.3666188748871415,1.3851985175930668,1.4029780799910814,1.4199920153001864,1.4362732931079421,1.4518534632589046,1.4667627169918831,1.4810299454444942,1.4946827956383804,1.5077477240535824,1.5202500478958809,1.5322139941564539,1.5436627465589159,1.5546184904847169,1.5651024559639524,1.5751349588148953,1.58473544001197,1.593922503358453,1.6027139515369055,1.6111268206071951,1.6191774130189553,1.626881329202458,1.6342534977991112,1.641308204590167,1.6480591201796941,1.6545193264854616,1.6607013420890668,1.6666171464944308,1.672278203341669,1.6776954826213228,1.6828794819319963,1.687840246822593,1.6925873902585706,1.6971301112499368,1.7014772126770814,1.7056371183489902,1.7096178893268934,1.7134272395449825]
["Commercial-Healthcare-Misc","Healthcare Other",0,7.2854617329996346E-2,0.14072272084102544,0.20320845875787966,0.26376049291894693,0.3226529558644457,0.38093414822180233,0.43780848370430786,0.49362031382148702,0.54708973572339614,0.59830621964088482,0.64751492066611183,0.69489566759894716,0.73952928885523006,0.78274042566158331,0.82457267144366986,0.86484194512140666,0.90306114324866338,0.9398930116794002,0.9749848418111704,1.008735800350081,1.0407887702200362,1.0716913241713446,1.1011448091682745,1.1294417085287067,1.1563110758917436,1.1822617397774309,1.2069683464360599,1.2306110322337911,1.2532356119445387,1.2748859274572155,1.2956039327325046,1.3154297751012023,1.3344018730616785,1.3525569907272059,1.3699303090674237,1.386555494081986,1.4024647620385051,1.4176889419012026,1.4322575350712481,1.4461987725545453,1.4595396696677485,1.4723060783885169,1.4845227374514531,1.4962133202867989,1.5074004808947854,1.518105897744533,1.5283503157825691,1.5381535866323646,1.5475347070627905,1.5565118558000406,1.5651024287543465,1.5733230727297591,1.5811897176823071,1.5887176075890517,1.5959213299878501,1.6028148442450734,1.6094115086060528,1.6157241060806742,1.6217648692142832,1.6275455037918996,1.6330772115216758,1.6383707117415576,1.6434362621912051,1.6482836788894324,1.6529223551556786,1.6573612798123736,1.6616090546034692,1.6656739108628908,1.6695637254652083,1.6732860360894355]
["Commercial-Healthcare-Motors","Healthcare Motors",0,7.2785814295123624E-2,0.14063290559491137,0.20313334405701358,0.26370168440132513,0.32260838129140329,0.38090428619968381,0.4377922987734898,0.49361704591286026,0.5470998971036326,0.59833224804810548,0.64755930773182657,0.69496099041004089,0.73961187533832173,0.78284125255569093,0.8246913031741161,0.86497725264865244,0.90321177583687473,0.94005987822148018,0.97516742799227718,1.0089336754749767,1.0409994987067035,1.0719147517670227,1.1013803591578926,1.1296874602583702,1.1565686117887621,1.1825307765236974,1.2072463402170779,1.2308975973399301,1.2535303792756736,1.2751885438074855,1.2959140601058703,1.3157470900564778,1.3347260660857672,1.3528877656353262,1.3702673824291629,1.3868985946720687,1.4028136303112129,1.4180433294874277,1.4326172042972025,1.4465634959811975,1.4599092296500922,1.472680266653819,1.4849013546956631,1.496596175788337,1.5077873921449625,1.5184966900938865,1.5287448221024265,1.538551646990981,1.5479361684154354,1.5569165716924251,1.565510259038827,1.5737338832937569,1.5816033801884264,1.589133999226388,1.5963403332340065,1.6032363466384263,1.6098354025278232,1.616150288546385,1.6221932416741951,1.627975971940042,1.6335096851131015,1.6388051044174643,1.6438724913115916,1.6487216653729575,1.6533620233264177,1.6578025572531738,1.6620518720156199,1.6661182019318364,1.6700094267320431,1.673733086827935]
["Commercial-Healthcare-OffEquip","Healthcare Office Eqpmt",0,7.2962406720946504E-2,0.14095642549451254,0.20358152354951783,0.26426672067042828,0.32328500900453389,0.38168584039947501,0.43867390314179605,0.494592969258634,0.54816631846620101,0.59948452689468046,0.64879134259929694,0.69626751410707854,0.74098967269977234,0.78428601415230625,0.82620055628303046,0.86654828053382793,0.90484242452729791,0.94174682349371341,0.97690789085370822,1.0107249170294161,1.0428404048879485,1.0738034620582706,1.1033149700406402,1.1316664825122138,1.1585895030307158,1.1845911903428732,1.2093458637729759,1.2330345464812082,1.2557031423742535,1.2773955786355409,1.2981538908472992,1.3180183044470679,1.3370273126765113,1.3552177511735866,1.372624869352606,1.3892823987105194,1.405222618191776,1.4204764167384332,1.4350733531467177,1.4490417133460327,1.4624085652114061,1.4751998110155913,1.4874402376224667,1.4991535645189984,1.5103624897788375,1.5210887340466259,1.5313530826282418,1.5411754257685439,1.5505747971946704,1.5595694109995761,1.568176696937285,1.5764133341982505,1.5842952837302748,1.5918378191676188,1.5990555564282347,1.60596248203648,1.612571980226188,1.6188968588766266,1.6249493743315915,1.63074125514974,1.6362837248321784,1.6415875235713542,1.6466629290633885,1.6515197764241867,1.6561674772479169,1.6606150378447881,1.6648710766934689,1.6689438411419668,1.6728412233893335,1.6765707757791581]
["Commercial-Healthcare-Process","Healthcare Process",0,7.3699714779774939E-2,0.14241620247613737,0.20574661039327502,0.26710554981946499,0.32676833163172148,0.38578667547616396,0.44336409428329782,0.49984659002135146,0.55395953339890647,0.60579459622610365,0.65559774010363991,0.70354877521097758,0.74872464133659178,0.79245505116399351,0.83478448118237869,0.87552935750936367,0.91420440253978852,0.95147339066012848,0.98698253253798729,1.0211339187228656,1.0535682623292952,1.0848365738251291,1.1146402711724757,1.1432707139319254,1.1704611361496311,1.1967191068806013,1.2217182661893391,1.2456409066761691,1.2685333856109351,1.2904400640174094,1.3114033926360453,1.3314639941849793,1.3506607420786958,1.3690308357568934,1.3866098727695226,1.4034319177576848,1.4195295684640599,1.4349340189007826,1.4496751197971678,1.4637814364444266,1.4772803040494586,1.490197880704992,1.5025591980787079,1.5143882099195844,1.5257078384754472,1.5365400189116796,1.5469057418171652,1.5568250938798307,1.5663172968106109,1.5754007445912621,1.5840930391182011,1.592411024311444,1.6003708187547385,1.6079878469301403,1.6152768691075579,1.6222520099471922,1.6289267858702872,1.6353141312512391,1.6414264234818154,1.6472755069560512,1.6528727160223051,1.6582288969469503,1.6633544289322568,1.6682592442292006,1.6729528473841708,1.6774443336568696,1.6817424066450981,1.6858553951505799,1.6897912693185051,1.69355765608207]
["Commercial-Healthcare-Refrig","Healthcare Refrigeration",0,7.2219513424698706E-2,0.13976408178749442,0.20219598503176453,0.26271117122242499,0.32154759664726479,0.37976366059044692,0.43657206543678972,0.49230118250842125,0.54571081030962476,0.59689819469147132,0.64609779017188551,0.69349403562107503,0.73810358610741955,0.7812976960126381,0.82313088459829331,0.86339415754628557,0.9015957803143243,0.93842945691051938,0.97351539090388095,1.0072580657284542,1.0392984820524567,1.070197743746405,1.099649344422877,1.127932806550598,1.1548086549065137,1.1807617033710449,1.2054594543226593,1.2290936657596108,1.2517101360342056,1.2733526913208992,1.2940632705426154,1.3138820066399517,1.3328473043407518,1.350995914580752,1.3683630057195082,1.3849822316896099,1.4008857972112383,1.4161045201984424,1.4306678914780635,1.4446041319370311,1.4579402472087704,1.4707020800046933,1.4829143601921793,1.4946007527160894,1.5057839034566731,1.5164854831127341,1.5267262291950892,1.5365259862116969,1.5459037441223262,1.5548776751372826,1.5634651689314991,1.5716828663422326,1.579546691615662,1.5870718832648765,1.5942730235990532,1.6011640669810405,1.6077583668681097,1.6140687016882715,1.620107299602302,1.6258858621994603,1.6314155871728175,1.6367071900181356,1.6417709247983441,1.6466166040138546,1.6512536176172139,1.6556909512089455,1.659937203449837,1.6640006027234173,1.6678890230809105,1.6716099994995641]
["Commercial-Healthcare-Vent","Healthcare Ventilation",0,7.2972659632523085E-2,0.14121256823269823,0.20429450064243782,0.26543445290543805,0.32486758350837602,0.38365276548206922,0.44100546796956719,0.49725519249437855,0.55116394300494653,0.6028298898623925,0.65248649685310112,0.70032069752605219,0.74534716435421799,0.7889404595876599,0.83115726147870173,0.87178761859065279,0.91033872180827546,0.94750778138791747,0.9829119361878057,1.0169599607486299,1.049293620073072,1.0804741029847813,1.1101947611856902,1.1387357693252906,1.1658581277663795,1.1920470096115432,1.2169709204337702,1.2408215527995379,1.2636451244414209,1.2854858628547057,1.30638609100139,1.3263863093235757,1.3455252742251891,1.3638400731741014,1.3813661965701898,1.3981376065185995,1.4141868026414797,1.4295448850557189,1.4442416146387231,1.4583054706990144,1.4717637061634079,1.4846424003877079,1.4969665096932581,1.5087599157272775,1.520045471740693,1.530845046873148,1.5411795685309999,1.5510690629404276,1.5605326939542339,1.5695888001875413,1.5782549305543427,1.5865478782737699,1.5944837134119778,1.6020778140227028,1.6093448959468417,1.616299041328793,1.6229537259048226,1.6293218451163345,1.6354157390986421,1.6412472165936738,1.6468275778329382,1.6521676364351054,1.657277740360624,1.6621677919639912,1.6668472671825245,1.6713252338988243,1.6756103695125082,1.6797109777552679,1.6836350047818323,1.6873900545680183]
["Commercial-Lodging-AirComp","Lodging Compressed Air",0,7.9066127871626909E-2,0.15281918587282289,0.22088519381765764,0.28677620659234609,0.35078173913582994,0.41395842709622555,0.4755190183025062,0.53581948489645181,0.59358020237759868,0.64889729138564478,0.70202684708013374,0.75315525515184245,0.80138222324933961,0.84803170774038883,0.89315065007690408,0.93656674964707232,0.97779781384273423,1.0175098224941013,1.0553582915841733,1.0917481550902302,1.1263272576519829,1.1596456203844214,1.1914104162567172,1.2219218301524064,1.2509062686289527,1.2788816440228243,1.3055279693091539,1.3310268451812399,1.3554276833363459,1.3787777676952993,1.4011223460292257,1.4225047176406387,1.442966317268785,1.4625467953818436,1.4812840950115649,1.4992145252792406,1.5163728317554857,1.5327922637901696,1.5485046389429773,1.5635404046394439,1.5779286971719479,1.59169739815999,1.6048731885791689,1.6174816004635511,1.6295470663816198,1.6410929667816856,1.652141675298495,1.6627146021088388,1.6728322354201728,1.6825141811726454,1.6917792010314709,1.7006452487432657,1.7091295049268014,1.7172484103655914,1.7250176978668259,1.73245242274839,1.7395669920130445,1.7463751922663027,1.7528902164320999,1.7591246893180301,1.7650906920796858,1.7707997856315096,1.7762630330495228,1.781491021009344,1.7864938803010388,1.7912813054605554,1.7958625735557867,1.8002465621636634,1.8044417665731152,1.8084563162472314]
["Commercial-Lodging-Cook","Lodging Cooking",0,8.3399116437669368E-2,0.16096230914372994,0.23240919173186286,0.30153736807414361,0.36866005142428754,0.43482114879670924,0.49923972717575421,0.56229152681970818,0.62267321844580237,0.68047080520009584,0.73595942441925055,0.78932328334936708,0.83972004375323561,0.8884369779911262,0.93552742142054079,0.9808350619022933,1.0238806240069613,1.0653185459227184,1.1048124975945779,1.1427833358488464,1.1788837334737421,1.2136521888439935,1.2468037950191144,1.278652076182994,1.3088988644292316,1.3380864405529593,1.3659033630975574,1.3925224277335366,1.4179952168588754,1.442371091619965,1.4656972875635914,1.4880190061699328,1.5093795024439434,1.5298201687348627,1.5493806149462688,1.5680987452921118,1.5860108317474639,1.603151584336318,1.6195542183926375,1.6352505189250006,1.6502709022095585,1.6646444747306668,1.6783990895834018,1.691561400447263,1.7041569132356469,1.716210035521182,1.7277441238326987,1.7387815289154898,1.7493436390425625,1.7594509214608141,1.7691229620524422,1.77837850328845,1.7872354805477877,1.7957110568725128,1.8038216562263165,1.811582995320866,1.8190101140716306,1.8261174047422191,1.832918639833691,1.8394269987728988,1.8456550934515665,1.8516149926656025,1.8573182455020005,1.8627759037186493,1.8679985431604187,1.872996284253021,1.877778811614363,1.8823553928213885,1.8867348963687818,1.8909258088543253]
["Commercial-Lodging-Cool","Lodging Cooling",0,0.10002534643413385,0.19170322495620457,0.27576064636081765,0.35714377332552433,0.43597902303487646,0.51313287647531958,0.58804625832454782,0.66102391925008019,0.7310737051173557,0.79795733565824845,0.8621652516122037,0.92382494636015511,0.98214190941752211,1.0383064212290571,1.0926883853256741,1.1448862892232965,1.1944530123802313,1.2422414600798501,1.2876081102410202,1.3312737102982874,1.3728880551454883,1.4129567897447561,1.4512015200875001,1.4879233966500607,1.5228597280041642,1.5565312357030139,1.5886507789216284,1.6193871839155181,1.648800011660867,1.676946258307134,1.7038804656241358,1.7296548266930369,1.7543192870460524,1.7779216414508521,1.8005076265272153,1.8221210093754097,1.8428036723880359,1.8625956944096878,1.8815354284016992,1.8996595757624757,1.9170032574474292,1.9336000820263322,1.9494822108099712,1.9646804201723054,1.979224161188893,1.9931416167071587,2.0064597559590878,2.0192043868221781,2.0314002058299194,2.0430708460287148,2.0542389227739739,2.0649260775541265,2.0751530199274777,2.0849395676531728,2.0943046850940292,2.1032665199656622,2.11184243850311,2.120049059113108,2.1279022845772206,2.1354173328682382,2.1426087666395461,2.1494905214446263,2.156075932741353,2.1623777617334365,2.1684082200990664,2.1741789936546931,2.1797012649997902,2.1849857351864865,2.1900426444560521,2.1948817920824304]
["Commercial-Lodging-ExtLight","Lodging Exterior Lights",0,8.7119898013228378E-2,0.17027887669139977,0.24867284089688274,0.32453631664696009,0.39798524014406955,0.47022557309309221,0.54043990429341426,0.60900684459354004,0.67470524814575816,0.7378456997375632,0.79852594414257572,0.85704329730581041,0.9121359415582756,0.96545993827978871,1.0169910087682847,1.0665573847884564,1.1136127212554865,1.1589692917580823,1.2022149229324719,1.2437559159290439,1.2832030510206249,1.3212249076154206,1.3574811283506374,1.3922373364256841,1.4253591460062021,1.4572881009353913,1.4876543853098834,1.5167130306443255,1.5445203467538395,1.5711302186289726,1.5965942108539803,1.6209616675286289,1.6442798078871443,1.6665938177995991,1.6879469373330489,1.7083805445420917,1.7279342356512235,1.7466459017843641,1.7645518023902402,1.7816866355059111,1.7980836049945914,1.8137744848880653,1.8287896809583752,1.8431582896380978,1.8569081544033825,1.8700659197290137,1.8826570827200484,1.8947060425200817,1.9062361475918839,1.9172697409620294,1.9278282035171928,1.9379319954360092,1.9476006958367904,1.9568530407179208,1.9657069592644572,1.9741796085912862,1.9822874069901655,1.990046065745074,1.9974706195775227,2.0045754557808224,2.0113743420997698,2.0178804534097674,2.0241063972470856,2.0300642382397345,2.0357655214862884,2.0412212949279667,2.046442130757324,2.0514381459050344,2.0562190216444702,2.0607940223520642]
["Commercial-Lodging-Heat","Lodging Heating",0,7.9447303380270728E-2,0.15609030951696651,0.22812160500510073,0.29782220840818713,0.36532315365161749,0.43222033303415397,0.49739679675280174,0.56144350671593435,0.6224853297984011,0.68158663182139301,0.73823872545253233,0.79309185949776628,0.84458375840983613,0.89476551766399626,0.94306316684747582,0.98973623503039099,1.0339682285984331,1.0764871369184981,1.1171997768976285,1.1562477904222921,1.1932578742364532,1.228946288122281,1.2629060403592933,1.2955086423539424,1.3264840945264043,1.3563741154160123,1.3848099708002028,1.4120213156654571,1.4380608801298151,1.4629791236363778,1.4868243327335671,1.5096427146447529,1.5314784868085671,1.5523739625634132,1.5723696331422135,1.5915042461362805,1.6098148805803638,1.627337018804367,1.6441046151909728,1.6601501619724142,1.6755047521938888,1.6901981399656349,1.704258798120416,1.717713973388149,1.7305897391945921,1.7429110461864037,1.7547017705804817,1.7659847604312742,1.7767818799057167,1.7871140516515946,1.79700129734143,1.8064627764704591,1.8155168234838841,1.8241809833053435,1.8324720453354482,1.8404060759862659,1.8479984498147997,1.855263879315789,1.8622164434315682,1.8688696148342276,1.8752362860329448,1.8813287943570762,1.8871589458634219,1.892738038213992,1.8980768825686045,1.9031858245347408,1.9080747642152542,1.9127531753927789,1.9172301238880181,1.9215142851274813]
["Commercial-Lodging-HotWater","Lodging Hot Water",0,7.5670798193698693E-2,0.14654840231407174,0.21207531183215264,0.27544747055583113,0.33702566472765561,0.39788550526660593,0.45725036559774523,0.51541146812419036,0.57112496189808437,0.6244825608475304,0.67573523398139734,0.7250646311608232,0.77157931760557885,0.8165844959240276,0.86010990910385532,0.9019943087002934,0.94177558145976248,0.98008350632231767,1.0166461141815004,1.0517810329109203,1.0851520501975356,1.117306886602051,1.147960827549241,1.1774095853248037,1.2053888800219366,1.2323881143299877,1.2581018917528148,1.2827083773248982,1.3062552534704326,1.3287881493034799,1.3503507290480228,1.3709847766504559,1.3907302767484782,1.4096254921532843,1.4277070379952039,1.4450099526764668,1.4615677657685844,1.4774125629859218,1.492575048361364,1.5070846037445624,1.5209693457380538,1.5342561801815862,1.5469708542902296,1.5591380065473048,1.5707812144488118,1.5819230401918809,1.5925850743957748,1.602787977940171,1.6125515220017939,1.6218946263669833,1.6308353960944375,1.6393911565991783,1.6475784872257246,1.6554132533755295,1.662910637250941,1.6700851672752581,1.6769507462458966,1.6835206782752157,1.6898076945712148,1.6958239781080562,1.7015811872342201,1.7070904782640421,1.7123625270964076,1.717407549902499,1.7222353229226821,1.7268552014108955,1.7312761377632531,1.7355066988659875,1.7395550826963553,1.743429134208669]
["C-Lod-Lgt-LPD Int-All-All-C","Lodging Interior Lights",0,7.8699046901556213E-2,0.15228527716832782,0.22035327335956512,0.28625575791412367,0.35025908127809119,0.41342798015945897,0.4749792275654241,0.53526094468233232,0.59301323485323842,0.64834501487156304,0.70149847069233595,0.752666614465483,0.80090504199438084,0.84757157439476816,0.89271681212118681,0.93615580475008853,0.97740064496754053,1.0171364726381928,1.0550037006368198,1.0914086515318446,1.1259996588960439,1.1593353799436674,1.1911170812956258,1.2216373086801249,1.2506417085598123,1.2786338579734362,1.3052896413612687,1.3307975680481898,1.355207067270124,1.378565439731305,1.4009179492635355,1.4223079105383973,1.4427767730023799,1.4623642011975786,1.481108151623606,1.4990449462896609,1.5162093430992829,1.5326346032041842,1.5483525554576782,1.5633936580926009,1.5777870577432445,1.5915606459256786,1.6047411130859026,1.6173540003205669,1.6294237488704848,1.6409737474828463,1.6520263777339099,1.6626030573999997,1.672724281960851,1.6824096643157327,1.6916779727893037,1.7005471675008548,1.7090344351674109,1.7171562224081345,1.7249282676145685,1.7323656314484768,1.7394827260263794,1.7462933428473388,1.7528106795181133,1.759047365327467,1.7650154857191931,1.7707266057112752,1.7761917923065693,1.7814216359384294,1.7864262709928411,1.7912153954468237,1.7957982896611611,1.8001838343638763,1.8043805278592977,1.8083965024960642]
["Commercial-Lodging-Misc","Lodging Other",0,7.8430614583935507E-2,0.15170412810497352,0.21943196618569114,0.28500810800115728,0.34870033084699775,0.41157026671727887,0.47283572977206006,0.53284371323840141,0.59033372720574151,0.64541023023648458,0.69831764445267719,0.74924699354195701,0.79725999719360319,0.84370855963564195,0.8886453715189182,0.9318848376084331,0.97293882336492388,1.0124911841450146,1.0501809921205563,1.0864177847955327,1.1208491936668759,1.1540318101641176,1.1856670421838158,1.2160484155444529,1.2449181225909787,1.2727815411723444,1.2993159117948352,1.3247076540173146,1.349005971933563,1.3722579508007862,1.3945086482813827,1.4158011817556377,1.4361768118745417,1.4556750225146415,1.4743335972898566,1.4921886927685313,1.509274908537598,1.5256253542496236,1.5412717137826626,1.5562443066372451,1.5705721466894771,1.5842829984141011,1.5974034306864688,1.6099588682676815,1.6219736410726702,1.633471031316678,1.6444733186315184,1.6550018232390211,1.6650769472653395,1.6747182142761705,1.6839443071095017,1.6927731040791965,1.7012217136195742,1.7093065074381173,1.7170431522405512,1.7244466400897702,1.731531317457444,1.7383109130245957,1.7447985642850281,1.7510068430031454,1.756947779575506,1.7626328863433154,1.7680731799010279,1.7732792024442934,1.7782610421986145,1.7830283529682998,1.7875903728435965,1.7919559421022537,1.7961335203402033,1.8001312028645569]
["Commercial-Lodging-Motors","Lodging Motors",0,8.1172956449470313E-2,0.15690713294967831,0.22684235720479043,0.29452438673182507,0.36024478993616654,0.42506195493694643,0.4881940091847245,0.54999948092655371,0.60919918063108436,0.66589345034902159,0.72033797354163553,0.77272506764567728,0.82215684808897749,0.8699596903812683,0.91618183108067119,0.96065488542977162,1.0028957394359179,1.0435744918560559,1.0823470458510873,1.119621622218012,1.1550475933148043,1.1891765713503115,1.2217168300073373,1.2529710956015929,1.282665246085442,1.3113198346678383,1.3386171584024944,1.3647389992969021,1.38973597622935,1.4136565283178166,1.4365470087852488,1.4584517747827919,1.4794132733450338,1.49947212364383,1.5186671957000941,1.5370356857060885,1.5546131881041694,1.5714337645616629,1.5875300099755325,1.6029331156347377,1.6176729296626853,1.6317780148568934,1.645275704037954,1.6581921530150454,1.6705523912706353,1.6823803704625873,1.6936990108376611,1.704530245646344,1.7148950636450837,1.7248135497682795,1.7343049240488497,1.7433875788627926,1.7520791145699148,1.7603963736197925,1.7683554731890538,1.7759718364132271,1.78326022227368,1.7902347541975583,1.7969089474261499,1.8032957352047065,1.8094074938444737,1.8152560667054949,1.8208527871466635,1.8262085004874946,1.8313335850241754,1.8362379721406161,1.8409311655534781,1.8454222597284655,1.8497199575035734,1.8538325869534371]
["Commercial-Lodging-OffEquip","Lodging Office Eqpmt",0,7.4700176098859691E-2,0.14437451829272982,0.20862396673739914,0.27086914753547353,0.33137802766775826,0.39120551390952862,0.44956035049780196,0.50678784685633305,0.56161306232500519,0.61413502968228395,0.66459436950829831,0.71317815793586381,0.75895458755939194,0.80326300325297595,0.84614700498633877,0.88742357859806176,0.9266021084197078,0.96435624247689933,1.0003287485069774,1.0349221640149555,1.0677800059155884,1.099454935960523,1.1296470906189902,1.15864938509209,1.1861963268445834,1.2127948369850305,1.238119764411594,1.2623541447240949,1.2855449392815119,1.3077370871833465,1.3289735923525661,1.3492956068685658,1.3687425107116276,1.3873519880734093,1.4051601003813343,1.4222013561783919,1.4385087779937578,1.454113966333821,1.4690471609176134,1.4833372992753098,1.4970120728233443,1.5100979805248129,1.5226203802391369,1.5346035378604996,1.5460706743402726,1.5570440106845529,1.5675448110140078,1.5775934237694669,1.587209321143112,1.596411136811672,1.6052167020447434,1.6136430802582091,1.6217066000797076,1.6294228869902321,1.6368068936031743,1.6438729286394829,1.6506346846550888,1.6571052645743292,1.6632972070807792,1.6692225109147028,1.674892658124199,1.6803186363151044,1.6855109599427651,1.6904796906869382,1.6952344569493045,1.6997844725113778,1.7041385543889598,1.7083051399177465,1.712292303103188,1.7161077702662901]
["Commercial-Lodging-Misc","Lodging Process",0,7.8430614583935507E-2,0.15170412810497352,0.21943196618569114,0.28500810800115728,0.34870033084699775,0.41157026671727887,0.47283572977206006,0.53284371323840141,0.59033372720574151,0.64541023023648458,0.69831764445267719,0.74924699354195701,0.79725999719360319,0.84370855963564195,0.8886453715189182,0.9318848376084331,0.97293882336492388,1.0124911841450146,1.0501809921205563,1.0864177847955327,1.1208491936668759,1.1540318101641176,1.1856670421838158,1.2160484155444529,1.2449181225909787,1.2727815411723444,1.2993159117948352,1.3247076540173146,1.349005971933563,1.3722579508007862,1.3945086482813827,1.4158011817556377,1.4361768118745417,1.4556750225146415,1.4743335972898566,1.4921886927685313,1.509274908537598,1.5256253542496236,1.5412717137826626,1.5562443066372451,1.5705721466894771,1.5842829984141011,1.5974034306864688,1.6099588682676815,1.6219736410726702,1.633471031316678,1.6444733186315184,1.6550018232390211,1.6650769472653395,1.6747182142761705,1.6839443071095017,1.6927731040791965,1.7012217136195742,1.7093065074381173,1.7170431522405512,1.7244466400897702,1.731531317457444,1.7383109130245957,1.7447985642850281,1.7510068430031454,1.756947779575506,1.7626328863433154,1.7680731799010279,1.7732792024442934,1.7782610421986145,1.7830283529682998,1.7875903728435965,1.7919559421022537,1.7961335203402033,1.8001312028645569]
["Commercial-Lodging-Refrig","Lodging Refrigeration",0,7.2669810158465464E-2,0.14064939254263154,0.20349613373516404,0.26440754820843632,0.32362358929316259,0.38220522581577465,0.43936396493397262,0.49543036992861894,0.54916042927765574,0.60065612599877249,0.65014976508871802,0.69782773588122726,0.74270715873329085,0.78616117440434696,0.82824126778276397,0.86874218476643483,0.9071712436650301,0.94422161853851982,0.97951620952367491,1.0134581437927397,1.045688899744051,1.07677013770231,1.106395504466128,1.1348456288303868,1.161880077841875,1.1879850771022409,1.2128285109135144,1.2366021317855465,1.2593520082181129,1.2811222248999947,1.3019549681362452,1.321890607596772,1.3409677745446447,1.359223436695719,1.3766929698546417,1.3934102264660511,1.4094076012138113,1.4247160937953998,1.4393653689930925,1.4533838141583484,1.4667985942207942,1.4796357043283979,1.4919200202208416,1.5036753464337065,1.5149244624268785,1.5256891667265646,1.5359903191664557,1.5458478813098921,1.5552809551313624,1.5643078200322909,1.5729459682628446,1.5812121388183984,1.5891223498763445,1.5966919298361015,1.6039355470224719,1.6108672381099076,1.6175004353227649,1.623847992464255,1.6299222098245327,1.6357348580161859,1.6412972007833182,1.6466200168284209,1.6517136206993326,1.6565878827767599,1.6612522484010923,1.6657157561755731,1.6699870554812963,1.6740744232379694,1.6779857799429196,1.681728705019427]
["Commercial-Lodging-Vent","Lodging Ventilation",0,7.365731768277313E-2,0.14253316822571205,0.20621725808365712,0.26794129495428448,0.32793024028826201,0.38724423776074951,0.44510319532516479,0.50183654625501639,0.55621058069363127,0.60832526514859897,0.65841140696305378,0.7066603818034155,0.75207773485427454,0.79604659119582888,0.83862610485991274,0.87960355138364321,0.91848172836426256,0.9559680477806789,0.99167061793177957,1.0260054780337329,1.0586141624854601,1.090059663093971,1.1200336548108631,1.1488166912625422,1.1761718986128487,1.2025834034656619,1.2277198733792192,1.2517739115740107,1.2747921299422325,1.2968191331654111,1.3178976051493141,1.338068391736781,1.357370579858759,1.3758415732769198,1.3935171650646332,1.4104316069667515,1.4266176757726063,1.4421067368308407,1.4569288048291511,1.4711126019567207,1.4846856135620505,1.4976741414140409,1.5101033546695339,1.5219973386460823,1.533379141494454,1.5442708188613168,1.5546934766286498,1.5646673118127004,1.5742116517017439,1.5833449913084843,1.5920850292096713,1.6004487018423859,1.6084522163234527,1.6161110818555739,1.623440139781049,1.6304535923413122,1.637165030198023,1.6435874587690384,1.6497333234302973,1.6556145336324586,1.6612424859790247,1.6666280863106668,1.6717817708385541,1.6767135263676327,1.6814329096490477,1.6859490658992056,1.6902707465213662,1.6944063260641038,1.6983638184494982,1.7021508925025075]
["Commercial-large Office-AirComp","Large Office Compressed Air",0,7.4001038170694033E-2,0.14261780020718368,0.20552349759668681,0.26645843405560943,0.32573953249263038,0.38439631185117157,0.44163075527921164,0.49780118327177758,0.55159952953252644,0.60309300621650153,0.65254581947803969,0.70012880877705985,0.74499940264136411,0.78842435693954283,0.83044612420250985,0.87090103882760594,0.90931306290160352,0.94631007408631929,0.98156391560294109,1.0154746162867676,1.0476867281000355,1.0787327104617865,1.1083233335251819,1.1367637983619467,1.1637506925880101,1.1898172548666071,1.2146475651866138,1.2384086276937973,1.2611464865523461,1.2829052031633976,1.3037269415471791,1.323652050048405,1.3427191395232625,1.3609651581594899,1.3784254630745401,1.3951338888305689,1.4111228129990174,1.4264232189018391,1.4410647556509508,1.4550757956022535,1.4684834893355578,1.4813138182669494,1.493591644995554,1.5053407614822569,1.5165839351537427,1.5273429530211935,1.5376386638991366,1.5474910188062594,1.5569191096264725,1.5659412061051454,1.5745747912522008,1.5828365952206749,1.5907426277263916,1.5983082090715752,1.6055479998325164,1.6124760292688238,1.6191057225093093,1.6254499265671902,1.6315209352350188,1.6373305129075821,1.6428899173789344,1.6482099216577406,1.653300834843201,1.6581725221020147,1.6628344237850901,1.6672955737210473,1.6715646167219633,1.6756498253352801,1.6795591158743393,1.6833000637586064]
["Commercial-large Office-Cook","Large Office Cooking",0,7.6350615636919833E-2,0.14680489984792897,0.21111435676510656,0.27337364635668027,0.33394938522060236,0.39385155811375339,0.45227942707930763,0.50961165778648188,0.56450326895859471,0.61699822377159363,0.66738498355435927,0.71582590800625434,0.76157158574836603,0.80581931962463638,0.84860965110913056,0.88980530635725552,0.92894456223066724,0.96661358368963757,1.0025169642158831,1.0370541891229235,1.0698725698120901,1.1014878076925902,1.13162291425421,1.1605989337763314,1.188074566983917,1.2146137937425849,1.2399106560328861,1.2641181797556622,1.2872832742272184,1.309450828745454,1.3306637995763015,1.3509632931943374,1.3703886459388692,1.3889775002398566,1.4067658775613758,1.4237882482039779,1.4400775981012046,1.4556654927396993,1.4705821383267754,1.4848564403239775,1.4985160594600559,1.5115874653319015,1.5240959876973037,1.536065865558933,1.5475202941346546,1.5584814698052016,1.5689706331262991,1.5790081099885935,1.588613351005143,1.5978049692027982,1.6066007760905068,1.615017816174438,1.6230723999868126,1.6307801356924341,1.638155959334177,1.6452141637760367,1.6519684263998256,1.6584318356091929,1.6646169161923197,1.6705356535924409,1.6761995171332267,1.6816194822440267,1.6868060517280457,1.6917692761146668,1.6965187731353568,1.7010637463608975,1.7054130030360559,1.7095749711462556,1.7135577157493176,1.7173689546039221]
["Commercial-large Office-Cool","Large Office Cooling",0,9.3588192581853746E-2,0.17913486554174021,0.2572292120890825,0.33284387144274968,0.406179543738096,0.47810833665015806,0.54802602665732014,0.61625773782973026,0.68171981900947853,0.7442122196885258,0.80419077415902995,0.86177459066807338,0.91622379787982466,0.96870728004329865,1.0195195596575075,1.06833000370286,1.1146790635010191,1.1593487217489391,1.2017721982353247,1.2425967823474051,1.2815062153673518,1.3189678030222454,1.3547155924712651,1.3890598110863206,1.421695410439616,1.453166871099937,1.4831966207894893,1.5119332233632237,1.539432364582108,1.5657473322556814,1.5909291195031203,1.6150265235676551,1.6380862403758223,1.6601529550247862,1.6812694283730771,1.701476579902542,1.7208135670120779,1.739317860896801,1.7570253191596941,1.7739702552964338,1.7901855051880509,1.8057024907302681,1.8205512807228206,1.8347606491367463,1.8483581308725605,1.8613700751173585,1.8738216964042467,1.8857371234730393,1.8971394460269075,1.9080507594755856,1.9184922077518325,1.9284840242841261,1.9380455712049813,1.9471953768708712,1.9559511717664599,1.9643299228627171,1.9723478664954992,1.9800205398283048,1.987362810960176,1.9943889077370867,2.0011124453226468,2.0075464525815558,2.0137033973269234,2.0195952104803854,2.0252333091918322,2.0306286189635516,2.0357915948216561,2.0407322415758236,2.0454601332066056,2.0499844314178799]
["Commercial-large Office-ExtLight","Large Office Exterior Lights",0,8.4415121158210163E-2,0.16483469574174725,0.24049820305020309,0.31373989701843602,0.38468705265614339,0.45452769976060864,0.5224457805540047,0.58881262754030361,0.65240626267917989,0.71351223599011215,0.77224089785718253,0.82887513600379381,0.88218166904001327,0.93378479910600543,0.98367006312603544,1.031658442088506,1.0772094851924947,1.1211208083307171,1.1629818670604799,1.2031994440268989,1.2413868815688016,1.2782001576530673,1.313301187461553,1.3469558442792147,1.3790183087631296,1.4099333987435143,1.4393352926316725,1.4674710762567045,1.4943952711131943,1.52016005088017,1.5448153425232094,1.5684089230428639,1.5909865120568878,1.6125918603956664,1.6332668348825359,1.6530514994632721,1.6719841928419672,1.6901016027737328,1.7074388371581974,1.7240294920715606,1.7399057168690377,1.7550982764838481,1.7696366110434751,1.7835488929187167,1.7968620813160767,1.8096019745192922,1.8217932598812208,1.8334595616629705,1.8446234868129705,1.8553066687746931,1.8655298094079202,1.8753127191047883,1.8846743551783463,1.8936328585980189,1.9022055891431602,1.9104091590428169,1.9182594651668907,1.9257717198310758,1.932960480275272,1.939839676872589,1.9464226401236102,1.9527221264882237,1.9587503431050786,1.9645189714465667,1.9700391899551677,1.9753216957050252,1.980376725130726,1.9852140738634543,1.989843115712955,1.9942728208320946]
["Commercial-large Office-Heat","Large Office Heating",0,7.6959620851923566E-2,0.14976524087226409,0.21744159923112949,0.28291386479741881,0.34649433329900231,0.40941256891195138,0.47074023329274073,0.53091534288414222,0.58844238458528586,0.64372197371505957,0.69679335362700268,0.7479631575656801,0.79618150541289867,0.84293944031476453,0.88807232327070484,0.93156561350095068,0.9728754176345753,1.0126151365062996,1.0505879821108421,1.0870714463725333,1.1216772693563664,1.1550273814803071,1.1867993414973632,1.2173144001992888,1.2462943028014852,1.2742728839589419,1.3009014822033693,1.326383394398994,1.3507679993708834,1.3741025495832178,1.3964322627050691,1.4178004092331562,1.4382483963413737,1.4578158481195724,1.4765406823570828,1.4944591840197725,1.5116060755630161,1.5280145842168376,1.5437165063736045,1.5587422692030468,1.5731209896139962,1.5868805306771057,1.6000475556178801,1.6126475794846502,1.6247050185916072,1.6362432378327145,1.6472845959581759,1.6578504889012011,1.6679613912390243,1.6776368958685202,1.6868957519733008,1.6957559013558663,1.704234513205211,1.7123480173672634,1.7201121361826244,1.7275419149533051,1.734651751097497,1.7414554220488767,1.7479661119545036,1.7541964372230456,1.7601584709728468,1.7658637664272021,1.7713233793021832,1.7765478892303948,1.7815474202621762,1.7863316604839767,1.7909098807919195,1.7952909528569367,1.7994833663162835,1.803495245224749]
["Commercial-large Office-HotWater","Large Office Hot Water",0,7.2793842708699236E-2,0.14089344000254614,0.20375575625159686,0.26460218142403746,0.32375900194811269,0.38231119630960664,0.43945525161635601,0.49550909615403921,0.54919890544246652,0.60064368148898528,0.6500699657453356,0.6976600259052621,0.74249555912772025,0.78590110177261974,0.82790534999348175,0.86833788052611316,0.90672634980860567,0.94369880060053335,0.97897021865062228,1.012872742648091,1.0450685464973317,1.0761030012899291,1.1056823888680221,1.1341003417810831,1.1610907609332448,1.1871488370302132,1.2119599671970067,1.2357026754905889,1.2584229705083709,1.2801648796162963,1.3009705342650286,1.3208802516322369,1.3399326127491824,1.3581645372630058,1.3756113549795832,1.3923068743255904,1.4082834478624393,1.4235720349790411,1.4382022618848804,1.4522024790196546,1.4655998159907304,1.47842023414487,1.490688576876104,1.502428617767237,1.5136631066582733,1.5244138137310357,1.5347015716954013,1.544546316158909,1.5539671242579598,1.5629822516254723,1.5716091677666326,1.5798645899112835,1.5877645154085571,1.5953242527265223,1.6025584511169197,1.6094811290024673,1.6161057011417477,1.6224450046243124,1.6285113237463837,1.6343164138153519,1.6398715239291968,1.6451874187749813,1.6502743994886506,1.6551423236165641,1.6598006242174381,1.6642583281417194,1.6685240735238069,1.6726061265210197,1.6765123973317497,1.6802504555238358]
["C-LOff-Lgt-LPD Int-All-All-C","Large Office Interior Lights",0,7.7764396525857579E-2,0.15006612046040754,0.21656667475577607,0.28094200384986484,0.34350911374850035,0.4053080008657195,0.46554779120776779,0.52458894103431608,0.58113871390549399,0.635273233261198,0.68725698765893994,0.73726817833384217,0.78445285490933736,0.8300942073384282,0.87424007964935491,0.91672609367510349,0.95708029953084284,0.99593890907544114,1.0329745231552654,1.0685887697910981,1.1024293950178417,1.1350357541360647,1.1661199202944026,1.1959865362995266,1.2243434951886967,1.251719852164739,1.2778006905589843,1.3027584306491713,1.3266414355201637,1.3494959856359459,1.371366368521862,1.3922949645849394,1.412322329238602,1.4314872714909106,1.4498269291486223,1.4673768407827963,1.484171014595403,1.5002419943203853,1.5156209222868755,1.5303375997667708,1.5444205447236079,1.5578970470746485,1.5707932215732521,1.5831340584140208,1.5949434716587756,1.6062443455772011,1.6170585789919627,1.6274071277142224,1.6373100451517915,1.6467865211686039,1.6558549192708167,1.6645328121915948,1.6728370159435355,1.6807836224047228,1.6883880305015528,1.6956649760487583,1.7026285603044575,1.7092922772955572,1.715669039966466,1.7217712052017855,1.7276105977714693,1.7331985332448507,1.738545839917943,1.7436628797965001,1.7485595686755022,1.7532453953539731,1.7577294400223664,1.7620203918581496,1.7661265658636836,1.770055918979027]
["Commercial-large Office-Misc","Large Office Other",0,7.3481100604945712E-2,0.14193626259234926,0.204973729313605,0.26604971966822882,0.32544351841876101,0.38420261861067651,0.44153272129987703,0.49777903714620614,0.55166508006865389,0.60327852375526347,0.65286513984415606,0.7006052039051418,0.74558352841408282,0.78912328360745654,0.83126933936597391,0.87183873419638114,0.91034697168957246,0.94745433925744715,0.98280960762646796,1.0168131002292859,1.049107634869598,1.080241418385596,1.1099163976408193,1.1384256191782693,1.1654978101541646,1.1916422242183897,1.2165349031006625,1.2403556484425502,1.2631506200615816,1.2849639900319465,1.3058380282810995,1.3258131845003847,1.3449281665284087,1.3632200153590539,1.3807241769194798,1.397474570757208,1.4135036557693881,1.4288424931016179,1.4435208063382015,1.4575670391004822,1.4710084101648657,1.4838709662073382,1.4961796322766898,1.5079582600942512,1.5192296742737357,1.5300157165507542,1.54033728810771,1.5502143900760885,1.5596661622946326,1.5687109203985026,1.5773661913112969,1.5856487472087075,1.593574638019627,1.6011592225276838,1.6084171981334798,1.6153626293351984,1.6220089749827762,1.6283691143584487,1.6344553721342117,1.6402795422545591,1.6458529107907767,1.6511862778110806,1.6562899783089791,1.6611739022304131,1.6658475136384838,1.6703198690529055,1.674599634999721,1.6786951048052856,1.68261421466707,1.6863645590324139]
["Commercial-large Office-Motors","Large Office Motors",0,7.4771982031593853E-2,0.1439953954672219,0.20736941340098272,0.26874545660235216,0.32845681030557722,0.38752659195447337,0.44515659856867029,0.50171105271645966,0.55587135181420999,0.60769703299958777,0.65745966020198221,0.70532730861246418,0.75048672148591589,0.79418350487080325,0.83645976329077198,0.87715968174962988,0.91581197203760911,0.9530313046507396,0.9884998282512667,1.0226173809488175,1.0550300342958665,1.0862645966779407,1.1160356400940243,1.1446534216570488,1.1718025647092767,1.1980255973670464,1.2230105172881993,1.2469195315668147,1.2697989710678821,1.2916931715473721,1.312644559566023,1.332693734703488,1.3518795482321626,1.3702391784031431,1.3878082024902059,1.4046206657314142,1.4207091473019484,1.4361048234460003,1.4508375278900691,1.4649358096547285,1.4784269883768901,1.4913372072497724,1.5036914836831525,1.515513757782081,1.5268269387379931,1.5376529492221196,1.5480127678672169,1.5579264699199415,1.5674132661426445,1.5764915400399679,1.5851788834823828,1.5934921307956984,1.6014473913826033,1.60906008093945,1.6163449513287771,1.6233161191654535,1.6299870931718425,1.6363708003549899,1.6424796110565665,1.6483253629241039,1.6539193838499768,1.6592725139225823,1.664395126432253,1.6692971479726075,1.6739880776762963,1.6784770056224096,1.6827726304512265,1.6868832762204291,1.6908169085354556,1.6945811499852417]
["Commercial-large Office-OffEquip","Large Office Office Eqpmt",0,7.2997878512102696E-2,0.14108108527794447,0.20383759076388402,0.26464770404445676,0.32378139777885434,0.38229055579645782,0.43938087222404226,0.49539374692245547,0.54906015212320003,0.60047253180078008,0.649871817767677,0.69744004866913867,0.74224387570501027,0.78561930497653809,0.82761170333786316,0.86803275848939643,0.90639645284409687,0.94336930393906793,0.97859581876822144,1.0124747386562298,1.044648374321598,1.0756684425030623,1.105234771972246,1.1336367291739429,1.1606115437970543,1.186661855140974,1.2114612792201795,1.2351927855160698,1.2579023609188356,1.2796340120219609,1.3004298503981575,1.3203301742031301,1.3393735462653049,1.3575968688128406,1.3750354549827311,1.3917230972505692,1.4076921329135719,1.4229735067537661,1.4375968310027556,1.4515904427242765,1.4649814587257322,1.4777958281051156,1.4900583825351477,1.501792884382068,1.5130220727523267,1.5237677075564022,1.5340506116751349,1.5438907113102855,1.5533070745975111,1.5623179485565784,1.570940794450423,1.579192321621566,1.5870885198714635,1.5946446904455285,1.6018754756838678,1.6087948873951976,1.61541633400891,1.6217526465579175,1.6278161035426133,1.6336184547241406,1.6391709438930662,1.6444843306575883,1.6495689112934946,1.6544345386962758,1.6590906414740569,1.6635462422183449,1.6678099749879984,1.6718901020402985,1.6757945298415426,1.6795308243881877]
["Commercial-large Office-Process","Large Office Process",0,7.4822431369993614E-2,0.14472555407469562,0.20928811747747336,0.27182911736891474,0.33261386703767826,0.392701846283804,0.45130184314365651,0.50875539333418507,0.56380361043151184,0.61654744965864783,0.6672248330821815,0.71602222152696871,0.76199166241622951,0.8064847294311791,0.84954998435399209,0.89099729843839948,0.93033998870066437,0.96825386526078472,1.0043790549255645,1.0391171061435547,1.072111485724951,1.1039194968058419,1.1342398620754537,1.1633606414685562,1.1910273476592432,1.2177389465018087,1.2431686961706261,1.2675033848489206,1.2907901682731255,1.3130741715498766,1.3343985765993995,1.3548047058333925,1.374332102229558,1.3930186059579461,1.4109004277075998,1.4280122188555937,1.4443871386144396,1.4600569182879761,1.4750519227602603,1.4894012093366085,1.5031325840508174,1.5162726555476682,1.5288468866451328,1.5408796436761996,1.5523942437059286,1.5634129997152384,1.57395726383898,1.5840474687420822,1.5937031672139501,1.6029430700578429,1.6117850823486493,1.6202463381293253,1.6283432336132257,1.6360914589566711,1.6435060286633176,1.6506013106792472,1.6573910542351606,1.6638884164896233,1.6701059880249942,1.6760558172454447,1.681749433724345,1.6871978705462589,1.6924116856868467,1.6974009824720979,1.702175429156549,1.7067442776584161,1.7111163814879538,1.7153002129037793,1.7193038793304067,1.7231351390688061]
["Commercial-large Office-Refrig","Large Office Refrigeration",0,7.2006931518242043E-2,0.13938157578223284,0.20167402710378471,0.26205470337876685,0.32076077126381114,0.37885329884463603,0.43554310187602124,0.49115857723817091,0.54445910394127939,0.59554606812626321,0.64465004404024806,0.69195700391389126,0.73647829277590671,0.77958988595213541,0.8213435631538093,0.86153125942670561,0.89966058028741436,0.93642503160253077,0.97144601291962229,1.0051258649302137,1.0371050618531537,1.0679462288517807,1.0973420741079036,1.1255713951275976,1.1523964940203191,1.1783007494184128,1.2029509977122868,1.2265397520604917,1.2491127227286305,1.2707136515976627,1.2913843969268801,1.311165014466801,1.3300938350791656,1.3482075390144426,1.3655412269907843,1.3821284882121638,1.3980014654575033,1.4131909173669188,1.4277262780457856,1.4416357141021172,1.4549461792277936,1.4676834664293976,1.47987225800988,1.4915361733979013,1.5026978149175392,1.513378811587049,1.523599861031556,1.5333807695908928,1.5427404907003059,1.5516971616184048,1.5602681385735233,1.5684700303966033,1.5763187307057707,1.5838294487049738,1.5910167386563643,1.5978945280835326,1.6044761447602485,1.61077434253701,1.6168013260554421,1.6225687743984394,1.6280878637218816,1.6333692889117786,1.6384232843088091,1.6432596435404174,1.6478877384988941,1.6523165375022213,1.6565546226728691,1.660610206568226,1.6644911480948832,1.6682049677376174]
["Commercial-large Office-Vent","Large Office Ventilation",0,7.7092429293850587E-2,0.14878288848829799,0.21476182605477753,0.27865892145703841,0.34075553643678447,0.40209160678609118,0.46188513822446081,0.52048977357105863,0.57663606560415603,0.63039747482809283,0.68203199191697261,0.73172225729945461,0.77857502934930156,0.82390143963335172,0.86776062226767336,0.90996780978117608,0.95004142914290324,0.98864657924795718,1.025423153962786,1.0607931385048843,1.0944015449709819,1.1267915233157355,1.1576688618108788,1.1873332059925168,1.2155056294222084,1.2427039601789738,1.2686099437960645,1.2934003587406486,1.3171232438550835,1.3398245693234418,1.3615483257524932,1.3823366094166571,1.402229703832125,1.4212661578182186,1.4394828601972558,1.4569151112776739,1.4735966912589351,1.4895599256907643,1.5048357481135672,1.5194537600014169,1.5334422881237613,1.5468284394370091,1.5596381536123662,1.5718962533017029,1.5836264922388674,1.594851601269647,1.6055933323995792,1.6158725009449693,1.6257090258687872,1.6351219683796179,1.6441295688684512,1.6527492822548944,1.6609978118112994,1.6688911415303471,1.676444567098814,1.6836727255375381,1.6905896235650255,1.6972086647396547,1.7035426754330796,1.7096039296851606,1.7154041729885878,1.7209546450492834,1.7262661015666958,1.731348835076181,1.7362126948938703,1.7408671062026639,1.7453210883163421,1.7495832721571825,1.7536619169809531,1.7575649263816906]
["Commercial-Misc. Com-AirComp","Other Compressed Air",0,7.5080176190214759E-2,0.14461423623795649,0.20830489422688472,0.26998681266237046,0.32999064469358219,0.38933906032048959,0.44723456534330563,0.50404076365327344,0.55844583413660309,0.61050279395110829,0.66049173362036884,0.70857602896197802,0.75394349381607317,0.79783606540127694,0.84030260929827905,0.88118208335623083,0.9200065051256715,0.95739226378593456,0.99301835003827066,1.0272873693447189,1.0598450953455147,1.0912180396412909,1.1211222397645071,1.1498661301973172,1.1771378691896204,1.2034787483824383,1.2285746412100864,1.2525898496575967,1.2755709103729174,1.2975623560335114,1.3186068016417354,1.3387450271041506,1.3580160562547872,1.376457232475492,1.3941042910598986,1.4109914284612446,1.4271513685582264,1.4426154260672999,1.4574135672243083,1.4715744678530243,1.4851255689331353,1.4980931297753468,1.5105022789066496,1.5223770627643556,1.5337404922932609,1.5446145875362325,1.5550204203046263,1.5649781550112232,1.5745070877448091,1.5836256836621159,1.5923516127695865,1.6007017841642952,1.6086923788003802,1.6163388808444805,1.6236561076809402,1.6306582386249209,1.637358842399065,1.6437709034269541,1.6499068469943121,1.6557785633267121,1.6613974306304442,1.6667743371411925,1.6719197022232484,1.676843496560144,1.6815552614758336,1.6860641274238619,1.6903788316803483,1.6945077352750721,1.6984588391934681,1.7022397998809284]
["Commercial-Misc. Com-Cook","Other Cooking",0,7.6813029766469934E-2,0.14820987725249682,0.21385227729400152,0.27741219158097841,0.33919786118464063,0.40025367768503489,0.45978486580472272,0.51815128212604811,0.57405256388185932,0.62756967699561883,0.67896707884124885,0.72842017816066496,0.77506764284177543,0.82019787320019466,0.86385590200547369,0.90587552172180086,0.94577812666229866,0.98420761811615853,1.0208303615490659,1.0560504677634028,1.0895142880299487,1.121760710995831,1.1524992549496416,1.1820363474920017,1.2100765655970593,1.2371503537238921,1.2629411466588349,1.2876213312855742,1.3112387328422626,1.3338391171070361,1.3554662790828957,1.3761621278636229,1.3959667678451801,1.4149185764399714,1.4330542784445566,1.4504090172049253,1.4670164227172395,1.4829086767960094,1.4981165754359804,1.5126695884885843,1.5265959167685881,1.539922546701606,1.5526753026183697,1.5648788967970908,1.5765569773508907,1.5877321740530919,1.5984261421891695,1.6086596045203443,1.6184523914401285,1.6278234794016448,1.6367910276901769,1.6453724136122174,1.653584266169194,1.6614424982811333,1.6689623376227019,1.6761583561313798,1.6830444982449475,1.6896341079230024,1.6959399545048734,1.7019742574540322,1.7077487100369591,1.7132745019823439,1.7185623411645301,1.7236224743532251,1.7284647070696797,1.7330984225878179,1.7375326001171369,1.7417758322026098,1.7458363413753111,1.74972199608603]
["Commercial-Misc. Com-Cool","Other Cooling",0,0.1063762269769318,0.20289887310569457,0.29077104752540661,0.37583291287621823,0.45820840496105042,0.5386764540620731,0.61676426502853721,0.69276173558425735,0.76572535869747937,0.83530619616938728,0.90206863332255571,0.96610016591277881,1.0267181500190199,1.0850345527132128,1.1415152648145208,1.1957159788306797,1.2471828297557681,1.2967915200987903,1.3438305505237864,1.389105337749496,1.4323348599287664,1.4739357076906148,1.5136562757879433,1.5518080487277277,1.5880861013234142,1.6230421151605392,1.6564306304459426,1.6883813627764723,1.7189562262506635,1.7482144688096981,1.7762127870480084,1.8030054360798846,1.8286443346749814,1.8531791658664616,1.8766574732267298,1.8991247529973212,1.9206245422514758,1.9411985032602359,1.9608865042255568,1.9797266965368689,1.9977555887008036,2.0150081170873442,2.031517713629488,2.0473163706076161,2.0624347026441021,2.0769020060282997,2.0907463154868622,2.1039944585094097,2.1166721073348138,2.1288038286988371,2.1404131314395292,2.1515225120526313,2.1621534982852655,2.1723266908523797,2.1820618033567949,2.1913777004902064,2.2002924345891648,2.2088232806168762,2.2169867696386096,2.2247987208555795,2.2322742722593785,2.2394279099663628,2.2462734962888362,2.2528242965974234,2.2590930050266929,2.265091769073841,2.2708322131380978,2.2763254610464769,2.2815821576095199,2.2866124892487947]
["Commercial-Misc. Com-ExtLight","Other Exterior Lights",0,9.5904529373777886E-2,0.18709948337620089,0.2728813174649431,0.35579945756898484,0.43601839338812559,0.51473879509153386,0.59115852165923155,0.66567600843582775,0.7370539117184346,0.80559449434985764,0.87142091408370903,0.93483258330431951,0.99464678988127153,1.0524766145134192,1.1083087993541969,1.1619957401938046,1.2130026688744777,1.2621248715875639,1.308975557014745,1.3539683951702273,1.3967300452781559,1.4379165556519273,1.4772004535396761,1.5148673111683242,1.550754707880283,1.5853316883333355,1.6182469495884269,1.6497448072488012,1.6798862978328919,1.7087298294923086,1.7363312951950995,1.762744181035091,1.7880196698771882,1.8122067405394822,1.8353522627043566,1.8575010877425142,1.8786961356259184,1.8989784780980756,1.9183874182628191,1.9369605667458274,1.9547339145764575,1.9717419029311276,1.9880174898733951,2.0035922142200633,2.0184962566570661,2.0327584982235756,2.0464065762776524,2.0594669380518882,2.0719648919028315,2.0839246563534948,2.0953694070239859,2.1063213215412024,2.1168016225146151,2.1268306186614221,2.1364277441607586,2.1456115963132336,2.1543999715787598,2.1628099000625172,2.1708576785158735,2.1785589019162144,2.1859284936868755,2.1929807346157379,2.1997292905285248,2.2061872387704264,2.2123670935473654,2.2182808301760155,2.2239399082895566,2.229355294044141,2.2345374813691019,2.2394965123020789]
["Commercial-Misc. Com-Heat","Other Heating",0,9.3589390256135691E-2,0.1837234038849615,0.26835284217119809,0.35001259367768262,0.42898580446324464,0.50692662299652613,0.58268410335244936,0.65688049494176048,0.72759379668002544,0.79588002292693982,0.8613070464660656,0.92452203612365436,0.98415504036142187,1.0421069928132463,1.0977613311338719,1.1514721788964375,1.2025015947369004,1.2514627464952701,1.2984392810777423,1.3434935987546839,1.3862028461852387,1.4273106893354517,1.4664551581995462,1.5040381173098678,1.5397603667458435,1.5741986946871707,1.6069896170637614,1.6383684901514084,1.6683961199003525,1.6971306938227873,1.7246278937485622,1.7509410037253803,1.7761210132725747,1.8002167161885501,1.8232748051033592,1.8453399619596358,1.8664549445972212,1.8866606696092643,1.9059962916303583,1.9244992792103528,1.9422054874208738,1.9591492273352478,1.975363332516467,1.9908792226420355,2.005726964388991,2.0199353296970823,2.0335318515230072,2.0465428771937484,2.058993619462401,2.0709082053654173,2.0823097229759591,2.0932202661439421,2.1036609773094761,2.1136520884726662,2.1232129603991639,2.1323621201374392,2.1411172969204779,2.1494954565214717,2.157512834130078,2.1651849658129554,2.1725267186195367,2.1795523193913846,2.186275382330952,2.1927089353831692,2.1988654454809855,2.2047568427037758,2.2103945433954411,2.2157894722869869,2.2209520836664565,2.2258923816372409]
["Commercial-Misc. Com-HotWater","Other Hot Water",0,7.4696339417805208E-2,0.14450448254783319,0.20888868593662815,0.27117442707943373,0.33171702104329065,0.39160214775130331,0.45003049450182081,0.50731690715836097,0.56217464731037081,0.61472427772708671,0.66519545023674309,0.71377492566572887,0.75957484061267277,0.80390162962436196,0.84677674169196149,0.88804494180235061,0.92723872395425766,0.96497222361174317,1.0009836951099391,1.0355922310961476,1.068464318131831,1.1001418041094417,1.1303362532368502,1.1593492807996399,1.1869001380199129,1.2134935303142622,1.2388243042351874,1.2630642792791349,1.2862604276465488,1.3084576988115382,1.3296991066249251,1.3500258126664439,1.3694772060076101,1.3880909795398266,1.4059032030156318,1.4229483929446318,1.4392595794795604,1.4548683704220755,1.4698050124723294,1.4840984498409935,1.4977763803373227,1.5108653090419442,1.5233905996683759,1.5353765237128081,1.5468463074873844,1.5578221771281273,1.5683254016647235,1.5783763342356287,1.5879944515283611,1.5971983915214063,1.6060059896008758,1.614434313121899,1.6224996944817298,1.6302177627686492,1.6376034740479981,1.6446711403440255,1.651434457373717,1.6579065310863406,1.6640999030601427,1.6700265748054082,1.675698031020973,1.6811252618492647,1.6863187841729887,1.6912886619947345,1.6960445259389889,1.7005955919143516,1.7049506789721152,1.7091182263958125,1.7131063100548527,1.7169226580539343]
["C-Oth-Lgt-LPD Int-All-All-C","Other Interior Lights",0,7.6497691189869821E-2,0.14754176180737472,0.21279752197526866,0.27598282573963201,0.3374144331801347,0.39813246076161157,0.45734031425546462,0.5154003291645527,0.57100534248334356,0.6242335540124605,0.6753475146338852,0.72452457895438571,0.77091598286537255,0.81580015035489084,0.85921707713496764,0.90100845124767948,0.94069620204086069,0.97891629265938251,1.0153411912633574,1.0503721502924173,1.083654137285549,1.1157250440464628,1.1462955605077707,1.1756738091450083,1.203558688362151,1.2304843427470937,1.2561353736142515,1.2806818146354551,1.3041712318806262,1.3266491431200242,1.3481591060285389,1.3687428025917112,1.3884401198770435,1.4072892273271222,1.4253266507243267,1.4425873429704554,1.4591047518184255,1.4749108846872965,1.4900363706862159,1.5045105199674786,1.5183613805237108,1.5316157925392442,1.5442994404009984,1.5564369024696629,1.5680516987076194,1.579166336255903,1.5898023530485188,1.5999803595486297,1.6097200786874919,1.6190403840835321,1.6279593366156282,1.6364942194214618,1.6446615713887665,1.6524772192043689,1.6599563080231274,1.6671133308161978,1.6739621564554996,1.6805160565888029,1.6867877313575137,1.6927893340069982,1.6985324944371265,1.704028341738685,1.7092875257593152,1.7143202377407791,1.7191362300675392,1.7237448351649169,1.7281549835834604,1.7323752213045547,1.7364137263008173,1.7402783243833648]
["Commercial-Misc. Com-Misc","Other Other",0,7.6297736108160541E-2,0.14720550766746204,0.21237628904265146,0.27548685726227384,0.33684277676196472,0.39748998304488292,0.45663008152157319,0.51462608117933462,0.57016964188918517,0.62335087155513413,0.67442191396692286,0.72356637661946011,0.76991685428877177,0.81476611739085447,0.85815210303788891,0.8999150159405811,0.93957140908802594,0.97776467798569544,1.0141623940542968,1.0491670475925234,1.0824217968220478,1.1144694178723615,1.1450168996056407,1.1743708864070259,1.2022354274957696,1.2291415599880349,1.2547715783721485,1.2792979117540755,1.3027680872391727,1.3252275853110365,1.3467199279635373,1.367286763037701,1.386967944926853,1.405801611806424,1.4238242595380712,1.4410708123913218,1.4575746907197915,1.4733678757231119,1.4884809714200689,1.5029432639530422,1.5167827783386627,1.5300263327746633,1.5426995906081564,1.5548271100660445,1.566432391843928,1.5775379246457304,1.5881652287622878,1.5983348977733476,1.6080666384537872,1.6173793089613853,1.626290955380139,1.6348188466899516,1.6429795082304417,1.650788753723734,1.6582617159182722,1.6654128759130453,1.6722560912190485,1.678804622612353,1.6850711598308261,1.6910678461642932,1.6968063019857929,1.7022976472695246,1.7075525231391244,1.7125811124880235,1.7173931597118506,1.7219979895911108,1.7264045253607379,1.7306213060015294,1.7346565027869758,1.7385179351175466]
["Commercial-Misc. Com-Motors","Other Motors",0,7.5485325975828618E-2,0.14556114204252832,0.20993582737592706,0.27228652542079768,0.33291637994963236,0.39284974489984553,0.45130221010853544,0.50862372626148966,0.56354052506211139,0.61609988700423801,0.66658879026050899,0.71516472889363703,0.76097638801398915,0.80529076246003661,0.84818245507721723,0.88945849778470198,0.92865319027571569,0.9664074246142017,1.002375348201719,1.0369699618184378,1.0698427370586039,1.1015226605423549,1.1317226339922484,1.1607411687070204,1.1882901066942979,1.2148934045935316,1.2402335772761159,1.2644825463503595,1.2876873014453292,1.3098928087132429,1.331142097964835,1.3514763460524828,1.3709349566626723,1.3895556366724227,1.4073744692176386,1.4244259836149742,1.4407432222727119,1.4563578047203074,1.4712999888806861,1.4855987297040152,1.4992817352765786,1.5123755205134817,1.5249054585392259,1.5368958298557278,1.5483698693930501,1.5593498115340285,1.5698569332000365,1.5799115950813838,1.5895332810922425,1.598740636126557,1.6075515021881022,1.6159829529647001,1.6240513269135979,1.6317722589221124,1.6391607106049015,1.6462309992965658,1.6529968257957659,1.6594713009146178,1.6656669708848111,1.6715958416696848,1.6772694022293726,1.6826986467840979,1.6878940961187632,1.6928658179701175,1.6976234465360069,1.7021762011445134,1.7065329041191606,1.7107019978748041,1.7146915612773337,1.718509325298893]
["Commercial-Misc. Com-OffEquip","Other Office Eqpmt",0,7.5002557789852944E-2,0.14460648805160323,0.20847645689713701,0.27033471002451753,0.3304975964186827,0.39000011467647183,0.44804419361777853,0.50498980423230144,0.55952927806935338,0.61173563298702249,0.66187085391944023,0.7101099560440729,0.75560610126610595,0.79963134451519347,0.84222707046683776,0.88323160094268294,0.92216866372666773,0.95966890048426357,0.99540574705633644,1.0297777832049848,1.0624296498443067,1.0938972088464889,1.1238909061850972,1.1527168065066238,1.1800733179732681,1.2064933789800294,1.2316608632793098,1.2557445803121139,1.2787911994822614,1.300845380506326,1.3219498599551918,1.3421455340689388,1.3614715380055389,1.3799653216769265,1.3976627223194027,1.4145980339389972,1.4308040737663603,1.4463122458499613,1.4611526019108236,1.4753538995767206,1.4889436581086792,1.5019482117277785,1.5143927606455769,1.5263014198970584,1.5376972660707251,1.548602382026387,1.5590378996873075,1.5690240409896239,1.5785801570683953,1.587724765756215,1.5964755874670471,1.604849579534829,1.6128629690733762,1.6205312844212685,1.6278693852326487,1.634891491272247,1.6416112099704272,1.648041562791652,1.6541950104674654,1.660083477142885,1.6657183734829992,1.6711106187845441,1.6762706621353047,1.6812085026623484,1.6859337089083233,1.6904554373733709,1.694782450258584,1.6989231324453908,1.7028855077437703,1.7066772544407844]
["Commercial-Misc. Com-Process","Other Process",0,7.3836376293864359E-2,0.14272282157596769,0.2062489977651959,0.26779665366523642,0.32763618133380096,0.38682073929532595,0.44455686397412253,0.50118809682559706,0.55544655441428048,0.60742568702897026,0.65736752874165671,0.70545524570816875,0.75075607565068925,0.79460729511565076,0.83705493323386382,0.87791163721470444,0.91669215128992987,0.95406425218862212,0.98967215441007417,1.0239164637722358,1.0564393804418148,1.0877937822758563,1.1176799853787727,1.1463879935444332,1.1736557565429198,1.199986637493778,1.225054125849939,1.2490421529850213,1.2719972028750521,1.293963757793742,1.3149843845101916,1.3350998167747368,1.3543490342527704,1.3727693380595012,1.3903964230420187,1.4072644469487339,1.4234060966202315,1.4388526513297988,1.4536340433963704,1.467778916187348,1.4813146796236902,1.4942675632948312,1.5066626672863535,1.5185240108189109,1.5298745787926498,1.5407363663273284,1.551130421384437,1.561076885553919,1.5705950330845238,1.5797033082334277,1.5884193610074986,1.5967600813654612,1.6047416319472436,1.6123794793939252,1.6196884243189795,1.6266826299888879,1.6333756497687044,1.6397804533857538,1.6459094520623561,1.6517745225662817,1.6573870302255407,1.6627578509521044,1.6678973923172371,1.672815613719278,1.6775220456829534,1.6820258083276189,1.6863356290402174,1.6904598593872016,1.6944064912981913,1.698183172552727]
["Commercial-Misc. Com-Refrig","Other Refrigeration",0,7.2681111716694405E-2,0.1406107870033573,0.20339180057853848,0.26424518368503436,0.32340542844913311,0.38192031517160557,0.43901329196557098,0.49500649959473575,0.54867809888483865,0.60010569977513006,0.64953865800241661,0.69715346361672581,0.7419729079926124,0.78535934043155409,0.82738523522309437,0.86782726735343108,0.90619940105948971,0.94319996946964546,0.97843828875165839,1.0123285437782579,1.044514446938962,1.0755532826602663,1.1051402057147754,1.1335524076072716,1.1605534655759115,1.1866256440993861,1.2114380533453664,1.2351819856381703,1.2579034519470735,1.2796464819077464,1.3004532091428405,1.3203639529084803,1.3394172962248823,1.357650160642492,1.3750978777885297,1.391794257832585,1.4077716550039299,1.4230610302875135,1.4376920114201293,1.4516929503030152,1.4650909779421404,1.4779120570226429,1.4901810322192963,1.5019216783404958,1.5131567463990596,1.5239080076991209,1.5341962960245383,1.5440415480105836,1.5534628417771343,1.5624784338982354,1.5711057947796716,1.5793616425131036,1.5872619752723689,1.5948221023147278,1.6020566736471284,1.6089797084149764,1.615604622068419,1.621944252358795,1.6280108842156142,1.633816273552283,1.6393716700467031,1.644687838940885,1.6497750819018244,1.6546432569840634,1.6593017977326172,1.6637597314632908,1.6680256967558016,1.6721079601936106,1.6760144323829018,1.6797526832817451]
["Commercial-Misc. Com-Vent","Other Ventilation",0,7.8485530049600447E-2,0.15133060392427153,0.21831239749489209,0.28319344260504692,0.34622865926891105,0.40845127086117194,0.46909634759067631,0.52851417953982505,0.58544401888414987,0.63995442946503067,0.69230576641958919,0.7426845592301301,0.79018728242098724,0.83613147187786308,0.88059718665000575,0.92338200510845947,0.96399469896229084,1.0031250328071661,1.0403859231435091,1.0762234464122766,1.1102879934961862,1.1431182184905029,1.174416770201538,1.204485479828453,1.2330439043611277,1.2606116414186794,1.286874251456924,1.3120059357040481,1.3360553943137363,1.3590692303038685,1.3810920398638036,1.4021664987728324,1.4223334450972618,1.441631958326381,1.4600994351006575,1.4777716616789127,1.4946828832848986,1.5108658704676603,1.526351982604274,1.5411712286680195,1.5553523253797374,1.5689227528550655,1.5819088078553798,1.5943356547456327,1.6062273742578363,1.617607010154682,1.6284966138837209,1.6389172873086384,1.6488892236004256,1.6584317463676861,1.6675633471019065,1.6763017210102515,1.6846638013053183,1.692665792018301,1.7003231993991457,1.7076508619645474,1.7146629792520132,1.7213731393357123,1.727794345157434,1.7339390397236749,1.7398191302176853,1.7454460110731977,1.7508305860545492,1.7559832893859861,1.7609141059710933,1.7656325907415307,1.7701478871725713,1.7744687450013183,1.7786035371819375,1.7825602761107597]
["Commercial-Resturant-AirComp","Restaurant Compressed Air",0,7.9603339645008958E-2,0.15361197273475483,0.22170575556052344,0.28761080200869898,0.35164447723430126,0.41485057455200247,0.47644185427336938,0.53678105156627465,0.59456774309709215,0.64988607776837592,0.70300022018083252,0.75409230380327796,0.80231243893938076,0.84894576987248405,0.89404004995247977,0.9374362186368963,0.97865576840977453,1.0183443780255963,1.056173122156207,1.0925448468751313,1.1271133497664643,1.1604158942337084,1.1921652041552195,1.2226712903211505,1.2516356605081833,1.2795934297126401,1.3062332664646401,1.3317259332129654,1.3561208296228462,1.379465228101201,1.4018043654010619,1.4231815302813118,1.4436381473915989,1.4632138575449833,1.4819465945338683,1.4998726586380642,1.5170267869674385,1.5334422207754519,1.5491507698740297,1.5641828742745822,1.5785676631746326,1.5923330114043459,1.605505593442349,1.6181109351055099,1.6301734630128408,1.6417165519193777,1.6527625700117574,1.6633329222532691,1.6734480918623713,1.6831276800050528,1.6923904437779536,1.7012543325558493,1.7097365227739312,1.7178534512122874,1.7256208468470777,1.7330537613301307,1.7401665981560186,1.7469731405731364,1.7534865782928661,1.7597195330485884,1.7656840830540643,1.7713917864085866,1.7768537034942542,1.7820804184087684,1.7870820594752892,1.7918683188690889,1.7964484713990412,1.800831392480335,1.8050255753332476,1.8090391474412979]
["Commercial-Resturant-Cook","Restaurant Cooking",0,8.3468670692070354E-2,0.16112525280582082,0.23266810908656535,0.30187301399283989,0.36906621399636297,0.43529755597314507,0.49978471232908833,0.56289782178265058,0.62333588026088282,0.68118736529591672,0.73672321173867705,0.79012949081506756,0.8405678669884612,0.88932464738104278,0.93644910354481337,0.98178891743654895,1.0248683640462073,1.0663353512960327,1.1058655496123482,1.143866648247037,1.1799954099182182,1.2147903299138199,1.2479673226698051,1.2798418733331753,1.3101126379554691,1.339320782844551,1.3671592794987439,1.393798989215675,1.4192915343993411,1.4436863144794043,1.4670306016373595,1.4893696324105223,1.510746695351348,1.5312032149119468,1.5507788317163476,1.5695114793760612,1.5874374579977968,1.6045915045257733,1.6210068600549377,1.6367153342455254,1.6517473669637912,1.6661320872683518,1.6798973698564481,1.6930698890795066,1.7056751706326727,1.7177376410184775,1.7292806748804919,1.7403266402986874,1.7508969421342813,1.7610120635080553,1.7706916054925281,1.7799543250948942,1.7888181716043356,1.7973003213741359,1.8054172111060021,1.8131845697010895,1.8206174487394509,1.8277302516469733,1.8345367616063253,1.8410501682659921,1.847283093299166,1.8532476148620121,1.8589552909987066,1.8644171820386057,1.8696438720289399,1.8746454892445705,1.8794317258145523,1.8840118565035298,1.8883947566843697,1.8925889195368479]
["Commercial-Resturant-Cool","Restaurant Cooling",0,0.10372734876263108,0.19857291209885494,0.28539223001095171,0.36938342029717386,0.45073548202293645,0.53027291265787657,0.60747099575300156,0.68262096097364566,0.75475387803144245,0.82356824012082508,0.88961545223210103,0.95297774874908081,1.0129619934745966,1.0706899839108663,1.1265777565508266,1.1802097516708268,1.2311650750872272,1.2802635519379097,1.3268829016108892,1.3717321325671881,1.4145213829711387,1.4557006653692797,1.4950155113803061,1.5327707441870424,1.5686790421947157,1.6032765097425354,1.636306622477288,1.6679143858598264,1.6981610493837866,1.7271052250048013,1.754803000718691,1.781308049248729,1.8066717320525931,1.8309431988505489,1.8541694828677318,1.8763955919750837,1.897664595905564,1.918017709714636,1.9374943736467622,1.9561323295626725,1.9739676940755055,1.9910350285375467,2.0073674060131843,2.0229964753678611,2.0379525225972168,2.0522645295152606,2.0659602299153024,2.0790661633124721,2.0916077263719641,2.1036092221226745,2.115093907051584,2.1260840361701576,2.1366009061400844,2.1466648965419282,2.1562955093666591,2.1655114068065933,2.1743304474189702,2.1827697207322498,2.1908455803621822,2.1985736757018306,2.2059689822469486,2.2130458306154828,2.2198179343174291,2.2262984163288611,2.2324998345216192,2.2384342059979421,2.244113030377199,2.2495473120798373,2.2547475816517393,2.2597239161703064]
["Commercial-Resturant-ExtLight","Restaurant Exterior Lights",0,9.2419079815394781E-2,0.18033408683841989,0.26303393344150144,0.34300339367623561,0.42039738890100381,0.49640829551587384,0.57023348351571401,0.64225909962424488,0.71126089215318677,0.77752756827771163,0.84118419801979549,0.90252162883620268,0.96034490600626621,1.016266094935812,1.0702777347946402,1.1222176054982909,1.1715531234241754,1.2190794818808448,1.2644007179337218,1.3079303250475454,1.3492916084423938,1.3891388621283927,1.427142944297304,1.4635813788934882,1.4982988286019414,1.5317553300813351,1.5635959181676726,1.5940653804512492,1.6232227606269207,1.6511245598380893,1.6778248461645666,1.7033753593956453,1.7278256112914145,1.7512229815266003,1.7736128095028547,1.7950384822074044,1.8155415182883132,1.8351616485092783,1.8539368927398672,1.8719036336303827,1.8890966871141297,1.9055493698736963,1.9212935639019895,1.9363597782831312,1.950777208312932,1.9645737920735071,1.977776264571665,1.990410209545979,2.0025001090429297,2.0140693908581939,2.0251404739350019,2.0357348118075453,2.0458729341736159,2.055574486677032,2.0648582689769523,2.0737422711778324,2.0822437086906369,2.0903790555928419,2.0981640765518894,2.1056138573739451,2.1127428342371557,2.1195648216660659,2.1260930393013862,2.1323401375170037,2.1383182219338623,2.1440388768782253,2.1495131878297689,2.154751762903016,2.1597647534037305,2.1645618735001086]
["Commercial-Resturant-Heat","Restaurant Heating",0,0.10016975719549134,0.19690562182295587,0.28800667760410875,0.3758565938132104,0.46075878079916849,0.54447342915100627,0.62577505404374001,0.70536390932801241,0.78113378699484715,0.85438177536218918,0.92451844471573752,0.99230632412594244,1.0562789855518548,1.1184638715611745,1.1781133565991082,1.2356889300628102,1.2904077288602278,1.3428821149923018,1.393256622725267,1.4415688615922422,1.4873381427329317,1.531391778218026,1.5733292682222562,1.6135997306063732,1.6518679482933425,1.6887533591336137,1.7238722985246484,1.7574789390902319,1.7896384037462927,1.8204130110726666,1.8498623960739813,1.8780436257403113,1.905011309631536,1.9308177056996938,1.9555128215543902,1.9791445113674968,2.0017585686049193,2.0233988147651325,2.0441071842964367,2.0639238058574931,2.0828870800786001,2.1010337539743964,2.118398992152192,2.1350164449539095,2.1509183136636878,2.1661354129074941,2.1806972303656824,2.1946319839141881,2.207966676305102,2.22072714749258,2.2329381247054778,2.2446232703637525,2.25580522793148,2.266505665795334,2.2767453192535676,2.2865440306968527,2.2959207880588486,2.3048937616109977,2.3134803391728629,2.3216971598062268,2.3295601460582498,2.337084534816166,2.3442849068333111,2.3511752149836886,2.3577688112998398,2.3640784728463959,2.3701164264794641,2.3758943725398165,2.3814235075257995,2.3867145457898982]
["Commercial-Resturant-HotWater","Restaurant Hot Water",0,7.6853811016908288E-2,0.14842655031678911,0.21426532556203262,0.2779477353019098,0.33984581547816184,0.40102882862853512,0.46069921244371653,0.51918975172190385,0.5751901248824971,0.62880603186692485,0.68028429075718522,0.72980774040592344,0.77653909713944258,0.82174969038421652,0.86546460062166841,0.90753886348188106,0.94750944928823022,0.98597840287997196,1.0226868716461177,1.0579701221283262,1.091492080727106,1.1237874146016165,1.1545721638051141,1.1841591121569943,1.2122435681581971,1.2393519022960369,1.2651836061096211,1.2899029399025246,1.3135578047761167,1.3361940391049127,1.3578555073621341,1.3785841851202405,1.3984202403911556,1.4174021114638018,1.4355665813897791,1.4529488492615277,1.4695825984210957,1.4855000617316871,1.5007320840384732,1.5153081819397036,1.5292566009839434,1.5426043704042687,1.5553773554954891,1.5676003077358913,1.5792969127506302,1.5904898362097106,1.6012007677495004,1.6114504630028879,1.6212587838195263,1.6306447367541088,1.6396265098972498,1.6482215081203511,1.6564463868027448,1.6643170841064709,1.6718488518612329,1.679056285119378,1.6859533504381774,1.6925534129442055,1.6988692622322707,1.7049131371490793,1.7106967495096619,1.7162313067925161,1.7215275338574481,1.7265956937281965,1.731445607480109,1.7360866732714129,1.740527884554957,1.744777847505717,1.7488447976978316,1.7527366160634918]
["C-Res-Lgt-LPD Int-All-All-C","Restaurant Interior Lights",0,8.2727958652643707E-2,0.15973835410639289,0.23072013230631921,0.29939182322729024,0.36606931806555676,0.43180363226139362,0.49581522921628574,0.55846860592688408,0.61847055596380973,0.67591375993873615,0.73106127221416595,0.78410233240769034,0.83418001249704576,0.88259418953051194,0.92939476117513053,0.97442422156457653,1.0172024788168106,1.0583860629031667,1.0976431620746856,1.135381352898658,1.1712581304050815,1.2058145740528723,1.2387634603786528,1.2704170844830449,1.3004808946516304,1.3294895823878183,1.3571353107271056,1.3835905531570456,1.4089065746211029,1.4331324324814447,1.4563150715822504,1.4784994152193849,1.4997284521927194,1.520043320109786,1.5394833851021941,1.5580863181092834,1.5758881678768328,1.5929234308122868,1.60922511783186,1.6248248183290595,1.6397527613885803,1.6540378743641981,1.6677078389341677,1.6807891447427508,1.6933071407318256,1.705286084262041,1.716749188118706,1.7277186654935053,1.7382157730291985,1.7482608520107228,1.7578733677825167,1.7670719474684435,1.7758744160674169,1.784297830994664,1.7923585151355703,1.8000720884761505,1.8074534983714425,1.814517048510478,1.8212764266339569,1.8277447310583386,1.8339344960577471,1.8398577161528746,1.8455258693539536,1.8509499394028333,1.8561404370572634,1.8611074204586318,1.865860514622621,1.8704089300905531,1.8747614807775694,1.8789266010522261]
["Commercial-Resturant-Misc","Restaurant Other",0,8.1758172253020622E-2,0.15806828578728133,0.22857414362722517,0.29679891878524689,0.36303350862668787,0.42833870275178015,0.49193745797224669,0.55418366751509884,0.61380711415515632,0.67091246132505267,0.72574914844448735,0.77851205442117999,0.82829469045571325,0.87643348253653197,0.922980487016688,0.96776434709376413,1.0102997685565795,1.0512626830503371,1.0903056669187541,1.1278363305773842,1.1635098698804396,1.1978781338365871,1.2306474835384531,1.2621205888026481,1.2920254598416199,1.320879464778506,1.3483689454502845,1.3746746685811733,1.3998476093762822,1.423936547936195,1.4469881637830015,1.4690471263158305,1.4901561813711695,1.5103562340557044,1.5296864280121971,1.5481842212719987,1.5658854588411868,1.5828244421609841,1.5990339955770581,1.6145455299465068,1.6293891035057879,1.6435934801175403,1.6571861850091691,1.6701935581112064,1.682640805098802,1.694552046235257,1.7059503631122475,1.7168578433773101,1.7272956235352648,1.7372839299065133,1.7468421178215836,1.755988709127871,1.7647414280812561,1.773117235692151,1.7811323625925288,1.7888023404876272,1.7961420322532715,1.8031656607371418,1.8098868363197926,1.8163185832888367,1.8224733650773954,1.8283631084157292,1.8339992264428429,1.8393926408228558,1.844553802908993,1.8494927139962054,1.8542189447016717,1.8587416535107304,1.8630696045241837,1.8672111844413639]
["Commercial-Resturant-Motors","Restaurant Motors",0,7.9582126812298551E-2,0.1535466575314377,0.2215968129956695,0.28746731403291209,0.3514655409182601,0.41463184295148819,0.47618574966497745,0.53648470009818305,0.59423709161552163,0.64952468709724376,0.70261177948462694,0.75368103228472727,0.80187192940571361,0.84847744071926767,0.89355012297365255,0.93692533878250717,0.9781204149474847,1.0177901818652639,1.0555937549220171,1.0919446535131767,1.1264938110219773,1.1597798578359717,1.191513929202126,1.2220035865412655,1.2509545821618147,1.2788994372794851,1.305526873839618,1.3310076743756303,1.3553912155584174,1.3787247477907492,1.4010534867690574,1.4224207011023666,1.4428677961581649,1.4624343942976847,1.481158411656077,1.4990761316162611,1.5162222751188292,1.5326300679442535,1.5483313050977696,1.5633564124217085,1.5777345055546643,1.5914934463517514,1.6046598968752794,1.6172593710604737,1.6293162841563535,1.6408540000375782,1.6518948764789416,1.6624603084802463,1.6725707697255139,1.6822458522568704,1.6915043044399867,1.7003640672946434,1.7088423092608223,1.7169554594676917,1.7247192395699593,1.7321486942132776,1.7392582201877449,1.746061594325991,1.7525720001999106,1.7588020536677764,1.7647638273212365,1.7704688738795715,1.7759282485765429,1.7811525305832141,1.786151843508258,1.7909358750154774,1.7955138955965482,1.7998947765353721,1.8040870070988402,1.8080987109873261]
["Commercial-Resturant-OffEquip","Restaurant Office Eqpmt",0,8.1244754947174952E-2,0.15682284237677505,0.22642238871283413,0.29377168507469148,0.35918516399838601,0.42371073191209058,0.48656528584187375,0.54811290995699624,0.60705587343476219,0.66348369720739586,0.71765911240330027,0.76976866240775643,0.81895723955580135,0.86652082028280975,0.9125062602351709,0.9567559729729036,0.99878909563115637,1.0392587258062842,1.0778326309167374,1.1149179201083739,1.1501697633070098,1.1841275524046804,1.2165036075357953,1.2476093385436409,1.2771480772028285,1.3056548009564672,1.332820460131229,1.3588163062314791,1.3836927139829149,1.4074978888646714,1.4302779605218547,1.452077072155523,1.4729374660633394,1.4928995654966566,1.5120020529926539,1.5302819453333212,1.5477746652765434,1.5645141101982873,1.5805327177789037,1.5958615288608329,1.6105302475995213,1.6245672990241034,1.6379998841193975,1.6508540325359466,1.6631546530302521,1.6749255817329367,1.6861896283383766,1.6969686203053047,1.7072834451540397,1.7171540909423029,1.7265996849980572,1.7356385309844249,1.7442881443685088,1.7525652863628474,1.7604859964052766,1.7680656232401375,1.7753188546610568,1.7822597459729412,1.7889017472283331,1.7952577292909089,1.8013400087766274,1.8071603719208555,1.812730097417725,1.818059978275973,1.8231603427336265,1.8280410742720512,1.8327116307681512,1.8371810628218355,1.8414580312942606,1.8455508240908396]
["Commercial-Resturant-Process","Restaurant Process",0,7.5633966773384034E-2,0.14469952266003389,0.20707653255558867,0.26747093622948015,0.32630516977485829,0.38454877418867967,0.44140024427499563,0.49725976118989018,0.5507060491828516,0.60176142847748992,0.65071381191711142,0.69773662259177494,0.74220113174064706,0.78520441116313644,0.8267743032160545,0.86682061798853471,0.90488180902486248,0.94148345688712809,0.97637942626674368,1.0099476514154813,1.0418537127649292,1.0725801536261095,1.1018654470234397,1.1300488812577487,1.1567289806945695,1.182513469571246,1.2071138438673625,1.2306548719019239,1.2531821714565281,1.2747393959106947,1.2953683188333422,1.3151089149315696,1.3339994375136053,1.3520764926160318,1.369375109938928,1.3859288107263885,1.4017696727239584,1.4169283923388576,1.4314343441234505,1.4453156376972234,1.4585991722175802,1.4713106885050029,1.4834748189235893,1.4951151351136243,1.5062541936686815,1.5169135798457698,1.5271139493932226,1.5368750685773882,1.5462158524856806,1.5551544016802188,1.5637080372730783,1.5718933344911257,1.5797261547954771,1.5872216766178229,1.5943944247731781,1.6012582986060535,1.6078265989245948,1.6141120537748734,1.6201268431052835,1.6258826223688339,1.6313905451090738,1.6366612845734179,1.6417050543957568,1.6465316283884255,1.6511503594818884,1.6555701978488386,1.659799708247834,1.6638470866200783,1.6677201759715083,1.671426481570963]
["Commercial-Resturant-Refrig","Restaurant Refrigeration",0,7.2823134523483893E-2,0.14091722394607042,0.2038643140895893,0.2648759974783943,0.32418751352588654,0.38285361301350401,0.44009189546808503,0.49622959220632157,0.55003394725791066,0.60159538776814248,0.65115378644096356,0.69889197472764419,0.74382819027272318,0.78733227558104457,0.82946541045988209,0.87001380563138619,0.90848714196169056,0.9455833152960671,0.98091636823060424,1.01489687256507,1.0471661068840017,1.0782848770262519,1.1079470446287636,1.1364318234262176,1.1635009812418733,1.1896388530704087,1.2145136149625912,1.2383172148594166,1.2610957793539863,1.2828934487267802,1.30375246248065,1.3237132411924872,1.3428144648401783,1.361093147756629,1.3785847103561035,1.3953230477718686,1.4113405955381508,1.4266683924436843,1.4413361406786442,1.4553722633915247,1.4688039597674869,1.481657257734915,1.4939570644023099,1.5057272143232623,1.5169905156830252,1.5277687944961955,1.5380829369011433,1.5479529296331507,1.5573978987546888,1.5664361467178831,1.5750851878309877,1.5833617821975952,1.5912819681943486,1.5988610935500935,1.6061138450866916,1.6130542771791299,1.6196958389900755,1.6260514005316504,1.6321332776049278,1.6379532556654803,1.6435226126612243,1.6488521408868166,1.6539521678969529,1.6588325765190928,1.6635028240043941,1.6679719603539649,1.6722486458559465,1.6763411678674121,1.6802574568735993,1.6840051018555966]
["Commercial-Resturant-Vent","Restaurant Ventilation",0,7.9237369431645707E-2,0.15296342606682015,0.22093957401755276,0.28676679478368716,0.35070797315344493,0.41378757483290296,0.47524941870409126,0.5354307322448818,0.59310745248301433,0.64831939390825399,0.70135821585501235,0.75239260192062585,0.80052405787549707,0.84705722817389706,0.89209597600970414,0.9354163266539125,0.97654907205768882,1.0161831164468234,1.0539285109969727,1.090229393089958,1.1247321695403163,1.1579827460637637,1.1896867884730682,1.2201376705874321,1.2490715711217288,1.2769966833100403,1.3035949745837012,1.3290478848934246,1.3534047368644517,1.376712729181224,1.3990170280489489,1.4203608547166282,1.440785569231154,1.4603307505847669,1.4790342734111908,1.4969323813790605,1.5140597574248689,1.5304495909615277,1.54613364219278,1.5611423036580934,1.5755046591272928,1.5892485399590623,1.6024005790325264,1.6149862623564153,1.6270299784558304,1.6385550656323042,1.6495838571887385,1.6601377247068574,1.6702371194610381,1.6799016120487709,1.6891499303145439,1.6979999956406424,1.7064689576751866,1.7145732275647025,1.7223285097556269,1.7297498324263678,1.736851576608895,1.7436475040562895,1.7501507839102555,1.7563740182202707,1.7623292663638259,1.7680280684150753,1.7734814675071797,1.7787000312316814,1.7836938721163724,1.7884726672213396,1.7930456768911647,1.7974217626996096,1.8016094046215667,1.8056167174655449]
["Commercial-Retail-AirComp","Retail Compressed Air",0,7.6037796046854733E-2,0.14634204606359297,0.21064259269196717,0.27290228397162342,0.3334685494951517,0.39336126813284378,0.45177929929983907,0.50909488815827286,0.56397706450651441,0.6164788912416288,0.66688477853203776,0.71535596551155356,0.76110974094381234,0.80536948448933476,0.84818010497346785,0.88939297997037536,0.92854061874636773,0.96622753501354075,1.002143412933338,1.0366911427529752,1.069518867562586,1.1011469124805444,1.1312944974653203,1.1602769688765551,1.1877666837682543,1.2143180254803423,1.2396216070009878,1.2638355606092613,1.2870068080812933,1.3091802506382617,1.330398855955935,1.3507037414273924,1.3701342538402705,1.3887280456229287,1.406521147807291,1.4235480398497427,1.4398417164453903,1.4554337514651488,1.4703543591395587,1.4846324526078936,1.4982956999460133,1.5113705777815343,1.523882422600215,1.5358554798429713,1.5473129508886714,1.5582770380137432,1.5687689874157258,1.5788091303841303,1.5884169226983926,1.5976109823292659,1.6064091255167046,1.6148284012941576,1.62288512452617,1.6305949075233113,1.637972690295695,1.6450327695037181,1.6517888261621132,1.658253952151008,1.6644406755853571,1.6703609850919112,1.6760263530407669,1.6814477577765139,1.6866357048920613,1.691600247586365,1.6963510061455072,1.7008971865848779,1.705247598488582,1.7094106720806432,1.7133944745610847,1.7172067257385406]
["Commercial-Retail-Cook","Retail Cooking",0,7.6983227760781148E-2,0.14822427127165536,0.21345060355371304,0.27660381137809359,0.33802159817986638,0.39872983472921142,0.45793019369891375,0.51599505122943445,0.57159454146534916,0.62478999329537621,0.67586108930036637,0.72497552556160449,0.77133667061950428,0.81618290123619841,0.85955620524550302,0.90130809061401918,0.94096525219883653,0.97914510227141582,1.0155307431029108,1.0505277487470377,1.0837846373777711,1.1158249063384393,1.1463661621113486,1.1757249215694974,1.2035765816298141,1.2304736122373219,1.2561065812116152,1.2806357381248143,1.3041086155537132,1.3265706992177313,1.3480655161210977,1.3686347188994388,1.3883181665342148,1.407154001591417,1.4251787241341942,1.4424272624526413,1.4589330407478061,1.4747280439010737,1.4898428794544398,1.504306836921776,1.5181479445460209,1.5313930236122841,1.5440677404221053,1.5561966560295895,1.5678032738357948,1.5789100851335987,1.5895386126913056,1.5997094524594464,1.6094423134815907,1.6187560560865135,1.6276687284357221,1.6361976014971655,1.6443592025129008,1.6521693470255663,1.6596431695257248,1.6667951527794647,1.6736391558930916,1.6801884411692893,1.6864556998067994,1.6924530764934118,1.6981921929399306,1.7036841704007144,1.708939651224431,1.7139688194767915,1.7187814206752223,1.7233867806737206,1.7277938237344848,1.7320110898213406,1.736046751148475,1.7399086280165463]
["Commercial-Retail-Cool","Retail Cooling",0,0.10889974461989302,0.20780892873067378,0.29793211608478609,0.38514122811433171,0.46958027422888665,0.55202208799134533,0.63199936518835731,0.70980645955792065,0.78450103668551063,0.85571960543117798,0.92404650559231805,0.98955986254994499,1.0516088423993937,1.1112919080590453,1.1690764700263543,1.2245248971215508,1.2771906998591962,1.3279436803143092,1.3760825008913113,1.422402622460416,1.4666403624964819,1.509201703922068,1.5498430013024982,1.5888788751482741,1.6259970312464747,1.6617558557450411,1.6959179605890011,1.7286089700090588,1.7598922326119846,1.7898283690741146,1.818475389612038,1.8458888063947398,1.8721217411150286,1.8972250279287024,1.9212473119609257,1.944235143570709,1.9662330685561475,1.9872837144752278,2.0074278732494668,2.0267045802104611,2.045151189742513,2.0628034476679216,2.0796955605152028,2.0958602618044671,2.1113288754784039,2.1261313766017884,2.1402964494471326,2.1538515430790408,2.1668229245449817,2.1792357297755474,2.191114012292835,2.2024807898213399,2.2133580888916793,2.2237669875235833,2.2337276560708599,2.2432593963074883,2.2523806788305776,2.2611091788526725,2.2694618104527633,2.2774547593523717,2.2851035142802267,2.2924228969863081,2.2994270909634196,2.306129668931947,2.3125436191410644,2.318681370537349,2.3245548168495831,2.3301753396364098,2.3355538303415071,2.3407007113990166]
["Commercial-Retail-ExtLight","Retail Exterior Lights",0,9.4182905648806631E-2,0.18374120785667936,0.26800041092531446,0.34945476060493119,0.42826908219605225,0.50562641024850763,0.58074216683029234,0.65399010986408346,0.72416991162738886,0.79155175599180272,0.85627783450660022,0.9186314561205069,0.97742928821850972,1.0342714577614172,1.0891732164400627,1.1419581939102281,1.1921030910228783,1.2404052524208573,1.2864665041602676,1.3307016384035737,1.3727456777143716,1.4132458278125173,1.4518769550672592,1.4889155896012622,1.5242097820593516,1.5582152320415945,1.5905836703712446,1.6215582525048808,1.6511990009581217,1.6795633535449548,1.7067062746806803,1.7326803618919007,1.7575359477399588,1.7813211973553251,1.8040822017719438,1.8258630672423923,1.8467060007069365,1.8666513915820981,1.8857378900272288,1.9040024818407513,1.9214805601312031,1.9382059939019707,1.9542111936826092,1.969527174333938,1.9841836151486067,1.9982089173636006,2.011630259196131,2.0244736485095571,2.0367639732114005,2.0485250494811069,2.0597796679210174,2.0705496377199748,2.0808558289151495,2.0907182128339765,2.1001559007945767,2.1091871811396485,2.1178295546756027,2.1260997685856067,2.1340138488822613,2.1415871314627921,2.1488342918269359,2.155769373515112,2.1624058153219794,2.1687564773381198,2.1748336658703122,2.1806491572886775,2.1862142208469222,2.1915396405198835,2.196635735900708,2.201512382198147]
["Commercial-Retail-Heat","Retail Heating",0,9.8138224468251392E-2,0.19279215182771425,0.28187967318753337,0.36790949143668145,0.45110971523709203,0.5331684525816387,0.61286738548653075,0.69095087192045201,0.7653134689054587,0.83718312893137314,0.9060519281317343,0.97262305733716314,1.0354456503585339,1.096507002736262,1.1551363216084127,1.2117117427349491,1.2654830125753214,1.3170588470338158,1.366521633492813,1.4139658558427908,1.4589329172354863,1.5022146211959886,1.5434223013593549,1.5829811887662286,1.6205671980776672,1.6568184817527574,1.6913175805339686,1.72433107219063,1.7559229302352819,1.7861543733402119,1.8150839839669395,1.8427678218872527,1.8692595328157822,1.8946104523646141,1.918869705521391,1.942084301843666,1.9642992265539765,1.9855575277121686,2.0059003996338838,2.0253672627168648,2.0439958398297646,2.0618222294114874,2.0788809754227056,2.095205134285115,2.1108263389381388,2.125774860137204,2.1400796651123866,2.1537684737010774,2.1668678120634612,2.1794030640848816,2.1913985205647091,2.2028774262870323,2.2138620250643752,2.2243736028417369,2.2344325289444753,2.2440582955499666,2.2532695554595277,2.2620841582437965,2.2705191848316137,2.2785909806094291,2.2863151870953771,2.293706772249394,2.3007800594781185,2.3075487553907736,2.314025976359821,2.3202242739378574,2.3261556591799972,2.3318316259188872,2.3372631730374422,2.3424608257824704]
["Commercial-Retail-HotWater","Retail Hot Water",0,7.4746422559689218E-2,0.14442166557124175,0.20853142136605327,0.27055429072945136,0.330858118394523,0.39051757445870477,0.44872985299464452,0.50582048534163748,0.56048315866781828,0.61282820807870297,0.66309542646410014,0.71146619839781011,0.75708704391340886,0.80123758398195544,0.84393873905009709,0.88504207789219336,0.92408405764305812,0.96166454742144758,0.997528094392376,1.0319997222335611,1.064742786162135,1.0962935588402078,1.1263661324451228,1.1552682810492101,1.1827026509010641,1.20918762133652,1.2344198536692195,1.258565530542616,1.2816714414262491,1.303782360932118,1.3249411355788825,1.3451887668198055,1.3645644904953298,1.3831058528642526,1.4008487833608294,1.4178276642187977,1.4340753970972364,1.4496234668373691,1.4645020024738598,1.4787398356188268,1.4923645563317141,1.5054025665832806,1.5178791314173157,1.5298184279092153,1.5412435920162961,1.5521767634106323,1.5626391283812886,1.5726509608890937,1.5822316618535004,1.5913997967476696,1.6001731315746257,1.608568667294201,1.6166026727674787,1.624290716282577,1.6316476957228625,1.6386878674360543,1.6454248738601613,1.6518717699597854,1.6580410485240187,1.66394466437496,1.6695940575337553,1.6750001753890618,1.6801734939108861,1.6851240379509094,1.689861400668635,1.694394762121004,1.6987329070515007,1.7028842419132202,1.7068568111588847,1.7106583128293769]
["C-Ret-Lgt-LPD Int-All-All-C","Retail Interior Lights",0,7.6701889239977131E-2,0.14795803685608222,0.21343839726913424,0.27684716552749061,0.33849088515698594,0.39941085231283086,0.45881278060972008,0.51705832639729032,0.57284188496747113,0.62624634763645759,0.67753104595155678,0.72687531875451683,0.77341929200499171,0.81845223070366846,0.86201518513787623,0.90394649937662286,0.94376356490462732,0.98211157286613271,1.0186554712103846,1.0537994469683869,1.0871915013815479,1.1193689997241671,1.1500416069079318,1.179516000772505,1.2074944930233145,1.2345094305998394,1.2602455852845698,1.2848734845044072,1.3084408521788928,1.3309933571305537,1.3525747015819036,1.373226705841569,1.3929893893436409,1.4119010481972982,1.4299983293969702,1.4473163018368478,1.4638885242673527,1.4797471103252522,1.4949227907634335,1.5094449730009274,1.5233417981085773,1.5366401953407782,1.5493659343189607,1.5615436749679392,1.5731970153018899,1.5843485371525605,1.5950198499283217,1.6052316324888589,1.6150036732166457,1.6243549083628532,1.6333034587419992,1.6418666648464451,1.6500611204487854,1.6579027047572452,1.6654066131863934,1.6725873868028032,1.6794589405027167,1.6860345899763181,1.6923270775108652,1.6983485966826803,1.7041108159858527,1.7096249014434339,1.7149015382449471,1.7199509514521367,1.7247829258130838,1.7294068247230809,1.7338316083690113,1.7380658510923894,1.7421177580047134,1.7459951808873198]
["Commercial-Retail-Misc","Retail Other",0,7.6803793839355303E-2,0.14816035300965871,0.21374039900794192,0.2772455446898302,0.33898021377592513,0.39998655327228461,0.45947067789733248,0.51779424890561765,0.57365339051833608,0.62713128582173805,0.67848693665252224,0.72790035585093038,0.7745090618617182,0.81960380696502055,0.86322715377426218,0.90521547191303564,0.94508668872483825,0.98348708043130217,1.0200803657241793,1.0552720180492734,1.0887092032917267,1.1209304540925376,1.1516448789865299,1.1811590175397999,1.2091762340285577,1.2362282276547045,1.2619992088292404,1.2866604348335813,1.3102596941678786,1.3328427174542874,1.3544532660537218,1.3751332168665777,1.394922643481751,1.4138598938311988,1.431981664500527,1.4493230718395971,1.4659177200109561,1.4817977661079502,1.49699398246871,1.5115358163067578,1.5254514467737894,1.5387678395652069,1.5515107991742187,1.5637050188957615,1.5753741286771419,1.586540740908128,1.5972264942392154,1.607452095512983,1.617237359889794,1.6266012492455943,1.6355619089162163,1.6441367028593956,1.652342247302629,1.6601944429420872,1.6677085057549654,1.6748989964849927,1.6817798488582247,1.6883643965838053,1.6946653991920164,1.7006950667596825,1.7064650835708461,1.7119866307585627,1.7172704079716887,1.7223266541086515,1.7271651671583763,1.7317953231868213,1.7362260945059074,1.7404660670600569,1.7445234570640276,1.7484061269242865]
["Commercial-Retail-Motors","Retail Motors",0,7.7078263162575919E-2,0.1485601313938166,0.21414152623373214,0.27763924395151712,0.33937685426572173,0.40038826702106406,0.45987935100947436,0.51821531204750104,0.57407930516015837,0.62754652085421858,0.67888281954816532,0.72826416363541113,0.77486058711861439,0.81993828591110396,0.86353869242351067,0.90550755662370808,0.94536625416537901,0.98374602156434066,1.0203231973506623,1.0554992779990142,1.088925658930449,1.1211323768478696,1.1518330610557046,1.1813389501084781,1.2093398439369702,1.2363772348470803,1.2621404477209412,1.2867942399447316,1.3103863856134306,1.3329626015643385,1.3545666359671213,1.375240353098971,1.395023814469162,1.4139553564502061,1.4320716645660376,1.4494078445811875,1.4659974905286994,1.4818727498086151,1.4970643854831753,1.5116018358894534,1.5255132716849347,1.5388256504365914,1.5515647688592293,1.5637553128043373,1.5754209050963071,1.586584151308718,1.5972666835693983,1.6074892024791403,1.6172715172253049,1.6266325839680462,1.6355905425735402,1.6441627517654005,1.6523658227623959,1.6602156514676549,1.6677274492717302,1.6749157725292187,1.6817945507660499,1.6883771136721084,1.6946762169314946,1.7007040669404765,1.7064723444610332,1.7119922272558243,1.7172744117484477,1.7223291337509579,1.7271661882988145,1.7317949486316917,1.7362243843569329,1.7404630788308479,1.7445192457915324,1.7484007452754411]
["Commercial-Retail-OffEquip","Retail Office Eqpmt",0,7.5575388382080819E-2,0.14572407066829673,0.21012123027729532,0.27248795694469485,0.33313543121563971,0.3931010128794617,0.45158946882747486,0.5089591358545752,0.56390468165064789,0.61650277306344303,0.66701478689011029,0.71561574327479216,0.76145247811156647,0.80580489164841651,0.84871670665140264,0.8900238644411439,0.92924608321989455,0.96702235043160467,1.0030199921190963,1.0376414356009569,1.0705344140838451,1.1022336822183303,1.1324489573103147,1.1614866586388122,1.189046082686064,1.2156597911272218,1.2410133354851731,1.2652751004210114,1.2884921003596128,1.3107093251812409,1.3319698274028948,1.3523148056054342,1.3717836842681512,1.3904141901654881,1.4082424254739445,1.4253029377308408,1.441628786780502,1.4572516088375942,1.4722016777917495,1.4865079638722809,1.500198189786665,1.513298884441578,1.5258354343505858,1.5378321328281048,1.5493122270649655,1.5602979631767937,1.5708106293125144,1.5808705969065056,1.5904973601543442,1.5997095737886393,1.6085250892281562,1.6169609891702774,1.6250336206938387,1.6327586269364811,1.6401509774079093,1.6472249969977926,1.6539943937345232,1.6604722853486191,1.6666712246922519,1.6726032240641491,1.6782797784870174,1.6837118879825852,1.6889100788874345,1.6938844242509268,1.6986445633547471,1.7031997203918958,1.7075587223413204,1.7117300160728273,1.7157216847154175,1.7195414633207671]
["Commercial-Retail-Process","Retail Process",0,7.9268161172484961E-2,0.15303930546277858,0.22094861529897597,0.2866756927505355,0.35053603142548878,0.41358476668605199,0.47502878392305387,0.53523065035387585,0.59287920205348965,0.64807832927487208,0.70107430916815117,0.75206177871475266,0.80017462426310404,0.84671717211494024,0.89171643403586021,0.93502738575136657,0.97616331496299047,1.0157724362849714,1.0535319356555546,1.0898355280078085,1.1243327872590128,1.1575684257246412,1.1892525568129253,1.2196953567818982,1.2485999837119919,1.2764998038678832,1.3030833001348028,1.3285220525433381,1.3528653562835633,1.3761603837861711,1.3984522761331641,1.4197842305322008,1.4401975840241017,1.4597318935857295,1.4784250127834595,1.4963131651257848,1.5134310142571967,1.5298117311293609,1.5454870582797575,1.5604873713423377,1.5748417379094004,1.5885779738587427,1.6017226972552425,1.6143013799313186,1.6263383968462242,1.6378570733198181,1.6488797302323479,1.6594277272778313,1.6695215043548486,1.6791806211749609,1.6884237951654992,1.6972689377401768,1.7057331890078109,1.7138329509864081,1.7215839193869795,1.7290011140286747,1.7360989079441724,1.7428910552317303,1.7493907177078623,1.7556104904122944,1.7615624260146221,1.7672580581699595,1.7727084238688471,1.7779240848247204,1.7829151479403884,1.787691284893181,1.7922617508767145,1.7966354025355982,1.8008207151278315,1.8048257989481504]
["Commercial-Retail-Refrig","Retail Refrigeration",0,7.258768224872629E-2,0.14041540610391576,0.20309798634153475,0.26385157516122248,0.32291642451979735,0.38133544620086518,0.4383368329341325,0.49423610191575862,0.54782211815973381,0.59915980137127534,0.64850980127270985,0.69603964509992666,0.74078124188535632,0.7840861099091373,0.82603791762404977,0.86640507981663184,0.90470760003512485,0.94164074839814416,0.97681518289981062,1.0106421612440821,1.0427718446149108,1.073755277414022,1.1032905548099665,1.1316535033655319,1.1586080646560257,1.1846346988974188,1.209404672057163,1.2331079956550044,1.2557906019687282,1.2774964453311433,1.2982675873047462,1.3181442781885768,1.3371650350152091,1.3553667161890199,1.3727845929103699,1.3894524175241019,1.4054024889248025,1.4206657151455684,1.4352716732515649,1.449248666654432,1.4626237799586113,1.475422931445864,1.4876709232996943,1.4993914896669962,1.5106073426500601,1.5213402163180638,1.5316109088233305,1.5414393227039684,1.5508445034509908,1.5598446764146483,1.5684572821214975,1.5766990100706355,1.5845858310745953,1.5921330282075712,1.5993552264209452,1.606266420883504,1.6128800041012641,1.6192087918694553,1.6252650481069588,1.6310605086213161,1.6366064038503663,1.641913480624577,1.6469920229922428,1.6518518721479039,1.6565024455026034,1.6609527549329379,1.6652114242442628,1.6692867058818943,1.6731864969226899,1.6769183543779966]
["Commercial-Retail-Vent","Retail Ventilation",0,7.9976928675659614E-2,0.15425191120307605,0.22259744976732743,0.28877181442123268,0.35305616557708941,0.41647718002017375,0.47826813056231726,0.53878225224110177,0.59676013193115329,0.65225280851278444,0.70554598654238676,0.75681291915220095,0.80518614514412101,0.85195430262047611,0.89720329907733709,0.94073411216308478,0.98207308625370959,1.0218923449704325,1.0598206589757706,1.0962967810080884,1.1309701375832075,1.1643786323705747,1.1962320281128247,1.2268330896220907,1.2558976112727882,1.2839506448711897,1.3106783832292042,1.3362551663469215,1.3607305568901917,1.3841519832473881,1.4065648314360928,1.4280125330520781,1.4485366494310115,1.4681769521859716,1.4869715002768424,1.5049567137609294,1.5221674443677113,1.538637043034488,1.5543974245337961,1.5694791293178227,1.5839113826996667,1.59772215148612,1.6109381981717215,1.6235851327990911,1.6356874625860476,1.6472686394156713,1.6583511052813398,1.6689563357748025,1.6791048817015612,1.6888164089042008,1.6981097363708417,1.7070028727025557,1.7155130510104157,1.7236567623098034,1.7314497874766814,1.7389072278277609,1.7460435343838179,1.7528725358728678,1.7594074655274607,1.7656609867280284,1.7716452175419686,1.7773717542060261,1.7828516935974688,1.7880956547376052,1.7931137993693147,1.7979158516484628,1.8025111169873602,1.8069085000867839,1.8111165221914953,1.8151433376027026]
["Commercial-School-AirComp","School Compressed Air",0,7.402846966671639E-2,0.14292729734374424,0.20623218124147832,0.26751314018134015,0.327127580849221,0.38613259331246297,0.44369177451957542,0.5001809970515958,0.55428005344904074,0.60605533176028448,0.6557719103457047,0.7036017334521133,0.7487388643460412,0.79241641432957632,0.8346605194523532,0.87531327997258568,0.91393993467786472,0.95112510046481202,0.98660064955826665,1.0207116635912004,1.0530977164143613,1.0843027017455258,1.1140425819594422,1.1426341104367175,1.1697617967079053,1.1959614419579656,1.2209107029521256,1.2447855938556283,1.2676323794092192,1.2894953320920814,1.3104168179130022,1.3304373785071848,1.3495958096977902,1.3679292366744462,1.3854731859344038,1.4022616541257509,1.418327173926083,1.4337008770842956,1.448412554747657,1.4624907151910649,1.4759626390603549,1.488854432236709,1.5011910764246075,1.5129964775613522,1.5242935121419696,1.535104071549259,1.5454491044748946,1.5553486575137805,1.5648219140103219,1.5738872312318926,1.5825621759415296,1.59086355843879,1.598807465134733,1.6064092897241522,1.6136837630154623,1.6206449814760462,1.6273064345483752,1.6336810307898384,1.6397811228869323,1.6456185315922855,1.6512045686309007,1.6565500586200064,1.6616653600449878,1.6665603853320514,1.6712446200565143,1.6757271413239427,1.6800166353597594,1.6841214143414023,1.6880494325056539,1.691808301562354]
["Commercial-School-Cook","School Cooking",0,7.6920559400997388E-2,0.14840801240675275,0.21393078656700748,0.27728814507900518,0.33891807471610913,0.39989144858954156,0.45932949137487628,0.51765759207029816,0.5734764297615319,0.62684629552742777,0.67805780114263225,0.72728162879316438,0.77382970075081903,0.81885906289602639,0.86234763024573868,0.90420390516559135,0.94402006447008779,0.98230655166186187,1.0188710144994637,1.0540256481683226,1.0873956380359087,1.1195315336003708,1.1501584784178491,1.1796169466744395,1.2075472927804547,1.2345202332219778,1.2602176192634786,1.2848084193031926,1.3083402853699044,1.33085881749116,1.3524076520569546,1.373028546378289,1.3927614596044466,1.4116446301557934,1.429714649822154,1.447006534670346,1.4635537928982809,1.4793884897671181,1.4945413097372973,1.5090416159288562,1.5229175070212571,1.5361958717029807,1.5489024407764,1.5610618370189069,1.5726976228969038,1.5838323462251307,1.5944875838597974,1.604683983510196,1.6144413037498122,1.6237784523044685,1.6327135226916998,1.6412638292823514,1.6494459408523532,1.6572757126896753,1.6647683173186916,1.6719382739014825,1.6787994763730529,1.685365220364986,1.691648228969707,1.6976606773952769,1.703414216558502,1.7089199956620666,1.7141886837994491,1.7192304906294802,1.7240551861606104,1.7286721196832231,1.7330902378866799,1.7373181021962083,1.7413639053632208,1.7452354873412235]
["Commercial-School-Cool","School Cooling",0,8.6780300672879451E-2,0.16395486355448943,0.23278605437871397,0.2995657944332108,0.36447877461757022,0.42823820664995454,0.49031078295392921,0.55102817086239275,0.60934949254632531,0.66482112967950691,0.71803107876068717,0.76898919046001579,0.81719101820966589,0.86359741598153561,0.9086613600716017,0.95193591507798714,0.99298497545751019,1.0325734993504094,1.0700451434292295,1.1061172489065947,1.1406154182972368,1.1738270358998493,1.2055207943740427,1.2360269879653638,1.264941874871838,1.2928484798447377,1.3195255467097926,1.345053840360563,1.3694828295000561,1.3928598526000495,1.4152302096335361,1.4366372498569682,1.4571224558124056,1.4767255237123458,1.4954844403630061,1.5134355567751212,1.5306136586048964,1.5470520335616194,1.5627825359125502,1.5778356482100917,1.5922405403608491,1.6060251261510474,1.6192161173378405,1.6318390754113266,1.643918461127581,1.6554776819086858,1.666539137201609,1.6771242618838322,1.6872535677998355,1.6969466835089293,1.7062223923214592,1.7150986686970859,1.7235927130756761,1.7317209852082982,1.7394992360529129,1.7469425382965633,1.7540653155632144,1.7608813703638375,1.7674039108429027,1.7736455763731085,1.7796184620479465,1.7853341421195619,1.7908036924273278,1.7960377118605966,1.8010463428972174,1.8058392912576202,1.810425844712551,1.8148148910809061,1.8190149354525376,1.8230341166694097]
["Commercial-School-ExtLight","School Exterior Lights",0,9.0038755835159481E-2,0.17586533391141621,0.25671635139657434,0.33492161070120074,0.4106196184462067,0.48500610577586917,0.55727395803563207,0.62780742138697221,0.69538669717344348,0.7603095605948258,0.82269232834352546,0.88282190532599492,0.93947321738169065,0.99427986875996821,1.0472298940228006,1.0981537586904329,1.1465138987520997,1.1931108536201036,1.2375440303526826,1.2802174247730529,1.3207607526697911,1.3598257454976301,1.397081301204524,1.4327982761006117,1.4668329277427117,1.4996359952679434,1.5308447439422239,1.5607095752094777,1.5892883611111559,1.6166364815912311,1.6428069318113985,1.6678504248450514,1.6918154899490259,1.7147485666035465,1.7366940945026095,1.7576945996691771,1.7777907768620644,1.7970215684342057,1.8154242397951064,1.8330344516237196,1.8498863289716745,1.8660125273907704,1.8814442962128715,1.8962115391048344,1.9103428720158038,1.9238656786291717,1.9368061634266527,1.9491894024673044,1.9610393919798896,1.9723790948627467,1.9832304851812699,1.9936145907492349,2.003551533876474,2.01306057036187,2.0221601268072256,2.0308678363243118,2.0392005727042988,2.0471744831157697,2.054805019394689,2.0621069679869564,2.0690944786015661,2.0757810916299011,2.0821797643842883,2.088302896206669,2.0941623524960282,2.0997694877011566,2.1051351673232888,2.1102697889712627,2.1151833025099935,2.1198852293413148]
["Commercial-School-Heat","School Heating",0,9.946095641004335E-2,0.19541398690744391,0.28562477326636315,0.37261022063318738,0.4567235621484329,0.53969996008501608,0.62028700699194705,0.69920061584071069,0.77432371323194937,0.84689093818123418,0.91638182256959977,0.98351513490088172,1.0469408820114185,1.1085700391973492,1.1676651326433241,1.2247021918318166,1.2789490422680796,1.3309487900134298,1.3808862647592648,1.4287961802798634,1.4741557294393433,1.5178092846355504,1.5593675582040205,1.5992762380569538,1.6371842931117535,1.6737378096602611,1.7085353829505472,1.7418344961469931,1.773699676239286,1.8041926715429155,1.8333725713550011,1.8612959204574755,1.888016828689508,1.9135870758015012,1.9380562117938391,1.9614716529348326,1.983878773643917,2.00532099441816,2.0258398659724599,2.0454751497564789,2.0642648950043441,2.0822455124664159,2.0994518449660062,2.1159172349177675,2.1316735889385918,2.1467514396762222,2.1611800049753902,2.1749872444961253,2.1881999138939578,2.2008436166670036,2.2129428537703966,2.2245210710942174,2.2356007048969166,2.246203225282275,2.2563491778041489,2.2660582232796265,2.2753491758877389,2.2842400396275595,2.292748043206335,2.3008896734252589,2.3086807071275786,2.3161362417709466,2.3232707246832605,2.3300979810586804,2.3366312407480776,2.3428831638958263,2.3488658654726193,2.3545909387518469,2.3600694777750313,2.3653120988498491]
["Commercial-School-HotWater","School Hot Water",0,7.3806756928078338E-2,0.14234610835767164,0.20514476300189444,0.2658741665287741,0.32496215165443887,0.38346872386244801,0.44057366760788585,0.49662111757928584,0.55026686167127037,0.60160683597600351,0.65089553363004526,0.69829798639731777,0.74304556755379692,0.78633689498206616,0.82820624515980457,0.86850986658800444,0.9068174597310944,0.94365980138078343,0.97883466467963376,1.0126502480265192,1.0447649104354582,1.0757102038616591,1.1052012883563149,1.1335572304636155,1.1604509656159208,1.1864220534115266,1.2111717109448619,1.234855593751881,1.2575195964380237,1.2792076372860073,1.2999617433606327,1.3198221319487911,1.3388272884924832,1.3570140411658729,1.374417632240887,1.3910717863796564,1.4070087759861345,1.4222594837435294,1.4368534624587401,1.4508189923297552,1.4641831357469943,1.4769717897347829,1.4892097361345806,1.50092068962721,1.5121273436871425,1.5228514145578913,1.5331136833337273,1.5429340362292645,1.5523315031149458,1.5613242943931096,1.5699298362860896,1.5781648046047305,1.5860451570627603,1.593586164199631,1.6008024389717557,1.607707965069483,1.6143161240146764,1.6206397210914165,1.6266910101600673,1.6324817174027955,1.6380230640465543,1.6433257881075678,1.6484001651994464,1.6532560284452635,1.6579027875321699,1.6623494469454774,1.666604623417542,1.6706765626252593,1.6745731551685294,1.6783019518606541]
["C-K12-Lgt-LPD Int-All-All-C","School Interior Lights",0,7.5843987392847839E-2,0.14640208101180549,0.21120387075332139,0.27389613023237397,0.33487000997277594,0.39517910643260384,0.45398474388209348,0.51167577558900368,0.56691240816833288,0.61975293612408167,0.67048172347109281,0.71925955470134584,0.7653247508295361,0.80989102780827327,0.85297173348388633,0.89443399847235994,0.93384481051638191,0.97177025727287136,1.0079583139043846,1.0427500268702843,1.0757917317090697,1.1076219586460743,1.1379597749865593,1.1671287874984899,1.1947996761493185,1.2215192034559754,1.2469731389807808,1.2713309720188717,1.2946399031558011,1.3169451004160204,1.3382897867894361,1.358715323988877,1.3782612926007822,1.3969655687844234,1.4148643976682906,1.431992463585867,1.4483829572868969,1.4640676402543897,1.4790769062519906,1.4934398402209865,1.5071842746410784,1.5203368434641329,1.5329230337254289,1.5449672349324108,1.556492786326652,1.5675220221106145,1.5780763147268468,1.5881761162734807,1.5978409981362882,1.6070896889140942,1.6159401107110378,1.6244094138660079,1.6325140101865534,1.6402696047516687,1.6476912263450805,1.6547932565780104,1.6615894577578476,1.6680929995567351,1.6743164845317466,1.6802719725461119,1.6859710041388061,1.6914246228877956,1.6966433968102737,1.7016374388413531,1.706416426430903,1.7109896202965007,1.7153658823688429,1.719553692964386,1.7235611672184943,1.7273960708109422]
["Commercial-School-Misc","School Other",0,7.4102400329086965E-2,0.14319753633235197,0.20672583680316389,0.26819052532967097,0.32798342039544653,0.38717663644651151,0.44491608163049151,0.5015870134019923,0.55584263251346111,0.60775562402882355,0.65759604535505845,0.70553233618278099,0.75078640461117763,0.79458926244092054,0.83692699350872579,0.87768062952242631,0.91641550023842211,0.95369485792396469,0.98928252942761963,1.0234901224186084,1.0559661797583693,1.0872517740334835,1.1170685789340695,1.1457373478961672,1.1729336367131253,1.1991972752648468,1.2242103733979302,1.248146352472651,1.2710515956063553,1.2929704885572684,1.3139455057351757,1.3340172925082927,1.3532247439658209,1.3716050802888144,1.3891939188754112,1.4060253433601928,1.4221319696614192,1.4375450091841238,1.4522943293015445,1.4664085112320906,1.4799149054240008,1.4928396845550154,1.5052078942497662,1.517043501613164,1.5283694416738318,1.539207661827581,1.5495791643670538,1.5595040471799464,1.5690015426946762,1.5780900551489632,1.5867871962535438,1.5951098193201283,1.6030740519197306,1.6106953271346611,1.6179884134647382,1.6249674434456731,1.6316459410350845,1.6380368478192102,1.644152548091101,1.6500048928488911,1.6556052227606519,1.6609643901403275,1.6660927799773375,1.6710003300606007,1.6756965502359722,1.6801905408344138,1.6844910103066066,1.6886062920981788,1.6925443607982478,1.6963128475925722]
["Commercial-School-Motors","School Motors",0,7.4801985393360401E-2,0.14450201934027118,0.20859563302214162,0.27062292807754401,0.33094593033123365,0.39064034383400265,0.44885386091874391,0.50597935910545655,0.56067685855875649,0.6130267691882072,0.66329184282856068,0.71164577220974756,0.75728272270040853,0.80145264839432828,0.84415277553031742,0.88525101872949741,0.92430189087611914,0.96189436782495841,0.99775978501168294,1.0322478859605859,1.0649885014312404,1.0965342495746353,1.1265972542509006,1.1555007679158134,1.1829246005567582,1.2094079951857646,1.2346272454691565,1.2587604993288619,1.281854522161116,1.3039540655412634,1.3251019539433182,1.3453391677251889,1.3647049225403762,1.3832367453300292,1.4009705470426157,1.4179406922221243,1.4341800655996446,1.449720135817367,1.4645910164084892,1.4788215241511899,1.4924392349097553,1.5054705370710617,1.5179406826799675,1.5298738363727,1.5412931222030664,1.5522206684522206,1.5626776505088276,1.57268433190271,1.5822601035714967,1.5914235214363643,1.6001923423596829,1.6085835585542461,1.6166134305107658,1.6242975185074355,1.6316507127626216,1.6386872622891158,1.6454208025058563,1.6518643816606322,1.6580304861149628,1.6639310645401599,1.669577551071449,1.6749808874650272,1.6801515443009869,1.6850995412731971,1.6898344666054559,1.6943654956315406,1.6987014085751626,1.7028506075642744,1.7068211329127068,1.7106206787006801]
["Commercial-School-OffEquip","School Office Eqpmt",0,7.2766970998792965E-2,0.14054367884620383,0.20284127234280686,0.26314763892535076,0.32182503633790616,0.37992932056307072,0.43662132927431674,0.49227968237823799,0.54558265764746461,0.59658993848197128,0.64558134655480992,0.69270744380897542,0.73716573185207634,0.78019652851968235,0.82182346753584656,0.86188928722226699,0.89995450129456744,0.93660281961461389,0.9715619094855954,1.0051714970092953,1.0370890034418296,1.0678457351371056,1.097157513051622,1.1253381646707281,1.1520732613631148,1.1778954179508172,1.202485348932109,1.2260163833639672,1.248534119662396,1.2700821926752466,1.290702358237783,1.3104345740871002,1.3293170772921883,1.3473864583496888,1.3646777320889238,1.3812244055235985,1.3970585427816604,1.412210827239136,1.4267106209783471,1.440586021685726,1.4538639170994858,1.4665700371126531,1.4787290036324303,1.4903643782925042,1.5014987081107569,1.5121535691808552,1.5223496084823847,1.5321065838905468,1.5414434024629506,1.5503781570776911,1.5589281614937107,1.5671099839013851,1.5749394790283462,1.5824318188627586,1.589601522053584,1.5964624820448043,1.6030279939981253,1.6093107805563274,1.6153230164971906,1.6210763523257676,1.6265819368507217,1.6318504387884769,1.6368920674370464,1.6417165924596011,1.6463333628161128,1.6507513248797603,1.6549790397732029,1.6590246999583154,1.6628961451115329,1.6666008773155689]
["Commercial-School-Process","School Process",0,7.9694249642440401E-2,0.15429729639591591,0.22274872165904747,0.28889849682458585,0.35322298212732278,0.41698349544770924,0.47906887928645164,0.54012666104959872,0.5984072817862508,0.65423253330776088,0.70767761786018823,0.75912383962369767,0.80788015486748721,0.85518307712322683,0.90062483713367769,0.94443594443125811,0.98613667536063343,1.0262074654432469,1.0645597973284811,1.1014968983160758,1.1363976515033418,1.1700007720315519,1.2019810981517851,1.2327883994453208,1.2619669818285684,1.290158876948132,1.3169734537972828,1.3426333359495801,1.3671882471001042,1.3906857697321844,1.413171437322692,1.434688822576766,1.4552796218629616,1.4749837360124307,1.4938393476387171,1.5118829951279862,1.5291496434430762,1.5456727518785691,1.5614843388981798,1.5766150441801037,1.5910941879905571,1.6049498280005605,1.6182088136560662,1.6308968382067892,1.6430384884945624,1.6546572925976948,1.6657757654236589,1.6764154523384569,1.6865969709172108,1.69634005089688,1.705663572408525,1.7145856025632091,1.7231234304624283,1.7312936007009159,1.739111945426741,1.7465936150208323,1.7537531074553692,1.7606042963879407,1.7671604580459035,1.7734342969530452,1.779437970548396,1.7851831127449038,1.7906808564736196,1.7959418552570798,1.8009763038536921,1.8057939580131299,1.8104041533810131,1.8148158235895135,1.8190375175689397,1.8230774161138454]
["Commercial-School-Refrig","School Refrigeration",0,7.1896554693611114E-2,0.13915956652139627,0.20134191547899602,0.26161579849838651,0.32021998505196037,0.37821388436301118,0.4348088835793657,0.49033228422850333,0.54354606751885681,0.59454689629379276,0.64356835276675994,0.6907948067884494,0.73524110603943404,0.77827895390826385,0.81996251739760107,0.8600816726274445,0.89814644285939549,0.93484903544104858,0.96981112339822362,1.0034346985802554,1.0353600008988459,1.0661494018530675,1.0954959237224422,1.123678434473165,1.150458831552398,1.1763200266853291,1.200929078088584,1.2244784095749526,1.2470136550164534,1.2685784831901383,1.2892146823994064,1.3089622414513375,1.3278594271469655,1.3459428584346478,1.3632475773702286,1.3798071170215025,1.3956535664485585,1.410817632885933,1.4253287012470566,1.4392148910663138,1.4525031109890481,1.4652191109151096,1.4773875318969865,1.4890319538892132,1.500174941441583,1.5108380874247125,1.5210420548726828,1.530806617023851,1.5401506956374087,1.5490923976599522,1.557649050313104,1.5658372346701868,1.5736728177870125,1.5811709834490468,1.5883462615945343,1.5952125564705986,1.6017831735768804,1.6080708454489203,1.6140877563312552,1.6198455657880351,1.6253554312969154,1.6306280298700062,1.6356735787437777,1.6405018551780086,1.645122215402153,1.6495436127458318,1.6537746149885866,1.6578234209625149,1.6616978764399579,1.6654054893370329]
["Commercial-School-Vent","School Ventilation",0,7.8943112124347542E-2,0.1519151034859961,0.21857077901921365,0.28305776309540071,0.34574669002768543,0.40770931541861044,0.46810756437860029,0.52735815614088455,0.58405229834472494,0.63831537494690083,0.69036141931879591,0.74040676938406491,0.78767773928461859,0.83341480319437011,0.87760589502658548,0.92015736087505651,0.96058430679491169,0.99947411559296073,1.0365664113906226,1.0722293068834587,1.1061177276229437,1.1387622196702092,1.1698713484675827,1.1997950052439674,1.22816302875036,1.2555532583215474,1.281667185032435,1.3066565885835237,1.3305698934171013,1.3534534387123909,1.3753515681815673,1.3963067159989613,1.4163594890299605,1.4355487455189546,1.4539116703888055,1.4714838472977536,1.488299327593398,1.5043906962973637,1.5197891352485273,1.5345244835271525,1.5486252952770332,1.5621188950376845,1.5750314306938102,1.5873879241446482,1.599212319791383,1.6105275309365841,1.6213554841855802,1.6317171619358155,1.6416326430365196,1.65112114169748,1.6602010447223225,1.66888994713844,1.6772046862926193,1.6851613744784371,1.6927754301586451,1.7000616078430548,1.7070340266798107,1.713706197815462,1.720091050576851,1.7262009575255486,1.7320477584333931,1.7376427832255887,1.7429968739358237,1.7481204057159532,1.7530233069409573,1.7577150784481381,1.7622048119478331,1.7665012076413207,1.7706125910800652,1.7745469292989591]
["Commercial-Small Office-AirComp","Small Office Compressed Air",0,7.382904618815031E-2,0.14198747304115614,0.20420798444929933,0.26447159872458065,0.32312619034371887,0.38118589225057675,0.4378504229366309,0.49348531420235753,0.54675931774362008,0.59772122046738874,0.64664850104526472,0.6937025295504532,0.73809930289576953,0.78106074476079246,0.82262819278738353,0.86265153260812821,0.90066034003408924,0.9372573502138587,0.97213000633287494,1.0056793596625391,1.0375521710868425,1.0682676562658153,1.0975416044587665,1.1256900747729421,1.1523805036139776,1.1781653272370993,1.2027375302512942,1.226251600121337,1.2487531023893206,1.2702856404448075,1.2908909400194359,1.3106089300430037,1.32947782001771,1.3475341740604909,1.3648129817569319,1.3813477259640528,1.3971704476933549,1.412311808199864,1.4268011483974803,1.4406665457157737,1.4539348685083988,1.4666318281185664,1.4787820287024587,1.4904090149071405,1.501535317495353,1.5121824970056037,1.5223711855321598,1.5321211267058974,1.5414512139534933,1.5503795271090874,1.5589233674493688,1.5670992912199733,1.5749231417181591,1.5824100799939351,1.5895746142291276,1.5964306278513212,1.6029914064371524,1.6092696634570864,1.6152775649115692,1.6210267529062892,1.6265283682122413,1.6317930718543008,1.6368310657701475,1.6416521125795698,1.6462655545024623,1.6506803314621676,1.6549049984092545,1.6589477418992895,1.6628163959567392,1.6665184572557343]
["Commercial-Small Office-Cook","Small Office Cooking",0,7.6401073033174435E-2,0.14655112780494975,0.21028132548191403,0.27196956541269818,0.33201130438616139,0.39140174034108544,0.44934092254988167,0.50621443651141107,0.56065396052952265,0.61268989830721932,0.66261604427395326,0.71058953775540401,0.75591725189173631,0.79975490204319544,0.84214275940687877,0.88295790365037496,0.92174029374976807,0.95905325559326604,0.99461392733096632,1.0288283664522839,1.0613458023358129,1.0926690825839642,1.1225236526654407,1.1512433139047773,1.1784559464759852,1.2047450937851765,1.2298157497346365,1.2538068080594786,1.2767647586095667,1.2987340892795076,1.31975737221725,1.3398753463203528,1.3591269961797812,1.3775496276242103,1.3951789400112238,1.4120490954054952,1.4281927847780036,1.4436412913545666,1.4584245512364453,1.4725712114104919,1.4861086852612542,1.4990632056926056,1.5114598759618414,1.5233227183247464,1.5346747205858997,1.5455378806444193,1.5559332491214717,1.5658809701521439,1.5754003204207296,1.5845097465150701,1.5932269006723339,1.6015686749855047,1.6095512341368645,1.6171900467218978,1.624499915224322,1.631495004700326,1.6381888702276026,1.6445944831723649,1.6507242563252473,1.6565900679548,1.6622032848251853,1.6675747842226833,1.6727149750336858,1.6776338179150283,1.6823408445957386,1.6868451763476147,1.6911555416604147,1.6952802931559172,1.6992274237736227,1.7030045822594655]
["Commercial-Small Office-Cool","Small Office Cooling",0,9.7735863006377294E-2,0.18557048614799235,0.26471371902571189,0.34139237666742384,0.41576941933952738,0.48860414106377081,0.55939585328301678,0.62845561521808146,0.69473332378350439,0.75790720825080582,0.81848478677167202,0.8765657140090638,0.93152019894209925,0.98444047226021492,1.0357055422195001,1.0849598057815788,1.131695314804712,1.1767485924765719,1.2194411885199916,1.2605400734737484,1.2997980819802173,1.3375783182934262,1.3736400687223413,1.408310478738998,1.441220470099728,1.472958410694746,1.5032918909454513,1.5323191447738775,1.5600964211647161,1.586677546897576,1.6121140308524657,1.6364551638236522,1.6597481140353139,1.6820380185440811,1.7033680707055807,1.7237796038744799,1.7433121715002209,1.7620036237736569,1.7798901809731174,1.7970065036520269,1.8133857598040934,1.8290596891362145,1.844058664573651,1.8584117511166525,1.8721467621625869,1.8852903134027155,1.8978678743980539,1.9099038179342629,1.9214214672512095,1.932443141238718,1.9429901976860946,1.9530830746692298,1.9627413301554841,1.9719836799030954,1.9808280337285609,1.98929153021226,1.9973905699095795,2.0051408471318952,2.0125573803589911,2.0196545413418585,2.0264460829522575,2.0329451658330226,2.0391643839007401,2.0451157887502305,2.050810913008116,2.0562607926807335,2.0614759885396983,2.066466606586554,2.0712423176361767,2.0758123760568683]
["Commercial-Small Office-ExtLight","Small Office Exterior Lights",0,8.7810729426765613E-2,0.17162854101816627,0.25064396906309994,0.32710333002674385,0.4011217736474143,0.47391201673316324,0.54465045057108563,0.61372305036394614,0.67990156049566086,0.74350765583173806,0.80463020888907899,0.86357240726160633,0.91906992557090039,0.97278543420115948,1.0246878352785938,1.0746125075826232,1.1220108160207116,1.1676941769563278,1.2112526552409233,1.2530947834682551,1.2928272932503533,1.3311232881590667,1.3676407251809448,1.4026472822914302,1.436006987078031,1.4681645279502396,1.4987496737624155,1.5280177558793304,1.5560254899625026,1.5828271493722368,1.6084746703384896,1.6330177526028462,1.6565039557266326,1.6789787912517868,1.7004858108930829,1.7210666909326007,1.7407613129799862,1.759607841254996,1.7776427965420869,1.7949011269603556,1.8114162756859717,1.8272202457583315,1.842343662095518,1.8568158308392371,1.8706647961442315,1.8839173945222165,1.8965993068456473,1.908735108112088,1.92034831506562,1.9314614317675642,1.9420959932048316,1.9522726070203984,1.9620109934467782,1.971330023519869,1.9802477556472284,1.9887814706016396,1.9969477050077746,2.0047622833868513,2.0122403488213738,2.0193963922993863,2.0262442807950922,2.0327972841402651,2.0390681007385165,2.04506888217225,2.0508112567499852,2.0563063520396843,2.0615648164317411,2.0665968397734216,2.071412173114743,2.0760201476040461]
["Commercial-Small Office-Heat","Small Office Heating",0,0.10751912733303232,0.21099961979635043,0.30826530848429534,0.40213751940348086,0.49283137940336103,0.58211391314741523,0.66873646700266887,0.75350407728908697,0.83421080641005319,0.91221100576277714,0.98689866059580977,1.0590802183365693,1.127268222364884,1.1935233746637119,1.2570767584285267,1.3183934437769973,1.3766833316377285,1.4325703850918226,1.4861763170394642,1.5376070300678684,1.5863511745143872,1.6332546565881996,1.6779114119711982,1.7207861994927034,1.7615291482177853,1.8008063601589639,1.8382023199974382,1.8739879274983704,1.9082325279777317,1.9410024805895605,1.9723612869166691,2.0023697140239505,2.0310859122127365,2.0585655277043977,2.0848618104715375,2.1100257174257382,2.1341060111618155,2.1571493544499276,2.1792004006586474,2.2003018802842167,2.2204946837536608,2.2398179406622201,2.2583090955986402,2.2760039807052626,2.2929368851135132,2.3091406213893517,2.3246465891174264,2.3394848357471631,2.3536841148186816,2.3672719416813783,2.3802746468131462,2.3927174268435456,2.4046243933798128,2.4160186197303082,2.42692218561595,2.4373562199562766,2.4473409418130485,2.4568956995707247,2.4660390084297452,2.4747885862852672,2.4831613880608865,2.4911736385638714,2.4988408639255795,2.5061779216879794,2.5131990295945821,2.5199177931415706,2.5263472319425162,2.5324998049577756,2.5383874346374493,2.5440215300246969]
["Commercial-Small Office-HotWater","Small Office Hot Water",0,7.251089059482009E-2,0.14037187125724057,0.20302464442180346,0.26366217335763886,0.32261686276900858,0.38097704093597895,0.43793964102504795,0.4938169322898639,0.54733598456813348,0.59862025429874421,0.64789201029463517,0.69533379109672999,0.74002579249206446,0.78329460234038695,0.82516719691882623,0.86547398858014202,0.90374297001088721,0.94059870250081923,0.97576389411799513,1.0095609037369713,1.0416572034039107,1.0725961627974117,1.1020843187757801,1.1304149960200824,1.1573222817379045,1.1832990993715453,1.2080339022584592,1.2317035700928265,1.2543539699343262,1.2760289937060965,1.2967706432484603,1.3166191117100523,1.3356128614340639,1.3537886984905343,1.3711818439991186,1.3878260023805387,1.4037534266689791,1.4189949810119844,1.4335802004789748,1.4475373482942768,1.4608934706055707,1.4736744488938902,1.4859050501267319,1.4976089747514605,1.5088089026220144,1.5195265369479032,1.5297826463506676,1.539597105109294,1.5489889316725727,1.5579763255130306,1.5665767023938517,1.5748067281171256,1.582682350818823,1.590218831873079,1.5974307754656685,1.6043321568939837,1.6109363496483524,1.6172561513271742,1.6233038084360945,1.6290910401192717,1.6346290608687237,1.6399286022557591,1.6449999337266064,1.6498528825025367,1.6544968526230444,1.6589408431689843,1.6631934657009846,1.6672629609469178,1.6711572147707774,1.6748837734538966]
["C-SOff-Lgt-LPD Int-All-All-C","Small Office Interior Lights",0,7.9457813936436195E-2,0.15287343142512991,0.22000714738283272,0.28496474303541169,0.34811775761834191,0.41048428343814969,0.47127095872316221,0.53085771940680337,0.58790567146232908,0.6424699375521058,0.69483257087290173,0.74516496529591802,0.79271455550278758,0.83869057314406326,0.88313491365517105,0.92591472918329232,0.96656680874107748,1.0056843017732371,1.0429731103214868,1.078835297138395,1.1129224046759472,1.145754036102818,1.1770523127310091,1.2071425955994857,1.2356842997200674,1.2632418299588832,1.2895149203216201,1.314656633587397,1.3387156893441212,1.361738709207015,1.3837703071619376,1.4048531760183227,1.4250281701392653,1.444334384609067,1.4628092309916525,1.4804885098266622,1.4974064800037052,1.513595925149201,1.52908821715446,1.5439133769681048,1.5581001327706359,1.5716759756438714,1.5846672128431398,1.5970990187754541,1.6089954837824534,1.6203796608226442,1.6312736101434009,1.6416984420292924,1.6516743577095714,1.6612206885040968,1.6703559332835469,1.6790977943165135,1.6874632115729409,1.6954683955503833,1.7031288586866919,1.7104594454200017,1.7174743609542691,1.7241871987861042,1.7306109670462335,1.7367581137066441,1.7426405507022524,1.7482696770138395,1.7536564007569848,1.7588111603198031,1.763743944590443,1.7684643123135431,1.7729814106131605,1.7773039927180576,1.7814404349237007,1.7853987528238378]
["Commercial-Small Office-Misc","Small Office Other",0,7.4906338456058791E-2,0.14431467855969682,0.20792056837804121,0.26952509593934015,0.32944831536723723,0.38871829235969602,0.44653758861590009,0.50327025108945667,0.5576046843800333,0.60960732006912444,0.6595434400010447,0.70758365314637961,0.752895047964246,0.7967404378072217,0.83916426006942713,0.88000510589312231,0.91878704976877423,0.95613602479224158,0.99172355956782288,1.025954494981081,1.0584761138461027,1.0898181081592122,1.1196917671462878,1.1484051979203176,1.1756498811725955,1.2019635571779828,1.22703293096648,1.2510227623430323,1.2739795387799246,1.295947745896568,1.3169699536636907,1.3370868988953872,1.3563375641888766,1.3747592534649431,1.3923876642554374,1.4092569568779199,1.4253998206314915,1.4408475371420868,1.4556300409799767,1.4697759776669528,1.4833127591855901,1.4962666170981618,1.5086626533781347,1.5205248890527499,1.5318763107509461,1.5427389152468278,1.5531337520849922,1.5630809643703167,1.5725998278012494,1.5817087880222376,1.5904254963676807,1.5987668440666696,1.6067489949747931,1.6143874168964421,1.6216969115583071,1.6286916432921492,1.6353851664824288,1.6417904518319786,1.6479199114966199,1.6537854231374247,1.6593983529372378,1.6647695776260545,1.6699095055579363,1.6748280968803111,1.6795348828347367,1.684038984226532,1.6883491290990631,1.6924736696469398,1.6964205984008887,1.7001975637156723]
["Commercial-Small Office-Motors","Small Office Motors",0,7.494374825731967E-2,0.14426434003124669,0.20775687580364877,0.26926122816418668,0.32909199159534142,0.38824218679297795,0.44594704915768929,0.50254307533620945,0.55677679640656041,0.60864542998344773,0.65846952311846774,0.70638655956272867,0.75159101514895488,0.79530190040162485,0.83762727312316743,0.87834938775925453,0.9170219841996412,0.95427116059218309,0.98975339602597423,1.0238804112953146,1.0563209008638739,1.0875807591120221,1.1173833054973936,1.1460250753208154,1.1732091056188816,1.1994621743424669,1.2244753610736072,1.2484114249311578,1.2713167491967563,1.2932357197858459,1.314210811258659,1.3342826691273795,1.3534901886189783,1.3718705900463455,1.3894594909337781,1.4062909750365844,1.4223976583885523,1.4378107525052679,1.4525601248657614,1.4666743567896785,1.4801807988221352,1.4931056237335769,1.5054738772373488,1.517309526523255,1.5286355067011557,1.5394737652446013,1.5498453045206257,1.5597702224881134,1.5692677516436038,1.5783562962900062,1.5870534682004391,1.595376120746308,1.6033403815557519,1.6109616837657459,1.6182547959284197,1.625233850629543,1.6319123718746369,1.6383033012957795,1.6444190232298872,1.6502713887170717,1.6558717384655735,1.6612309248277761,1.666359332829884,1.6712669002960159,1.6759631371057115,1.6804571436221667,1.6847576283269086,1.6888729246950824,1.6928110073440528,1.6965795074866081]
["Commercial-Small Office-OffEquip","Small Office Office Eqpmt",0,7.4087166351064201E-2,0.14284445040821719,0.20593402076863518,0.26704483172155014,0.32648700106913497,0.38529492048893893,0.44267298972643909,0.49897530329733913,0.55290359371903597,0.60452910568155105,0.65411042697606836,0.7018215812238312,0.74680443181506484,0.79033881228055369,0.83246918207466858,0.87302636836892833,0.91153347065662471,0.94862499487679985,0.9839685734242134,1.0179635605662782,1.0502557238961423,1.0813808601741612,1.1110472940915406,1.1395584425029808,1.1666170797057176,1.1927505062513279,1.2176431594716666,1.2414638802566795,1.2642588283763092,1.2860721758592084,1.3069461925892556,1.3269213282160948,1.3460362905384291,1.3643281205119548,1.3818322640272902,1.3985826405969892,1.4146117090847397,1.4299505306041178,1.4446288287087861,1.4586750469907652,1.4721164041984007,1.4849789469808272,1.4972876003611393,1.5090662160360793,1.5203376185958306,1.531123649753487,1.541445210669905,1.5513223024559506,1.5607740649306356,1.5698188137102385,1.5784740757002891,1.5867566230591892,1.594682505699285,1.602267082388372,1.6095250505118999,1.6164704745535536,1.6231168133493945,1.6294769461683809,1.6355631976698033,1.6413873617859971,1.6469607245766131,1.6522940860987338,1.6573977813352128,1.6622817002217953,1.6669553068118268,1.6714276576156846,1.6757074191504768,1.6798028847340098,1.6837219905555727,1.687472331054676]
["Commercial-Small Office-Process","Small Office Process",0,7.7263611621113185E-2,0.14836222982486641,0.21309299477116497,0.2757376977945169,0.33669161607827397,0.39695510315000826,0.4557297821986287,0.51339540096445613,0.56859908820748295,0.62136935705588081,0.67200329642133794,0.72065986844252405,0.76663636742863495,0.81109284529770309,0.85407664943373096,0.89545786071785072,0.93478532850715923,0.9726215479799013,1.0086896550707654,1.0433835594963485,1.0763565550091427,1.1081164107371775,1.1383908657988189,1.1675080538168143,1.195106392645787,1.2217632847007704,1.2471822836665345,1.2715066845907108,1.294783623274133,1.3170582057463074,1.338373595671833,1.3587710979929102,1.3782902389700176,1.396968842775862,1.4148431047910242,1.4319476617433324,1.4483156588268811,1.4639788139307552,1.4789674791019267,1.4933106993614209,1.5070362689877312,1.5201707853765449,1.5327397005811514,1.5447673706334064,1.5562771027408273,1.567291200451278,1.5778310068727619,1.5879169460320766,1.5975685624524734,1.6068045590270159,1.615642833261028,1.6241005119538623,1.6321939843871967,1.6399389340841672,1.6473503692008855,1.6544426516092285,1.6612295247272602,1.6677241401512137,1.6739390831406431,1.6798863970061257,1.6855776064467789,1.6910237398828107,1.6962353508263819,1.7012225383321915,1.7059949665674161,1.7105618835389229,1.7149321390140488,1.7191142016696721,1.7231161755028042,1.7269458155345094]
["Commercial-Small Office-Refrig","Small Office Refrigeration",0,7.1755939361512852E-2,0.13892099289772053,0.2010301981033088,0.26123412909685662,0.31977006787973716,0.37770275521086694,0.43424005935741783,0.48971113576518405,0.54287124946433674,0.59382841763491889,0.64280783365363525,0.68999788305466614,0.73440543616826559,0.77741100540240704,0.8190613589077369,0.85915160127375367,0.89718756349565498,0.93386188463575204,0.96879899852751417,1.0023975834405758,1.0342978336115267,1.0650636575358465,1.0943869590268946,1.1225465779032844,1.1493051619601216,1.1751456958833777,1.1997344966697168,1.2232644495753044,1.2457811509203642,1.2673282335472158,1.287947451371954,1.3076787602951487,1.3265603956283492,1.344628946186436,1.3619194251893898,1.3784653381108765,1.3942987476051223,1.4094503356378936,1.4239494629419807,1.437824225912399,1.4511015110515553,1.4638070470698865,1.4759654547429311,1.4876002946214424,1.4987341126870035,1.5093884840416074,1.5195840547158694,1.5293405816768859,1.5386769711132655,1.5476113150715232,1.556160926514832,1.5643423728720653,1.572171508142145,1.5796635036159055,1.5868328772750064,1.5936935219248638,1.6002587321161148,1.6065412299067856,1.6125531895150833,1.6183062609105834,1.6238115923895307,1.6290798521779972,1.6341212491047592,1.6389455523839576,1.6435621105458698,1.6479798695524841,1.6522073901329766,1.6562528643726822,1.6601241315877113,1.663828693515969]
["Commercial-Small Office-Vent","Small Office Ventilation",0,8.2069506862569364E-2,0.15776826485916304,0.22699841156947481,0.29402739836275577,0.359141256545354,0.42336017447905033,0.48591794473991073,0.54719766743843978,0.60588308743131958,0.66204532942077232,0.71593567834728078,0.76776098463112608,0.81669008300663637,0.86399521423952397,0.90974301364740218,0.95376936152544189,0.99557490459416675,1.0358259303007704,1.0741537628124793,1.1110228501875221,1.146081001749258,1.1798565143768507,1.2120556144474397,1.2430053227216122,1.2723771717602634,1.3007288863632429,1.3277600531059306,1.3536271983142443,1.378380447317415,1.402067766937674,1.4247350584403145,1.4464262464811186,1.467183364223515,1.4870466347904014,1.5060545492084747,1.5242439409961046,1.5416500575392911,1.558306628394015,1.5742459306473393,1.5894988514639177,1.6040949479391122,1.618062504374705,1.6314285870881911,1.6442190968618617,1.6564588191333169,1.6681714720246617,1.6793797523034606,1.690105379364512,1.7003691373176713,1.7101909152632782,1.719589745833237,1.7285838420724322,1.7371906327319488,1.7454267960424914,1.7533082920334409,1.7608503934601871,1.7680677153996569,1.7749742435713987,1.7815833614390939,1.7879078761450222,1.793960043327729,1.7997515908709891,1.8052937416300894,1.8105972351794679,1.8156723486238493,1.8205289165132095,1.825176349900157,1.8296236545766618,1.8338794485254701,1.8379519786200236]
["Commercial-not-refrig-warehouse-AirComp","Warehouse Compressed Air",0,7.9737235744117757E-2,0.15373344419384946,0.2216885716131568,0.28746163616546516,0.35137606213752298,0.41446820408089552,0.47594700270058976,0.53618565245488847,0.59387453595512252,0.64908751290573163,0.70208978413231726,0.7530717452521577,0.80120452632704564,0.84775008208544134,0.89275228512793658,0.93606102299919303,0.97720456559436708,1.0168144306215565,1.0545669018397352,1.0908754464110109,1.1253743167414521,1.1586091949454083,1.1902931725407284,1.2207396651912434,1.2496432078855322,1.277546108920367,1.3041329715636769,1.3295749453850261,1.353921331816939,1.3772193092637459,1.399514024523848,1.4208486802751419,1.4412646187931264,1.4608014020639253,1.4794968884474646,1.4973873060393683,1.514507322873726,1.5308901141027764,1.5465674262836859,1.5615696388969964,1.5759258232159536,1.5896637986407935,1.6028101866071471,1.6153904621730359,1.6274290033844128,1.6389491385149171,1.6499731912713802,1.6605225240526849,1.6706175793457991,1.6802779193392101,1.6895222638305125,1.6983685265016153,1.7068338496318571,1.7149346373162992,1.7226865872535642,1.7301047211648224,1.7372034139028687,1.7439964213076977,1.7504969068625582,1.7567174672021373,1.7626701565223089,1.7683665099387411,1.7738175658396329,1.7790338872758933,1.7840255824302091,1.7888023242046742,1.793373368964928,1.7977475744771323,1.8019334170725434,1.8059390080729365]
["Commercial-not-refrig-warehouse-Cook","Warehouse Cooking",0,7.8276939613518101E-2,0.15050886816907483,0.21646195950552249,0.28028898343707853,0.34237099783946662,0.40371547742737318,0.46352246788679502,0.52217710067719059,0.57833192367894293,0.6320263604364037,0.68355775123115992,0.73308574651428837,0.77988364615809547,0.82513285532424652,0.86887872771154739,0.9109890224625421,0.95100958938377778,0.98951581966586877,1.0262223369272705,1.0615283666810444,1.0950840766944607,1.1274023386275802,1.1582107286908057,1.187832717609558,1.2159225087642302,1.2430508566162963,1.2689136832434014,1.2936627996329755,1.3173461645990754,1.3400096717436683,1.3616972383892119,1.3824508906815982,1.4023108450283794,1.4213155860300837,1.4395019410556382,1.4569051516064082,1.4735589416071446,1.4894955827561751,1.5047459570614672,1.5193396166837563,1.5333048412026931,1.546668692416987,1.5594570667847321,1.571694745605541,1.5834054430417215,1.5946118520715595,1.6053356884637491,1.6155977328581888,1.625417871034686,1.6348151324476021,1.6438077271011104,1.6524130808365249,1.6606478691000794,1.6685280492565908,1.676068891511626,1.6832850085020901,1.690190383612582,1.6967983980723829,1.7031218568855895,1.7091730136446388,1.7149635942753081,1.7205048197592021,1.7258074278777609,1.7308816940199225,1.7357374510937615,1.7403841085806886,1.7448306707691357,1.7490857542030565,1.7531576043790569,1.7570541117245122]
["Commercial-not-refrig-warehouse-Cool","Warehouse Cooling",0,0.11794129056055755,0.22404631924313084,0.32003376897556507,0.41297082456496298,0.50289180175888659,0.59052883344312379,0.67547691391776044,0.75807679450625609,0.83736243271722488,0.91294913079528339,0.98539479627392723,1.0548462408782864,1.1206608545719752,1.1839453074634738,1.2451877406497267,1.3039708018253418,1.3597637401078175,1.4135422286071671,1.4644729283444766,1.513507285561611,1.5603753196668058,1.6054530271422716,1.6484977848085769,1.6898573196859616,1.7291719693916647,1.7670463582404212,1.8032524026220766,1.8378993350447137,1.8710542943008257,1.9027815280387319,1.9331425172616088,1.9621960954653186,1.989998562645902,2.0166037943976565,2.0420633463132112,2.0664265538879047,2.0897406281220614,2.1120507470064211,2.1334001430680098,2.1538301871460854,2.1733804685605111,2.1920888718279046,2.2099916500742141,2.2271234952859937,2.2435176055364998,2.2592057493168891,2.2742183270971661,2.2885844302361864,2.3023318973548665,2.3154873682818331,2.3280763356760596,2.3401231944265155,2.3516512889245598,2.3626829583006779,2.3732395797132315,2.3833416097730917,2.393008624184441,2.4022593556785554,2.411111730314071,2.4195829022140862,2.4276892868074023,2.4354465926383266,2.4428698518066754,2.4499734490969614,2.4567711498532159,2.4632761266534593,2.4695009848355105,2.4754577869235979,2.4811580760031071,2.4866128980887621]
["Commercial-not-refrig-warehouse-ExtLight","Warehouse Exterior Lights",0,8.8361759797582193E-2,0.172733335143229,0.25228174719070429,0.3292596994348998,0.40377730995524624,0.47705617808344963,0.54826114523697933,0.61779462553360009,0.68440546713208494,0.74843371849405627,0.80995899433174512,0.86929194284264044,0.92516411960693012,0.97924805176681307,1.0314961098842952,1.0817578217235198,1.1294778940256966,1.1754672805844306,1.2193204646573292,1.2614458517291425,1.3014448298142685,1.3399955924338045,1.3767546346230275,1.4119929954498511,1.4455712739843354,1.47794096392096,1.508727236139195,1.538187783716453,1.566379695273638,1.5933576010699873,1.6191737788655369,1.6438782552249143,1.6675189024587684,1.6901415313906862,1.7117899801293637,1.7325061990180499,1.7523303319258838,1.7713007940386436,1.7894543462996577,1.8068261666451257,1.8234499181718895,1.8393578143697495,1.8545806815447352,1.8691480185542908,1.8830880539701336,1.8964278007795525,1.9091931087311493,1.9214087144264573,1.9330982892545032,1.9442844852622028,1.9549889790494754,1.965232513774138,1.9750349393479776,1.9844152509018913,1.9933916255946313,2.0019814578364885,2.01020139299616,2.0180673596561327,2.025594600479073,2.0327977017450447,2.039690621616788,2.0462867171878343,2.052598770365869,2.0586390126415002,2.0644191487904298,2.0699503795549554,2.07524342334876,2.080308537027042,2.0851555357622398,2.0897938120638648]
["Commercial-not-refrig-warehouse-Heat","Warehouse Heating",0,0.1274847414735088,0.24992797923301396,0.36502730861873545,0.47594711712401461,0.58300417115396197,0.68805753507709355,0.78977142822297453,0.88906584104136765,0.9835975895393021,1.0747958548051344,1.1621222268199569,1.2463846842477615,1.3262786355464589,1.4037218379423853,1.477944731805674,1.5494386018277335,1.6175603335792277,1.6827580883994355,1.7453729239364828,1.8054466397015676,1.8624092454310335,1.9171507794307858,1.9693001668631107,2.0193579130425481,2.0669449262347657,2.1127978998489727,2.1564761145980196,2.1982734492861025,2.2382708987483828,2.2765459700041535,2.313172832449867,2.3482224615845211,2.3817627765459126,2.4138587717242777,2.4445726427083589,2.4739639068079584,2.5020895183865224,2.5290039792272534,2.5547594441466135,2.5794058220598766,2.6029908726945781,2.6255602991392686,2.6471578364069148,2.667825336184567,2.6876028479335163,2.706528696497104,2.724639556366566,2.7419705227488262,2.758555179573956,2.7744256645740797,2.7896127315598442,2.8041458100151213,2.8180530621254345,2.8313614373506146,2.8440967246474376,2.8562836024434404,2.867945686458754,2.8791055754686234,2.8897848950952927,2.9000043397141151,2.9097837125550936,2.9191419640775611,2.9280972286923626,2.9366668599026986,2.9448674639317285,2.9527149319020918,2.9602244706297123,2.9674106320915503,2.9742873416244096,2.9808679249094423]
["Commercial-not-refrig-warehouse-HotWater","Warehouse Hot Water",0,7.5856687287335398E-2,0.14661923091985848,0.21179537686195982,0.27483435449915095,0.33610962152419671,0.39669579535256599,0.45578523396745818,0.51371487348151046,0.5691853896795801,0.62230192215119684,0.67331430291336425,0.72239315214722011,0.7686960142092687,0.8134905491056742,0.85681344156587158,0.89850781609978247,0.93812299532465093,0.97624606818868764,1.0126266396503349,1.0475941463346412,1.0808137025850135,1.1128202690447533,1.1433293627102352,1.1726468537225301,1.2004807704401643,1.2273500846297023,1.2529471347793646,1.2774419196115774,1.3008819050969482,1.3233125132169203,1.3447772099824438,1.3653175896623708,1.3849734553847888,1.4037828962674856,1.421782361227004,1.4390067296093181,1.4554893787789969,1.4712622487978282,1.4863559043182411,1.5007995938114591,1.5146213062451606,1.527847825320473,1.5405047813734034,1.5526167010412792,1.564207054790443,1.5752983023972982,1.5859119364708438,1.5960685241010311,1.6057877467136505,1.6150884382089798,1.6239886214580992,1.632505543227591,1.6406557076003108,1.6484549079569801,1.6559182575805873,1.6630602189428909,1.6698946317297843,1.6764347396598258,1.6826932161479038,1.688682188863768,1.694413263233016,1.6998975449260763,1.7051456613787654,1.7101677823861237,1.7149736398094326,1.719572546434609,1.7239734140185095,1.7281847705581275,1.7322147768161349,1.7360712421348026]
["C-War-Lgt-LPD Int-All-All-C","Warehouse Interior Lights",0,7.9336499718514739E-2,0.15305678198979017,0.22082785381912817,0.28641546904401027,0.35015207831758466,0.4130775999660718,0.47439260212860984,0.53447393114164765,0.59201203636446387,0.64708109145881898,0.69995404073556344,0.75080787042606256,0.79881785181008635,0.84524661557547764,0.89013670217922658,0.93333753618904658,0.97438420720179775,1.013896819012601,1.0515611261237312,1.0877809588245624,1.1221981603572986,1.1553525761268379,1.1869605200154816,1.2173319429443079,1.246164911898177,1.2740005010899822,1.3005217687380242,1.3259009722289734,1.3501872913590685,1.3734277881342789,1.3956674979670163,1.4169495169457123,1.4373150853463783,1.4568036675479725,1.4754530285064362,1.4932993069355878,1.51037708533669,1.5267194570123857,1.5423580901948699,1.5573232894125579,1.5716440542141732,1.5853481353640444,1.5984620886175096,1.6110113261806343,1.6230201659539591,1.6345118786557056,1.6455087329157498,1.6560320384277543,1.6661021872430692,1.6757386932864329,1.6849602301700344,1.6937846673792225,1.7022291048999767,1.7103099063552438,1.7180427307143511,1.7254425626369418,1.7325237415102344,1.7392999892358731,1.7457844368202164,1.7519896498195882,1.7579276526898002,1.7636099520871324,1.7690475591659192,1.7742510109159544,1.7792303905810598,1.7839953471983856,1.788555114296305,1.7929185277871369,1.7970940430893685,1.8010897515125566]
["Commercial-not-refrig-warehouse-Misc","Warehouse Other",0,7.9675157859929888E-2,0.15376222663937886,0.22193195680851391,0.28790729890491323,0.35200884739494503,0.4152788271846235,0.47692395781541153,0.53731637443150959,0.59515578018105331,0.65052335853642029,0.70368331246009586,0.7548185039545714,0.80308359493435488,0.84975959548866187,0.89489211491772536,0.93832480812971875,0.97958700102705187,1.0193120714435056,1.0571755963947056,1.0935840868744751,1.1281832666430784,1.161515096486937,1.1932928801507809,1.223824456641879,1.2528147506075566,1.2807991012490503,1.307461808808712,1.3329763614973835,1.3573922013908488,1.3807566414802896,1.4031149573553523,1.4245104749391446,1.4449846544451657,1.4645771707188704,1.4833259901195446,1.5012674440914815,1.5184362995670193,1.5348658263378687,1.5505878615252848,1.565632871274008,1.5800300097895328,1.5938071758330972,1.6069910667838765,1.619607230373139,1.6316801141906152,1.6432331130590132,1.654288614368485,1.6648680414588888,1.6749918951339162,1.684679793387531,1.6939505094196983,1.7028220080150736,1.7113114803551457,1.7194353773312911,1.7272094414232966,1.73464873720512,1.7417676805370084,1.7485800665005378,1.7550990961307094,1.7613374019969026,1.7673070726822548,1.7730196762089077,1.7784862824545085,1.7837174846034087,1.7887234196741266,1.793513788162852,1.7980978728410579,1.8024845567436476,1.8066823403824892,1.8106993582187012]
["Commercial-not-refrig-warehouse-Motors","Warehouse Motors",0,7.8400362869697496E-2,0.15130409130050981,0.21838008130505365,0.28331451253832551,0.34641350670502974,0.4087202260717715,0.46944677801013485,0.528951046388765,0.58594661100590761,0.64051516678484888,0.69291052250881935,0.74332559034238477,0.7908906066819873,0.83689631821989841,0.88139162640380375,0.92421265106213235,0.96488399171227668,1.0040509618798463,1.0413782714433184,1.077276546353455,1.1113802461066653,1.1442426547677715,1.1755715550856447,1.2056700185276841,1.234252369794387,1.2618445610132194,1.2881292820446053,1.3132821251368405,1.3373518314451995,1.3603850432235336,1.3824263942075854,1.4035185961061996,1.4237025213680312,1.4430172823841381,1.4615003072799342,1.4791874124433753,1.4961128719299219,1.5123094838787703,1.5278086340690558,1.5426403567391855,1.5568333927871565,1.5704152454646407,1.5834122336727596,1.5958495429628254,1.6077512743408791,1.6191404909705955,1.6300392628650608,1.6404687096540229,1.650449041509489,1.6599995983089781,1.6691388871123169,1.677884618024603,1.6862537385148288,1.6942624662566717,1.7019263205550859,1.7092601524195969,1.7162781733425745,1.7229939828382466,1.7294205947958274,1.7355704626978186,1.7414555037523558,1.7470871219863626,1.7524762303442638,1.7576332718350784,1.7625682397688722,1.767290697121785,1.7718097950671561,1.7761342907086595,1.7802725640498109,1.7842326342327313]
["Commercial-not-refrig-warehouse-OffEquip","Warehouse Office Eqpmt",0,7.7279658260348619E-2,0.14892649944312164,0.21463083391035026,0.27823494146341787,0.34007819253839039,0.40118939798158293,0.46077056211971329,0.51919266596819658,0.57514074647194258,0.62867707623891989,0.68007726795248702,0.72951268843424844,0.77617470987072101,0.82130885922336261,0.86495873801291034,0.90697272061467316,0.946885777149716,0.9853099929445216,1.0219332463006434,1.0571565588426421,1.0906243786009071,1.1228684104106521,1.153605572553797,1.1831471527130042,1.2111813028430336,1.2382519982923048,1.2640461134479282,1.2887294772332136,1.3123499210468839,1.3349532165623579,1.3565831644240556,1.3772816791242446,1.397088870224904,1.4160431200819943,1.4341811582227506,1.4515381325201251,1.4681476773023017,1.4840419785292649,1.4992518361627225,1.5138067238502417,1.5277348460392552,1.541063192631613,1.5538175912845866,1.566022757459681,1.5777023423162306,1.5888789785425941,1.5995743242137552,1.6098091047603209,1.6196031531302402,1.6289754482210721,1.6379441516572748,1.6465266429837846,1.654739553344081,1.6625987977080012,1.6701196057117524,1.6773165511698875,1.6842035803164284,1.6907940388298646,1.6971006976943968,1.7031357779475376,1.7089109743620268,1.7144374781079492,1.7197259984389754,1.7247867834447421,1.7296296399095907,1.7342639523161443,1.7386987010305497,1.7429424797046218,1.7470035119286142,1.7508896671668845]
["Commercial-not-refrig-warehouse-Process","Warehouse Process",0,9.0931403144496062E-2,0.17527796632492557,0.25282303867351397,0.32774373716817307,0.40044066466453526,0.47194513198652654,0.54147060057945617,0.60942958963360372,0.67448357946233606,0.73670396791219261,0.79638896368585033,0.85372094725205916,0.90798276470571293,0.96037797134045511,1.0109584043162794,1.0596153842848299,1.1059011271097272,1.1504005687700964,1.1928410882326745,1.2336335044003865,1.272438685948992,1.3097820478070514,1.3453985180925183,1.3796203178908102,1.412111146746442,1.4434521894883821,1.4733463638064235,1.5019532291825397,1.5293282199730815,1.5555243834090067,1.5805924823907531,1.6045810938565392,1.6275367029147079,1.6495037929225247,1.6705249316859858,1.6906408539476709,1.7098905403224895,1.7283112928342774,1.7459388071996247,1.7628072419990002,1.7789492848692159,1.7943962158454989,1.8091779679759132,1.823323185325592,1.8368592784831794,1.8498124776770428,1.8622078836041851,1.8740695160703498,1.885420360535579,1.8962824126554161,1.9066767209040636,1.9166234273620995,1.9261418067477798,1.9352503037675699,1.9439665688582777,1.9523074923900554,1.9602892373965417,1.9679272708955717,1.9752363938611504,1.9822307699047665,1.9889239527216238,1.9953289123549804,2.001458060329484,2.0073232737022146,2.0129359180780337,2.0183068696338413,2.0234465361944229,2.0283648774007208,2.0330714240096186,2.0375752963626308]
["Commercial-not-refrig-warehouse-Refrig","Warehouse Refrigeration",0,7.3451161187560912E-2,0.14208389885576939,0.20553056255597291,0.26702259616099333,0.32680079448229282,0.38589100051143077,0.44352519251146716,0.50003049272678091,0.55420904989994868,0.60608666416031276,0.65595927969166901,0.70397498466879049,0.74919434911347815,0.7929537195073334,0.83534018808836352,0.8761159332554731,0.91481393611219886,0.95213119490002063,0.98766663188429826,1.0218409485551729,1.0543064536699702,1.0856056756370112,1.1154446359798877,1.1441011238459871,1.1713354173804778,1.1976312165422707,1.2226559309272564,1.2466030260325061,1.2695189065159982,1.2914479787490052,1.3124327368667152,1.3325138451133278,1.3517302166411866,1.3701190889166497,1.3877160958788153,1.4045553369909356,1.4206694433183231,1.4360896407607995,1.4508458105622122,1.4649665472142819,1.47847921386698,1.4914099953528155,1.5037839489277776,1.515625052827263,1.5269562527310769,1.5377995062275494,1.5481758253629299,1.5581053173585093,1.5676072235743748,1.5766999567952986,1.5854011369110153,1.5937276250600263,1.6016955563030992,1.6093203708897716,1.6166168441784536,1.6235991152681013,1.6302807143969507,1.6366745891614001,1.6427931296058489,1.6486481922321161,1.6542511229749552,1.6596127791881987,1.6647435506841253,1.66965337986683,1.6743517809986053,1.6788478586366673,1.6831503252759614,1.6872675182322234,1.6912074157980246,1.6949776527030975]
["Commercial-not-refrig-warehouse-Vent","Warehouse Ventilation",0,8.2568754246018547E-2,0.15914108453583159,0.22951498752666641,0.2976444987802549,0.36379304079069535,0.42900705726153177,0.49251227217005333,0.55468932839168361,0.61424240296696808,0.671268647990788,0.72600841291603457,0.77867182274368141,0.82837175174257527,0.87642789073792948,0.92289815409734788,0.96761378338806203,1.0100751257168639,1.0509648406065297,1.0899091112239532,1.1273625470300053,1.1629710647693068,1.197275591485164,1.229981588487977,1.261403836016372,1.2912467131790379,1.3200483165771075,1.3474948181539068,1.373759412964241,1.3988929965148,1.422944272639737,1.4459598478789111,1.4679843217919963,1.4890603733834655,1.509228843805924,1.5285288155020567,1.5469976879385472,1.5646712500787294,1.5815837497344063,1.5977679599312262,1.6132552424162214,1.6280756084305708,1.642257776865355,1.6558292299129951,1.6688162663222204,1.6812440523597565,1.6931366705774944,1.7045171664796359,1.7154075931802497,1.725829054137775,1.7358017440492823,1.7453449879837393,1.7544772788301095,1.7632163131328562,1.7715790253842885,1.7795816208402042,1.7872396069224203,1.7945678232690387,1.801580470490683,1.808291137688429,1.8147128287867502,1.8208579877325122,1.8267385226088393,1.832365828710588,1.8377508106261369,1.842903903368289,1.8478350925952289,1.8525539339607215,1.8570695716310495,1.861390756004569,1.8655258606682241]
["None - ele","None - ele",0,0,0,0,0,0,0,0,0,0,0,0,0,0,0,0,0,0,0,0,0,0,0,0,0,0,0,0,0,0,0,0,0,0,0,0,0,0,0,0,0,0,0,0,0,0,0,0,0,0,0,0,0,0,0,0,0,0,0,0,0,0,0,0,0,0,0,0,0,0,0]

{"sheet":"Com LU Table","index":15,"n_rows":32,"n_cols":16,"rows_kept":32,"cut":false,"hidden":true,"merged":[]}
[]
[null,null,"Compressed Air","Cooking","Cooling","Exterior Lighting","Heating","Hot Water","Indoor Lighting","Misc","Motors","Office Equipment","Process","Refrigeration","Ventilation","None"]
[null,"College","Commercial-college-AirComp","Commercial-college-Cook","Commercial-college-Cool","Commercial-college-ExtLight","Commercial-college-Heat","Commercial-college-HotWater","C-Unv-Lgt-LPD Int-All-All-C","Commercial-college-Misc","Commercial-college-Motors","Commercial-college-OffEquip","Commercial-college-Process","Commercial-college-Refrig","Commercial-college-Vent","None"]
[null,"Grocery","Commercial-Grocery-AirComp","Commercial-Grocery-Cook","Commercial-Grocery-Cool","Commercial-Grocery-ExtLight","Commercial-Grocery-Heat","Commercial-Grocery-HotWater","C-Gro-Lgt-LPD Int-All-All-C","Commercial-Grocery-Misc","Commercial-Grocery-Motors","Commercial-Grocery-OffEquip","Commercial-Grocery-Process","Commercial-Grocery-Refrig","Commercial-Grocery-Vent","None"]
[null,"Healthcare","Commercial-Healthcare-AirComp","Commercial-Healthcare-Cook","Commercial-Healthcare-Cool","Commercial-Healthcare-ExtLight","Commercial-Healthcare-Heat","Commercial-Healthcare-HotWater","C-Hos-Lgt-LPD Int-All-All-C","Commercial-Healthcare-Misc","Commercial-Healthcare-Motors","Commercial-Healthcare-OffEquip","Commercial-Healthcare-Process","Commercial-Healthcare-Refrig","Commercial-Healthcare-Vent","None"]
[null,"Lodging","Commercial-Lodging-AirComp","Commercial-Lodging-Cook","Commercial-Lodging-Cool","Commercial-Lodging-ExtLight","Commercial-Lodging-Heat","Commercial-Lodging-HotWater","C-Lod-Lgt-LPD Int-All-All-C","Commercial-Lodging-Misc","Commercial-Lodging-Motors","Commercial-Lodging-OffEquip","Commercial-Lodging-Misc","Commercial-Lodging-Refrig","Commercial-Lodging-Vent","None"]
[null,"Large Office","Commercial-large Office-AirComp","Commercial-large Office-Cook","Commercial-large Office-Cool","Commercial-large Office-ExtLight","Commercial-large Office-Heat","Commercial-large Office-HotWater","C-LOff-Lgt-LPD Int-All-All-C","Commercial-large Office-Misc","Commercial-large Office-Motors","Commercial-large Office-OffEquip","Commercial-large Office-Process","Commercial-large Office-Refrig","Commercial-large Office-Vent","None"]
[null,"Other","Commercial-Misc. Com-AirComp","Commercial-Misc. Com-Cook","Commercial-Misc. Com-Cool","Commercial-Misc. Com-ExtLight","Commercial-Misc. Com-Heat","Commercial-Misc. Com-HotWater","C-Oth-Lgt-LPD Int-All-All-C","Commercial-Misc. Com-Misc","Commercial-Misc. Com-Motors","Commercial-Misc. Com-OffEquip","Commercial-Misc. Com-Process","Commercial-Misc. Com-Refrig","Commercial-Misc. Com-Vent","None"]
[null,"Restaurant","Commercial-Resturant-AirComp","Commercial-Resturant-Cook","Commercial-Resturant-Cool","Commercial-Resturant-ExtLight","Commercial-Resturant-Heat","Commercial-Resturant-HotWater","C-Res-Lgt-LPD Int-All-All-C","Commercial-Resturant-Misc","Commercial-Resturant-Motors","Commercial-Resturant-OffEquip","Commercial-Resturant-Process","Commercial-Resturant-Refrig","Commercial-Resturant-Vent","None"]
[null,"Retail","Commercial-Retail-AirComp","Commercial-Retail-Cook","Commercial-Retail-Cool","Commercial-Retail-ExtLight","Commercial-Retail-Heat","Commercial-Retail-HotWater","C-Ret-Lgt-LPD Int-All-All-C","Commercial-Retail-Misc","Commercial-Retail-Motors","Commercial-Retail-OffEquip","Commercial-Retail-Process","Commercial-Retail-Refrig","Commercial-Retail-Vent","None"]
[null,"School","Commercial-School-AirComp","Commercial-School-Cook","Commercial-School-Cool","Commercial-School-ExtLight","Commercial-School-Heat","Commercial-School-HotWater","C-K12-Lgt-LPD Int-All-All-C","Commercial-School-Misc","Commercial-School-Motors","Commercial-School-OffEquip","Commercial-School-Process","Commercial-School-Refrig","Commercial-School-Vent","None"]
[null,"Small Office","Commercial-Small Office-AirComp","Commercial-Small Office-Cook","Commercial-Small Office-Cool","Commercial-Small Office-ExtLight","Commercial-Small Office-Heat","Commercial-Small Office-HotWater","C-SOff-Lgt-LPD Int-All-All-C","Commercial-Small Office-Misc","Commercial-Small Office-Motors","Commercial-Small Office-OffEquip","Commercial-Small Office-Process","Commercial-Small Office-Refrig","Commercial-Small Office-Vent","None"]
[null,"Warehouse","Commercial-not-refrig-warehouse-AirComp","Commercial-not-refrig-warehouse-Cook","Commercial-not-refrig-warehouse-Cool","Commercial-not-refrig-warehouse-ExtLight","Commercial-not-refrig-warehouse-Heat","Commercial-not-refrig-warehouse-HotWater","C-War-Lgt-LPD Int-All-All-C","Commercial-not-refrig-warehouse-Misc","Commercial-not-refrig-warehouse-Motors","Commercial-not-refrig-warehouse-OffEquip","Commercial-not-refrig-warehouse-Process","Commercial-not-refrig-warehouse-Refrig","Commercial-not-refrig-warehouse-Vent","None"]
[]
[]
[null,null,"How to lookup:"]
[null,null,"Select Sector","End Use","Load Profile"]
[null,null,"College","Cooling",{"$f":"INDEX(C3:O13, MATCH(C18, B3:B13, 0), MATCH(D18, C2:O2, 0))","v":"Commercial-college-Cool"}]
[]
[]
[null,null,"Compressed Air","Cooking","Cooling","Exterior Lighting","Heating","Hot Water","Indoor Lighting","Misc","Motors","Office Equipment","Process","Refrigeration","Ventilation"]
[null,"College",{"$f":"INDEX(ELE_AC,MATCH(C3,ELE_AC_LP,0),MATCH(10,ELE_AC_ML,0))","v":0.67264576475916416},0.66436101176864226,0.83009468284350629,0.74481499733462497,0.69015393086821386,0.68010152076103925,0.68399384883564418,0.66389573062492924,0.68544396786715933,0.63916971532317102,0.71214643297755842,0.60470726746208003,0.67594296408466203]
[null,"Grocery",{"$f":"INDEX(ELE_AC,MATCH(C4,ELE_AC_LP,0),MATCH(10,ELE_AC_ML,0))","v":0.64045872490068811},0.6143499387862168,0.83513067624947923,0.74207267817623612,0.71761201168474453,0.63679281352937045,0.62455728259139209,0.61608540650916099,0.63590277243360682,0.63426239283736707,0.66471392999130663,0.6055519066439905,0.6198049353104621]
[null,"Healthcare",{"$f":"INDEX(ELE_AC,MATCH(C5,ELE_AC_LP,0),MATCH(10,ELE_AC_ML,0))","v":0.59473990481860439},0.63182254968480556,0.76042493578322035,0.72940031839732211,0.60883880307518734,0.60018792745305027,0.61324564640972978,0.59830621964088482,0.59833224804810548,0.59948452689468046,0.60579459622610365,0.59689819469147132,0.6028298898623925]
[null,"Lodging",{"$f":"INDEX(ELE_AC,MATCH(C6,ELE_AC_LP,0),MATCH(10,ELE_AC_ML,0))","v":0.64889729138564478},0.68047080520009584,0.79795733565824845,0.7378456997375632,0.68158663182139301,0.6244825608475304,0.64834501487156304,0.64541023023648458,0.66589345034902159,0.61413502968228395,0.64541023023648458,0.60065612599877249,0.60832526514859897]
[null,"Large Office",{"$f":"INDEX(ELE_AC,MATCH(C7,ELE_AC_LP,0),MATCH(10,ELE_AC_ML,0))","v":0.60309300621650153},0.61699822377159363,0.7442122196885258,0.71351223599011215,0.64372197371505957,0.60064368148898528,0.635273233261198,0.60327852375526347,0.60769703299958777,0.60047253180078008,0.61654744965864783,0.59554606812626321,0.63039747482809283]
[null,"Other",{"$f":"INDEX(ELE_AC,MATCH(C8,ELE_AC_LP,0),MATCH(10,ELE_AC_ML,0))","v":0.61050279395110829},0.62756967699561883,0.83530619616938728,0.80559449434985764,0.79588002292693982,0.61472427772708671,0.6242335540124605,0.62335087155513413,0.61609988700423801,0.61173563298702249,0.60742568702897026,0.60010569977513006,0.63995442946503067]
[null,"Restaurant",{"$f":"INDEX(ELE_AC,MATCH(C9,ELE_AC_LP,0),MATCH(10,ELE_AC_ML,0))","v":0.64988607776837592},0.68118736529591672,0.82356824012082508,0.77752756827771163,0.85438177536218918,0.62880603186692485,0.67591375993873615,0.67091246132505267,0.64952468709724376,0.66348369720739586,0.60176142847748992,0.60159538776814248,0.64831939390825399]
[null,"Retail",{"$f":"INDEX(ELE_AC,MATCH(C10,ELE_AC_LP,0),MATCH(10,ELE_AC_ML,0))","v":0.6164788912416288},0.62478999329537621,0.85571960543117798,0.79155175599180272,0.83718312893137314,0.61282820807870297,0.62624634763645759,0.62713128582173805,0.62754652085421858,0.61650277306344303,0.64807832927487208,0.59915980137127534,0.65225280851278444]
[null,"School",{"$f":"INDEX(ELE_AC,MATCH(C11,ELE_AC_LP,0),MATCH(10,ELE_AC_ML,0))","v":0.60605533176028448},0.62684629552742777,0.66482112967950691,0.7603095605948258,0.84689093818123418,0.60160683597600351,0.61975293612408167,0.60775562402882355,0.6130267691882072,0.59658993848197128,0.65423253330776088,0.59454689629379276,0.63831537494690083]
[null,"Small Office",{"$f":"INDEX(ELE_AC,MATCH(C12,ELE_AC_LP,0),MATCH(10,ELE_AC_ML,0))","v":0.59772122046738874},0.61268989830721932,0.75790720825080582,0.74350765583173806,0.91221100576277714,0.59862025429874421,0.6424699375521058,0.60960732006912444,0.60864542998344773,0.60452910568155105,0.62136935705588081,0.59382841763491889,0.66204532942077232]
[null,"Warehouse",{"$f":"INDEX(ELE_AC,MATCH(C13,ELE_AC_LP,0),MATCH(10,ELE_AC_ML,0))","v":0.64908751290573163},0.6320263604364037,0.91294913079528339,0.74843371849405627,1.0747958548051344,0.62230192215119684,0.64708109145881898,0.65052335853642029,0.64051516678484888,0.62867707623891989,0.73670396791219261,0.60608666416031276,0.671268647990788]

{"sheet":"Common Rates","index":16,"n_rows":19,"n_cols":13,"rows_kept":19,"cut":false,"hidden":true,"merged":[[14,1,14,3],[1,1,1,5],[1,7,1,11],[4,11,5,11],[7,1,7,3],[7,7,7,11],[10,11,11,11]]}
[null,"Source:","\\\\Etoo.org\\home\\Groups\\Planning\\Reporting\\Common Assumptions\\Commonly Used Assumptions_2023.xlsx"]
[null,"Blended Utility Rates",null,null,null,null,null,"Water and Waste Water Cost & Energy Intensity Oregon "]
[null,null,"Electric (/kWh) "," Gas (/therm) "," NWN-WA Gas (/therms)","Date Updated",null,"Rate","Units","Blended rates for water and sewer ","Date Updated","When to use","The energy savings related to the treatment reduction on the wastewater and water treatment plants is taken into account at a rate of 3.68 kWh/1000 gallons, which is consistent with the Northwest Power and Conservation Council’s 7th power plan assumptions."]
[null,"Residential ",0.12336719681327687,1.2238430303714245,1.2162999999999999," 11/2022",null,"Combined Water Rate","$/1000 gal",20.156375223999994," 11/2022","Use this row for gas only territory measures"]
[null,"Commercial ",7.9706942826138716E-2,1.1793942982063783,1.25038," 11/2022",null,"Combined Water Rate, net of Embedded Electricity","$/1000 gal",19.70638710549629," 11/2022","Use these rows for electric only and dual fuel territory measures"]
[null,"Industrial",5.4821493570055987E-2,1.0953614192871028,1.22899," 11/2022",null,"Embedded energy","kWh/1000 gal",3.68," 11/2022"]
[]
[null,"Clark PUD Electric Rates (for use in valuing ELE NEBs in gas measures)",null,null,null,null,null,"Water and Waste Water Cost & Energy Intensity Washington "]
[null,"Sector","Rate (/kwh)","Date Updated",null,null,null,"Rate","Units","Blended rates for water and sewer ","Date Updated","When to use"]
[null,"Commercial",7.6999999999999999E-2,"2022-11-01",null,null,null,"Combined Water Rate","$/1000 gal",12.044567999999998,"2022-11-01","Use this row for gas only territory measures"]
[null,"Industrial",{"$f":"(0.0491+0.0438)/2","v":4.6449999999999998E-2},"2022-11-01",null,null,null,"Combined Water Rate, net of Embedded Electricity","$/1000 gal",10.97,"12/16/202","These are not used as there is no electric territory in Washington"]
[null,"Residential",8.1600000000000006E-2,"2022-11-01",null,null,null,{"$f":"H6","v":"Embedded energy"},{"$f":"I6","v":"kWh/1000 gal"},3.68," 11/2022"]
[null,"Source","https://www.clarkpublicutilities.com/about-cpu/public-documents/current-electric-water-rates/"]
[]
[null,"Propane and Fuel Oil NEB"]
[null,"Fuel Type"," Gas (/therm equivalent) ","Date Updated"]
[null,"Propane",3.0140887508687007,"2023-01-05"]
[null,"Fuel Oil",3.3478005080893167,"2023-01-05"]
[null,"Source","2023 Commonly Used Assumptions (sharepoint.com)"]